date,first_name,last_name,gender,age,height
2018-08-10,Correna,Denisyuk,Female,35,186
2018-08-28,Noelani,Ert,Female,23,184
2018-08-12,Arnuad,Becerra,Male,27,191
2018-08-10,Lida,Fowls,Female,37,178
2018-08-15,Tabor,Perham,Male,44,181
2018-08-09,Wes,O'Breen,Male,35,187
2018-08-05,Maire,Bartosiak,Female,46,179
2018-08-08,Barrie,Acock,Male,46,177
2018-08-19,Iolanthe,Wingeatt,Female,28,172
2018-08-31,Nellie,Littlefield,Female,37,177
2018-08-17,Ingemar,de Quincey,Male,24,195
2018-08-27,Clarita,Pitbladdo,Female,41,171
2018-08-30,Dov,Musgrove,Male,31,183
2018-08-28,Hasheem,Charlot,Male,35,180
2018-08-23,Rubina,Nern,,35,181
2018-08-10,Yorgo,Trevethan,Male,35,195
2018-08-20,Todd,Routh,,30,178
2018-08-04,Edgardo,Mainz,Male,28,187
2018-08-18,Corbie,Harrald,Male,43,189
2018-08-25,Emelen,Kyston,Male,26,192
2018-08-26,Raphaela,Wellbelove,Female,38,172
2018-08-26,Martguerita,Filer,Female,47,182
2018-08-04,Eveline,Teggart,Female,51,167
2018-08-14,Marty,Roath,Female,42,168
2018-08-22,Lavina,Maundrell,Female,32,172
2018-08-24,Sheff,Maylam,Male,25,180
2018-08-30,Sorcha,Pleasance,,35,194
2018-08-19,Damon,Scarf,Male,27,190
2018-08-24,Teodora,Roset,Female,26,178
2018-08-27,Mortie,Beggs,Male,32,183
2018-08-24,Siward,Dybell,Male,26,178
2018-08-08,Evan,Uccello,Male,42,180
2018-08-01,Paulina,Gayton,Female,49,183
2018-08-28,Jaquenette,Jekel,Female,41,176
2018-08-10,Keith,Olenichev,Male,38,184
2018-08-05,Quintus,Wychard,Male,49,184
2018-08-04,Ario,Jozwiak,Male,35,194
2018-08-02,Robinet,Crim,Female,41,168
2018-08-23,Vin,Dansie,Male,28,194
2018-08-15,Levi,Matteoli,Male,28,188
2018-08-03,Hadria,Boncoeur,Female,44,172
2018-08-26,Ray,Jeffries,Female,35,169
2018-08-21,Mortimer,Cristofalo,Male,43,179
2018-08-03,Nerta,Malenoir,Female,35,176
2018-08-21,Mabelle,Waumsley,Female,35,170
2018-08-09,Liv,Gahan,Female,48,179
2018-08-09,Olga,Pawlowicz,Female,50,182
2018-08-29,Giffard,Rowdell,Male,48,194
2018-08-13,Pam,Hatry,Female,29,177
2018-08-04,Mina,Hardan,Female,34,175
2018-08-29,Cchaddie,Dummigan,Male,28,180
2018-08-22,Lydia,Dinse,Female,23,169
2018-08-26,Derick,Niset,Male,27,183
2018-08-23,Verene,Tozer,Female,34,176
2018-08-30,Willie,Denzey,Male,40,178
2018-08-27,Kilian,Petrelluzzi,Male,51,192
2018-08-06,Kerstin,Milmore,Female,36,179
2018-08-14,Garrick,France,Male,46,181
2018-08-03,Kellby,Dudding,Male,23,177
2018-08-23,Gertrude,Stean,Female,36,183
2018-08-05,Myrtie,Ludwell,Female,35,168
2018-08-26,Biddy,Felderer,Female,27,168
2018-08-16,Arley,Teodori,Male,36,181
2018-08-30,Clair,Laws,Female,51,175
2018-08-28,Jozef,Courvert,Male,33,182
2018-08-16,Amye,Cleveland,Female,22,172
2018-08-30,Conn,Schubert,Male,23,193
2018-08-03,Milton,Plumbley,Male,43,191
2018-08-14,Shanna,Channing,Female,24,173
2018-08-18,Dar,Stonhard,Male,36,196
2018-08-14,Briano,Titherington,Male,34,179
2018-08-18,Dody,Littlemore,Female,49,185
2018-08-05,Joyce,Vedishchev,Female,45,176
2018-08-09,Ruthi,Watson-Brown,Female,26,181
2018-08-01,Martino,Romeo,Male,22,184
2018-08-22,Jules,Brazel,Male,,186
2018-08-02,Ernesta,Wilkie,Female,32,167
2018-08-26,Riordan,Blockwell,Male,32,194
2018-08-08,Keir,Stephen,Male,49,193
2018-08-24,Amara,Nesbitt,Female,38,181
2018-08-14,Ogdon,Lomen,Male,41,187
2018-08-27,Yuri,Symper,Male,23,194
2018-08-31,Linus,Kosel,Male,27,192
2018-08-07,Efrem,Mouth,Male,31,186
2018-08-01,Glory,Belz,Female,37,168
2018-08-06,Sayre,Stollmeyer,Female,43,171
2018-08-05,Adeline,Eiler,Female,43,173
2018-08-01,Cesaro,Tevlin,Male,32,182
2018-08-13,Brose,Wheatley,Male,30,195
2018-08-17,Kerwinn,Orht,Male,39,191
2018-08-12,Kippie,Piccop,Female,25,172
2018-08-25,Dom,Blanchette,Male,44,193
2018-08-27,Sky,Kief,Male,22,194
2018-08-29,Clemmy,Blais,Female,41,169
2018-08-04,Liza,Toovey,Female,29,171
2018-08-28,Ruddie,Elnaugh,Male,38,185
2018-08-15,Anne,Filan,Female,51,180
2018-08-06,Karyn,Rickardsson,Female,43,186
2018-08-30,Thebault,Bartkowiak,Male,28,192
2018-08-14,Ulrich,Leggatt,Male,,193
2018-08-21,Dwight,Kitchaside,Male,30,186
2018-08-17,Bevin,Batstone,Male,25,183
2018-08-06,Paton,Cleveland,Male,39,181
2018-08-18,Lanny,Mole,Female,22,184
2018-08-10,Wendell,Mucklestone,Male,30,177
2018-08-15,Eilis,Travis,Female,46,182
2018-08-20,Pippa,Trevascus,Female,23,180
2018-08-14,Milt,Littlemore,Male,38,180
2018-08-08,Eadie,Milley,Female,22,169
2018-08-13,Forrester,Vallery,Male,22,180
2018-08-24,Clayton,Mation,Male,31,190
2018-08-31,Winny,Agent,Male,48,193
2018-08-16,Kirbee,Dudson,Female,34,174
2018-08-10,Katherina,Mallabar,Female,27,170
2018-08-09,Sarge,Sycamore,Male,36,190
2018-08-22,Georgetta,Saura,Female,50,182
2018-08-03,Shaughn,Inglesant,Male,47,177
2018-08-03,Jeane,Skally,Female,42,170
2018-08-03,Jerald,Tesh,Male,40,182
2018-08-06,Arly,McCreery,Female,40,184
2018-08-05,Cart,Maillard,Male,45,189
2018-08-30,Reginauld,Harburtson,Male,32,190
2018-08-23,Minnnie,Obray,Female,49,170
2018-08-21,Charlena,Uren,,34,187
2018-08-30,Mariska,Bayless,Female,22,173
2018-08-23,Tallie,Scarlet,Male,34,188
2018-08-29,Rooney,Perott,Male,29,196
2018-08-24,Jaye,Howler,Male,24,187
2018-08-26,Glen,Burton,Female,22,175
2018-08-29,Kevin,Makey,,36,192
2018-08-06,Byron,Jacobsz,Male,27,184
2018-08-07,Alix,Hatwell,Female,48,183
2018-08-17,Avril,Maffezzoli,Female,45,184
2018-08-03,Byrom,Readshall,Male,31,188
2018-08-10,Constantino,Eady,Male,44,196
2018-08-19,Kati,Gurnee,Female,34,175
2018-08-12,Vanya,Toxell,Male,45,196
2018-08-05,Haroun,Dochon,Male,25,179
2018-08-31,Marcille,Braunton,Female,50,185
2018-08-04,Niles,Lassetter,Male,33,189
2018-08-18,Sela,Daunay,Female,32,179
2018-08-31,Carmela,Wild,Female,27,180
2018-08-08,Jedediah,Minmagh,Male,39,187
2018-08-11,Frasquito,Wimbridge,Male,24,184
2018-08-29,Rickie,Ballister,Male,30,179
2018-08-19,Park,Raiker,Male,32,189
2018-08-01,Ninon,McLafferty,Female,34,181
2018-08-16,Arley,Lung,Male,29,183
2018-08-26,Kelsey,Seniour,Female,38,179
2018-08-08,Theresina,Loy,Female,32,179
2018-08-03,Birdie,Shimwell,Female,38,169
2018-08-03,Nataniel,Easby,Male,32,188
2018-08-18,Dino,Wauchope,Male,31,184
2018-08-28,Claretta,Greggor,Female,42,182
2018-08-09,Hali,Coy,Female,41,169
2018-08-29,Olin,Grove,Male,36,179
2018-08-09,Gino,Hassur,Male,46,186
2018-08-28,Tommie,Johananov,Male,27,179
2018-08-04,Vaughan,Dakin,Male,35,196
2018-08-03,Elsworth,Illiston,Male,28,188
2018-08-19,Stanislaw,Beamiss,Male,37,193
2018-08-19,Hyatt,Playle,Male,34,192
2018-08-09,Erv,Hanny,Male,23,195
2018-08-30,Morganne,Mattys,Female,22,169
2018-08-23,Gayleen,Domnick,Female,23,179
2018-08-03,Ileane,O' Dooley,Female,31,171
2018-08-20,Ephrem,Henderson,Male,31,182
2018-08-16,Kaleb,Dunbleton,Male,33,178
2018-08-06,Boot,Bullock,Male,38,193
2018-08-27,Eberto,Mollindinia,Male,31,195
2018-08-11,Virginie,Neagle,Female,34,181
2018-08-07,Megan,Chalk,Female,47,169
2018-08-15,Lorilee,Goodnow,Female,23,186
2018-08-09,Artair,Bouldon,Male,41,186
2018-08-17,Gusti,Louw,Female,38,173
2018-08-13,Kevina,Almak,Female,46,181
2018-08-30,Gideon,MacCurtain,Male,41,183
2018-08-05,Stepha,Canby,Female,46,170
2018-08-27,Rozella,Mosco,Female,29,168
2018-08-21,Evangelina,Ibbitt,Female,24,179
2018-08-03,Chadwick,Plail,Male,35,183
2018-08-01,Emlen,Cissell,Male,48,178
2018-08-28,Edd,Butcher,Male,27,188
2018-08-05,Orv,Smallthwaite,Male,50,183
2018-08-30,Buiron,Grieve,Male,32,185
2018-08-08,Ariadne,Maydway,Female,26,176
2018-08-23,Welby,Jocic,Male,48,194
2018-08-27,Obadiah,Kuscha,Male,29,195
2018-08-13,Genvieve,Storey,Female,,169
2018-08-01,Garrick,Beveredge,Male,25,177
2018-08-28,Tamma,Calladine,Female,24,178
2018-08-05,Fania,Reynoldson,Female,49,185
2018-08-12,Martina,Hanmer,Female,47,178
2018-08-08,Mead,Drains,Male,37,181
2018-08-28,Hagan,Izzard,Male,24,189
2018-08-25,Townie,Vernau,,40,191
2018-08-27,Korie,Yoslowitz,Female,24,173
2018-08-02,Abner,Mengue,Male,43,191
2018-08-30,Thorin,Venart,Male,35,177
2018-08-30,Haley,Eake,Male,50,184
2018-08-18,Aluin,Glavias,Male,48,185
2018-08-13,Clayton,Mothersdale,Male,45,181
2018-08-17,Olav,Bimson,Male,44,180
2018-08-24,Bartholemy,Sterre,Male,35,193
2018-08-21,Kaitlynn,Linay,Female,26,183
2018-08-13,Dasya,De Dantesie,Female,28,176
2018-08-06,Angel,Kissell,Male,46,182
2018-08-14,Brodie,Penn,Male,51,184
2018-08-21,Kendrick,Delaney,Male,45,182
2018-08-26,Caria,Chamberlain,Female,25,174
2018-08-13,Hulda,Redfield,Female,22,183
2018-08-21,Noak,Kilsby,Male,37,192
2018-08-20,Martynne,Alldre,Female,,173
2018-08-10,Blair,Debill,Male,30,177
2018-08-09,Sari,Chupin,Female,22,177
2018-08-12,Selinda,Liverseege,Female,29,176
2018-08-10,Johan,Hansell,Male,31,190
2018-08-15,Wallache,Heap,Male,33,179
2018-08-29,Rolfe,Gilliat,Male,50,181
2018-08-26,Lilly,Hackinge,Female,42,168
2018-08-25,Alisander,Turton,Male,33,194
2018-08-11,Doroteya,Amott,Female,45,170
2018-08-14,Glynnis,Freestone,Female,39,185
2018-08-14,Roth,Hellings,Male,46,184
2018-08-18,Rosanne,Roles,Female,23,172
2018-08-07,Roman,McWhannel,Male,37,196
2018-08-26,Jeromy,Segge,Male,49,192
2018-08-13,Ailbert,Avramovitz,Male,22,181
2018-08-20,Megen,Flowers,Female,32,183
2018-08-18,Homere,Bailess,Male,51,193
2018-08-29,Goldy,Adair,Female,25,185
2018-08-13,Stacee,Maystone,Female,35,180
2018-08-26,Land,Hissett,Male,22,184
2018-08-09,Fairleigh,Branney,Male,26,180
2018-08-03,Lamond,MacCaughey,Male,42,186
2018-08-24,Whitby,Felce,Male,32,186
2018-08-04,Frazer,Markwick,,29,184
2018-08-05,Claus,Childe,Male,36,196
2018-08-08,Shelba,Bakes,Female,40,177
2018-08-10,Cesya,Campkin,Female,40,175
2018-08-09,Garald,Pethick,,22,196
2018-08-23,Rossy,Force,Male,38,177
2018-08-08,Tristan,Zouch,Male,,189
2018-08-15,Siana,Miller,,37,190
2018-08-30,Dallas,Sherrott,Male,41,184
2018-08-22,Corri,McNeigh,Female,,178
2018-08-11,Frannie,Woodham,Female,45,168
2018-08-09,Heloise,Digance,Female,29,173
2018-08-20,Shirlene,Ezele,Female,24,186
2018-08-20,Egor,Stirrip,Male,22,196
2018-08-09,Dean,Fisher,Male,50,182
2018-08-01,Isaak,Aspole,Male,44,181
2018-08-03,Joana,Cristofari,Female,30,174
2018-08-18,Linnell,Rennels,Female,31,175
2018-08-15,Shep,Berriman,Male,37,188
2018-08-08,Katrinka,Joreau,Female,26,182
2018-08-21,Perl,Yeude,Female,34,176
2018-08-18,Fredi,Manus,Female,37,181
2018-08-04,Hurleigh,Dowry,Male,45,183
2018-08-02,Madeleine,Wickerson,Female,51,169
2018-08-09,Mufi,Courtonne,Female,37,186
2018-08-12,Perla,Beadle,,38,192
2018-08-15,Grace,Garforth,Female,24,175
2018-08-17,Dorris,Izakof,Female,50,167
2018-08-12,Eleen,Gallaher,Female,33,174
2018-08-31,Hugh,Conman,Male,46,191
2018-08-24,Clarissa,Garatty,Female,,176
2018-08-30,Henderson,Quarles,Male,29,186
2018-08-14,Cross,Klampt,Male,43,184
2018-08-14,Elvyn,Druett,Male,35,193
2018-08-26,Godfry,Croizier,Male,37,185
2018-08-18,Gus,Brydie,Female,31,170
2018-08-23,Meredeth,Brisley,Male,45,186
2018-08-26,Vale,Slatter,Male,40,180
2018-08-12,Kelley,Hentzer,Female,36,171
2018-08-02,Tripp,Whetland,Male,43,189
2018-08-29,Jaimie,McKevitt,Female,33,172
2018-08-12,Tremain,Kinnen,Male,28,187
2018-08-08,Oralee,McCaster,Female,41,180
2018-08-28,Demetris,Pindell,Male,25,183
2018-08-09,Lauretta,Yashin,Female,42,175
2018-08-28,Lannie,Tredinnick,Male,38,190
2018-08-18,Bastien,Breming,Male,36,190
2018-08-25,Sherman,Farrear,Male,49,183
2018-08-13,Ave,Fivey,Male,45,184
2018-08-18,Merla,Murney,Female,31,182
2018-08-21,Jessie,Duchart,Male,23,195
2018-08-27,Pen,Hartington,Male,32,192
2018-08-23,Brice,Arendsen,Male,24,194
2018-08-02,Doloritas,Ruf,Female,37,179
2018-08-28,Davidde,Davidofski,Male,35,184
2018-08-23,Cookie,Dawton,Female,26,167
2018-08-30,Bria,Keeler,Female,,178
2018-08-20,Latrina,Kibbee,,49,180
2018-08-31,Guthrie,Alyukin,Male,41,196
2018-08-16,Fritz,Treadgold,Male,45,177
2018-08-29,Ethel,Aberkirder,Female,45,172
2018-08-30,Beckie,Seamans,Female,31,181
2018-08-17,Kiah,Crennan,Female,30,167
2018-08-01,Jory,Culpen,,45,189
2018-08-26,Putnam,Labusch,Male,33,186
2018-08-21,Maximilianus,Urpeth,Male,27,183
2018-08-27,Roxanne,Hulland,Female,33,169
2018-08-04,Leopold,Lerhinan,Male,42,188
2018-08-17,Alexander,Swiffan,Male,51,179
2018-08-11,Katharine,Younghusband,Female,,172
2018-08-07,Tirrell,Nieass,Male,40,194
2018-08-11,Paule,Screaton,Female,49,173
2018-08-19,Kippy,Archdeckne,Male,43,192
2018-08-20,Rebbecca,Colmore,Female,36,182
2018-08-05,Lib,Warriner,Female,23,176
2018-08-19,Padgett,Brookbank,Male,26,194
2018-08-30,Buddy,Drable,Male,47,188
2018-08-03,Lila,Venard,Female,50,172
2018-08-14,Janek,Ketteman,Male,37,190
2018-08-11,Lorne,Dreakin,Male,42,177
2018-08-13,Salomon,Pankethman,Male,38,182
2018-08-28,Lorna,Ragsdale,Female,35,178
2018-08-07,Tim,Millins,Female,26,175
2018-08-16,Lincoln,Heibl,Male,44,180
2018-08-18,Ulrike,Domanek,Female,39,178
2018-08-05,Schuyler,Gilder,Male,24,194
2018-08-13,Meredith,Thys,Male,51,185
2018-08-02,Shelli,Alessandrucci,Female,37,178
2018-08-16,Brok,Mellon,Male,51,185
2018-08-19,Nedi,Granleese,Female,34,171
2018-08-30,Ginevra,Dobbs,Female,50,176
2018-08-17,Nikos,Abramin,Male,46,193
2018-08-31,Anderson,Bullant,Male,29,178
2018-08-02,Ernestus,Scatchar,Male,29,177
2018-08-07,Phyllida,Blondell,Female,28,171
2018-08-27,Upton,Stearn,Male,28,179
2018-08-19,Franklin,Skinley,Male,34,178
2018-08-01,Veradis,Rubinowitz,Female,45,176
2018-08-25,Laraine,Wilbore,Female,49,175
2018-08-11,Layney,Ingrem,Female,45,186
2018-08-08,Maurice,Ferronel,Male,45,185
2018-08-19,Tracy,Castaner,Male,42,184
2018-08-14,Homer,Eccleston,Male,51,187
2018-08-03,Clarette,Scimonelli,Female,26,178
2018-08-03,Bibbie,Block,Female,48,174
2018-08-29,Roana,Barwell,Female,43,179
2018-08-01,Lannie,Hexum,Male,28,180
2018-08-14,Marthe,Farrall,Female,47,169
2018-08-14,Dorey,Petris,Female,46,177
2018-08-29,Mabel,Arenson,Female,31,182
2018-08-02,Lyon,Creboe,Male,38,180
2018-08-13,Florenza,Pancost,Female,39,172
2018-08-27,Star,Coyte,Female,38,180
2018-08-25,Romeo,Boutell,Male,28,195
2018-08-16,Howey,Clipson,Male,49,189
2018-08-18,Reid,Fortie,Male,44,185
2018-08-19,Noll,Bartolomivis,Male,45,181
2018-08-26,Celisse,Soall,Female,24,171
2018-08-07,Catha,Shilvock,Female,44,179
2018-08-30,Abagael,Hayford,Female,47,172
2018-08-28,Reagan,Recke,Male,27,181
2018-08-02,Alphard,O'Kynsillaghe,Male,31,188
2018-08-30,Dix,Dawkins,Female,31,176
2018-08-02,Darius,Weekly,Male,24,180
2018-08-16,Rudy,Keach,Male,46,190
2018-08-19,Netty,Deniset,,22,177
2018-08-30,Eachelle,Keers,Female,37,173
2018-08-27,Anna-diana,Leyband,Female,42,186
2018-08-21,Dedra,McKinie,Female,47,186
2018-08-02,Vail,Rodenhurst,Male,27,196
2018-08-12,Albie,Liston,Male,35,191
2018-08-04,Tansy,Guillet,Female,50,180
2018-08-03,Loria,Tabor,Female,35,182
2018-08-04,Brittan,Alexsandrev,,50,193
2018-08-02,Killy,Padefield,Male,38,177
2018-08-28,Lita,Pietz,Female,43,176
2018-08-25,Shanon,Froom,Female,51,176
2018-08-31,Oralia,Neill,Female,26,179
2018-08-17,Norman,Seiffert,Male,47,191
2018-08-15,Kinna,Cran,Female,,172
2018-08-15,Dulcie,Kirdsch,Female,31,184
2018-08-02,Tiler,Quilliam,,41,193
2018-08-06,Heriberto,Lomb,Male,35,177
2018-08-11,De witt,Hundley,Male,28,191
2018-08-16,Stanley,Eakin,Male,48,193
2018-08-04,Laryssa,Killock,Female,51,172
2018-08-12,Odessa,Bysshe,Female,29,176
2018-08-13,Gilligan,Ager,Female,50,184
2018-08-27,Marco,Daspar,Male,41,181
2018-08-10,Emelita,Thurling,Female,29,176
2018-08-28,Abner,Kemwall,Male,41,186
2018-08-19,Brandice,Fradson,Female,23,177
2018-08-31,Haven,Lindwasser,Male,25,181
2018-08-10,Aksel,Stott,Male,33,187
2018-08-16,Penrod,Leggan,Male,50,189
2018-08-02,Theo,Roskelly,Male,23,190
2018-08-04,Elsworth,Linnock,Male,32,187
2018-08-23,Maurie,Traviss,Male,51,179
2018-08-30,Duffy,McInally,Male,48,182
2018-08-18,Blaire,Walters,Female,49,169
2018-08-24,Freddie,Guisot,Female,31,172
2018-08-13,Robinson,Danielis,Male,30,194
2018-08-16,Aleece,Plett,Female,28,173
2018-08-08,Mendel,Sharply,Male,30,178
2018-08-04,Burlie,Marvell,Male,42,188
2018-08-23,Penn,Ortas,Male,36,178
2018-08-08,Dex,Clutten,Male,28,196
2018-08-27,Gwyn,Gatecliff,Female,25,181
2018-08-20,Kippy,Norledge,Male,34,186
2018-08-24,Sheila,Beavon,Female,32,182
2018-08-04,Pippo,Reddings,Male,40,184
2018-08-31,Bertram,Moncreiff,Male,48,194
2018-08-16,Shawn,Lambrick,Male,45,190
2018-08-30,Darrell,Paice,Male,43,177
2018-08-01,Reamonn,Milroy,Male,34,192
2018-08-14,Ulric,Goodere,Male,37,187
2018-08-11,Chandra,Matskiv,,28,181
2018-08-10,Kristo,Nosworthy,Male,35,195
2018-08-14,Talya,Lovell,Female,31,181
2018-08-05,Hamilton,Bilbie,Male,50,189
2018-08-04,Marsiella,Nibloe,Female,29,175
2018-08-23,Kaitlin,Wimms,Female,49,186
2018-08-05,Janela,Costy,Female,41,170
2018-08-02,Morlee,Wedmore.,Male,40,185
2018-08-07,Graig,Meakes,Male,44,181
2018-08-29,Taryn,Duffil,Female,43,176
2018-08-19,Charlotta,Bloodworth,Female,51,170
2018-08-05,Kanya,Monshall,Female,50,172
2018-08-22,Isahella,Guyot,Female,24,177
2018-08-26,Davidson,Grangier,Male,50,184
2018-08-26,Corny,Derisley,Female,24,174
2018-08-05,Lorry,Tregent,Female,42,174
2018-08-06,Kaitlin,Schroder,Female,27,170
2018-08-18,Leanor,Varcoe,Female,24,181
2018-08-05,Ashla,Staten,Female,43,183
2018-08-09,Myriam,Ivancevic,Female,29,178
2018-08-13,Chelsea,Beatty,Female,39,177
2018-08-12,Evonne,Bickley,Female,39,180
2018-08-19,Myrvyn,Stuchbury,Male,29,194
2018-08-08,Greggory,Pilley,Male,25,193
2018-08-04,Bancroft,Lissandre,Male,46,177
2018-08-27,Emmery,Deverock,Male,22,177
2018-08-06,Sophia,Trundell,Female,24,180
2018-08-15,Carlina,Dinis,Female,39,185
2018-08-06,Gabbey,Sothern,Female,26,173
2018-08-24,Regen,Nevin,,45,190
2018-08-04,Mellie,Trowell,Female,44,183
2018-08-06,Rhodie,Smolan,Female,35,184
2018-08-27,Pyotr,Axon,Male,43,190
2018-08-07,Lacee,Baake,Female,41,179
2018-08-14,Travis,Roback,Male,30,192
2018-08-29,Ricky,Prescott,Female,32,169
2018-08-06,Hurlee,Tinto,Male,51,179
2018-08-04,Jamie,Boik,Male,23,177
2018-08-29,Winslow,Swaysland,Male,23,193
2018-08-11,Steffen,Frossell,Male,28,188
2018-08-13,Herbie,Rubenchik,Male,37,179
2018-08-16,Suellen,Stanislaw,Female,50,167
2018-08-14,Ann-marie,Tampin,Female,46,171
2018-08-09,Silvano,Ridoutt,Male,35,178
2018-08-02,Aleece,Paler,Female,46,184
2018-08-16,Maurie,Lorraine,Male,48,186
2018-08-17,Ransell,Timperley,Male,23,181
2018-08-09,Xaviera,Banstead,Female,51,168
2018-08-25,Filide,Yarker,Female,47,185
2018-08-07,Erhard,Cutmore,Male,45,187
2018-08-09,Brendon,Harnetty,Male,,181
2018-08-22,Welby,McNuff,Male,36,178
2018-08-10,Chaddy,Lippard,Male,43,195
2018-08-20,Sari,Lansly,Female,36,172
2018-08-17,Fina,Jordin,Female,26,170
2018-08-08,Barnaby,Duns,Male,29,192
2018-08-07,Zita,Piperley,Female,36,171
2018-08-10,Xena,Willwood,Female,31,176
2018-08-07,Siobhan,Hebbard,Female,23,177
2018-08-28,Barris,Grane,Male,22,192
2018-08-24,Curry,Menhci,Male,24,194
2018-08-12,Calley,Bailey,Female,33,180
2018-08-23,Lezley,Fache,Male,28,192
2018-08-10,Manny,Phillpotts,Male,25,184
2018-08-31,Margo,Riddles,Female,34,169
2018-08-03,Rozele,Coxall,Female,44,177
2018-08-04,Sandie,Ogelbe,Female,41,182
2018-08-04,Aggi,Humphries,Female,,177
2018-08-01,Claudie,Mainson,Female,26,183
2018-08-11,Elenore,Danielis,Female,41,184
2018-08-03,Alfy,Rings,Male,45,178
2018-08-04,Tanya,Peachey,Female,51,174
2018-08-13,Florentia,Erricker,Female,37,174
2018-08-31,Valentin,Haugen,Male,29,195
2018-08-05,Mirna,Itzak,Female,35,170
2018-08-17,Gloriane,Birdseye,Female,36,169
2018-08-30,Stacy,Macieiczyk,Male,,190
2018-08-24,Griselda,Molfino,Female,30,183
2018-08-18,Loreen,Romanski,Female,23,167
2018-08-03,Alis,Ralfe,Female,47,177
2018-08-22,Jacky,Hallaways,Female,49,171
2018-08-31,Lurette,Sheehy,Female,38,171
2018-08-14,Raphaela,McKelloch,Female,25,175
2018-08-01,Dyna,Amphlett,Female,43,174
2018-08-31,Codee,Gobert,Female,36,186
2018-08-23,Charlton,Strickland,Male,36,195
2018-08-15,Tades,McIndoe,Male,47,193
2018-08-07,Karlen,Keese,Female,43,177
2018-08-26,Bruno,Ebbetts,Male,38,186
2018-08-18,Ethel,Huban,Female,48,171
2018-08-14,Mathias,Davenhill,Male,23,186
2018-08-08,Hastie,Randall,,32,184
2018-08-30,Nelli,Wiersma,Female,24,180
2018-08-02,Shepard,Nutman,Male,41,196
2018-08-24,Darby,Sparey,Male,26,178
2018-08-31,Cloe,Odgaard,Female,22,179
2018-08-11,Freddie,Shillabeare,Male,49,187
2018-08-22,Mercedes,Van Halle,Female,41,176
2018-08-27,Jolee,Doles,Female,46,182
2018-08-05,Chad,Teresi,Female,23,186
2018-08-29,Frazer,Shipway,Male,35,179
2018-08-22,Wynn,Mitchenson,Male,37,191
2018-08-24,Jewelle,Gosselin,Female,27,169
2018-08-27,Mason,Barford,Male,26,187
2018-08-20,Umeko,McOrkil,Female,38,178
2018-08-01,Crawford,Torrie,Male,32,189
2018-08-22,Jacquie,Rzehor,Female,26,170
2018-08-01,Sherlock,Dalli,Male,26,183
2018-08-29,Lockwood,Sabatini,Male,37,183
2018-08-15,Malynda,Brion,Female,25,179
2018-08-12,Iorgo,Maltman,Male,30,177
2018-08-14,Nikolaus,Josham,Male,32,195
2018-08-21,Jud,Rowston,Male,43,178
2018-08-25,Cinderella,Allabarton,Female,39,175
2018-08-26,Claudius,Keemar,Male,49,187
2018-08-10,Tiena,Ludovico,Female,41,171
2018-08-12,Emmalee,Cowlin,Female,25,182
2018-08-14,Josefina,Danielsen,Female,39,181
2018-08-04,Cully,Camies,Male,36,183
2018-08-27,Billie,Patry,Male,24,179
2018-08-22,Bud,Camosso,Male,44,196
2018-08-23,Drake,Girdlestone,Male,32,177
2018-08-29,Gradeigh,Najera,Male,43,178
2018-08-12,Emmit,Maywood,Male,35,184
2018-08-03,Jae,Kean,Male,33,181
2018-08-13,Joshua,Bradburn,Male,29,181
2018-08-04,Hall,Kingscote,Male,24,179
2018-08-26,Angie,Local,Female,25,178
2018-08-10,Stacy,Batho,Male,44,192
2018-08-11,Lotti,Favell,Female,49,174
2018-08-02,Michel,Rowlings,Female,32,186
2018-08-19,Georgeanna,Keers,Female,50,180
2018-08-14,Udale,Crimmins,Male,46,183
2018-08-27,Caspar,Owttrim,Male,51,188
2018-08-16,Colby,Plumbridge,Male,28,184
2018-08-08,Erica,Filkin,Female,40,177
2018-08-21,Davon,Patel,Male,27,182
2018-08-26,Pierette,Ormerod,Female,,169
2018-08-22,Armando,Starmont,Male,35,191
2018-08-11,Vladimir,Mathers,Male,43,183
2018-08-13,Elberta,O'Crevy,Female,50,176
2018-08-21,Niel,Glacken,Male,36,181
2018-08-29,Garwin,Brimble,Male,41,187
2018-08-29,Christoforo,Norster,Male,42,191
2018-08-18,Melany,Ryland,Female,29,177
2018-08-05,Reba,Menel,Female,22,170
2018-08-10,Nadya,Schutte,Female,36,181
2018-08-22,Nanice,Rotherforth,Female,33,180
2018-08-30,Toddie,Bloodworth,Male,24,180
2018-08-26,Nigel,Northbridge,Male,35,195
2018-08-29,Townie,Groomebridge,Male,46,178
2018-08-08,Brion,Grigoriev,Male,22,178
2018-08-17,Dionisio,Pynner,Male,47,189
2018-08-27,Roman,Tubbs,Male,37,179
2018-08-07,Nye,Lezemere,Male,35,184
2018-08-28,Brooke,Worsfield,Female,49,168
2018-08-02,Klaus,Temple,Male,49,195
2018-08-17,Ibbie,Folca,,30,184
2018-08-23,Adey,Lerway,Female,45,175
2018-08-05,Birgit,McRobert,Female,50,169
2018-08-02,Nero,Girodier,Male,30,182
2018-08-10,Donall,Elsmor,Male,31,184
2018-08-09,Estrellita,Hendriksen,Female,37,182
2018-08-29,Daphene,Grafom,Female,47,173
2018-08-13,Yorgo,Rummer,Male,24,190
2018-08-29,Ceciley,Hathway,Female,48,177
2018-08-19,Mufinella,Kingsmill,Female,41,167
2018-08-23,Reggie,Bonelle,Male,40,187
2018-08-09,Suzann,Klaaassen,Female,28,167
2018-08-06,Kean,Doblin,Male,44,178
2018-08-11,Rosella,Kilcoyne,Female,22,181
2018-08-09,Kippy,Officer,Female,25,181
2018-08-17,Natalie,Claricoats,Female,48,182
2018-08-28,Lea,Farbrace,Female,51,171
2018-08-30,Prissie,Ubsdall,Female,34,177
2018-08-16,Norton,Pentecost,Male,45,183
2018-08-23,Elijah,Accomb,Male,30,180
2018-08-04,Iggie,Pinar,Male,47,182
2018-08-15,Isabelita,Amburgy,Female,29,167
2018-08-12,Laurice,Foucard,Female,44,180
2018-08-14,Garrek,Mariolle,Male,36,185
2018-08-21,Deidre,Caldero,Female,50,174
2018-08-30,Adara,Kittman,Female,46,182
2018-08-14,Diannne,Farfull,Female,31,183
2018-08-18,Alika,Scrowton,Female,47,184
2018-08-14,Sue,Apfel,Female,38,170
2018-08-02,Rudyard,De Robertis,Male,29,190
2018-08-28,Marshal,Jarvie,Male,44,187
2018-08-06,Eleanora,Woolaston,Female,24,186
2018-08-15,Eustacia,Aujouanet,Female,40,174
2018-08-26,Errick,Brabben,Male,48,189
2018-08-16,Marybeth,Dumberrill,Female,42,177
2018-08-22,Freedman,Roskrug,Male,44,196
2018-08-08,Natal,Rate,Male,29,181
2018-08-04,Willi,Gradwell,Female,42,184
2018-08-09,Cyrillus,Shergold,Male,27,192
2018-08-24,Earl,Weich,Male,47,196
2018-08-24,Lyon,Reily,Male,47,185
2018-08-23,Ximenes,Morrall,Male,34,192
2018-08-01,Cassandry,Pollack,Female,42,168
2018-08-30,Dilan,Baldin,Male,39,185
2018-08-04,Ealasaid,Henrichsen,Female,23,177
2018-08-05,Loni,Brimner,Female,25,173
2018-08-06,Hillary,Bimson,Female,51,169
2018-08-30,Staci,Krystek,Female,40,172
2018-08-19,Valeda,Orpwood,Female,32,171
2018-08-01,Raven,Errichelli,Female,23,170
2018-08-03,Ellwood,Kupec,Male,28,196
2018-08-11,Forester,Thorneley,Male,38,184
2018-08-27,Quintilla,Sivess,Female,50,181
2018-08-25,Rube,Fansy,Male,43,192
2018-08-24,Hattie,O'Farris,Female,26,169
2018-08-20,Raymond,Inmett,Male,38,191
2018-08-27,Marianna,Gherarducci,Female,45,185
2018-08-14,Bonita,Demaid,Female,48,175
2018-08-17,Elton,Liddicoat,Male,38,187
2018-08-23,Leigh,Roots,Male,30,184
2018-08-02,Konstantin,Trett,Male,25,188
2018-08-16,Brittaney,Paal,Female,41,167
2018-08-19,Siward,List,Male,50,196
2018-08-05,Murdock,Boxell,Male,29,193
2018-08-13,Hazlett,Christian,Male,50,184
2018-08-28,Gilles,Silvester,Male,45,196
2018-08-23,Ibrahim,Glendzer,Male,33,182
2018-08-06,Bliss,Mandry,Female,43,171
2018-08-12,Burton,Gorgen,Male,31,195
2018-08-07,Livvyy,Gayforth,Female,51,184
2018-08-10,Halsy,Ducastel,Male,47,186
2018-08-12,Hannis,Isacke,Female,50,182
2018-08-22,Carley,Byart,Female,25,182
2018-08-11,Gina,Iorizzi,Female,34,183
2018-08-07,Danette,Pregal,Female,41,171
2018-08-08,Keri,Gambles,Female,34,181
2018-08-17,Niels,Bouller,Male,29,180
2018-08-19,Stu,O'Kinneally,Male,34,188
2018-08-08,Zelma,Mellon,Female,37,181
2018-08-01,Tommy,Sabin,Male,34,182
2018-08-19,Celestine,Syseland,Female,46,185
2018-08-19,Giacobo,Pracy,Male,30,196
2018-08-29,Willie,Zouch,Female,43,173
2018-08-24,Brennan,Bellsham,Male,24,184
2018-08-06,Mac,Handke,Male,31,181
2018-08-23,Rollin,Horley,Male,41,178
2018-08-13,Aldus,Stillmann,Male,24,183
2018-08-20,Catlaina,Blick,Female,50,184
2018-08-01,Karlotta,Krishtopaittis,Female,23,177
2018-08-01,Myrah,Torns,Female,47,181
2018-08-08,Fritz,Balharry,Male,40,189
2018-08-06,Dela,Rubi,Female,35,177
2018-08-16,Gerome,Fermoy,Male,50,188
2018-08-04,Bryant,McCoish,Male,33,182
2018-08-05,Skylar,Maffia,Male,46,184
2018-08-07,Storm,Jelk,Female,45,182
2018-08-17,Ellary,Spores,Male,22,179
2018-08-14,Corine,Marjoram,Female,24,168
2018-08-07,Holly,Cawsby,,34,178
2018-08-26,Phillipe,Bewshaw,Male,51,182
2018-08-13,Tomkin,Dayes,Male,37,191
2018-08-28,Hally,Theunissen,Female,51,176
2018-08-08,Corabel,Ducker,Female,38,172
2018-08-27,Jose,Crummy,Male,25,194
2018-08-28,Tirrell,Bullocke,Male,41,177
2018-08-08,Garreth,Aiskrigg,Male,37,189
2018-08-26,Lauritz,Holworth,Male,48,178
2018-08-05,Dosi,Lurcock,Female,38,172
2018-08-04,Ring,Burgiss,Male,45,192
2018-08-07,Rea,Belfrage,Female,26,169
2018-08-23,Symon,Churly,Male,50,189
2018-08-10,Florry,Gurner,Female,37,176
2018-08-15,Randal,Jozsika,Male,24,192
2018-08-17,Randal,Quadrio,Male,25,177
2018-08-15,Elmore,Seamark,Male,32,194
2018-08-26,Laryssa,Twiggins,Female,38,185
2018-08-21,Bastien,Jinkin,Male,26,182
2018-08-23,Steffen,Eliyahu,Male,31,184
2018-08-13,Jerry,Shiel,Female,26,181
2018-08-10,Edythe,Bagnal,Female,48,179
2018-08-17,Sianna,Gonoude,Female,31,172
2018-08-10,Tildi,Clegg,Female,24,177
2018-08-16,Kirsten,Lunbech,Female,24,175
2018-08-21,Reeba,Jirusek,Female,23,177
2018-08-03,Carlen,Gunstone,,,190
2018-08-16,Dacia,Baniard,Female,25,176
2018-08-31,Kristyn,MacCambridge,Female,26,175
2018-08-29,Marcel,Mannooch,Male,28,181
2018-08-04,Lilla,Browse,Female,26,180
2018-08-13,Amerigo,Grave,Male,49,188
2018-08-13,Gwen,Kitchener,Female,41,176
2018-08-16,Clarence,Gall,Male,22,180
2018-08-24,Lyndsey,Yearron,Female,25,171
2018-08-09,Fernandina,Deville,Female,23,183
2018-08-29,Wayland,Zorzoni,Male,34,195
2018-08-21,Dorian,Shelford,Male,36,186
2018-08-28,Hoyt,Videneev,Male,24,180
2018-08-08,Lenette,Farrimond,Female,26,182
2018-08-28,Sigmund,Bolles,Male,,194
2018-08-22,Sharleen,MacCheyne,Female,38,183
2018-08-25,Lindie,McCuaig,Female,,185
2018-08-03,Anselm,Prigg,Male,24,189
2018-08-01,Marris,Lehrian,Female,29,172
2018-08-28,Elladine,Ruf,Female,47,185
2018-08-16,Kent,Boyde,Male,23,193
2018-08-17,Lorry,Sommerlin,Female,24,186
2018-08-22,Jourdan,Fritzer,Female,27,174
2018-08-24,Angel,Bridel,Female,47,185
2018-08-24,Nadean,Bartosek,Female,49,173
2018-08-16,Daryl,Zanetti,Male,51,189
2018-08-03,Ogdan,Bartosek,Male,40,192
2018-08-02,Belle,Mulgrew,Female,45,179
2018-08-29,Creighton,Ansley,Male,25,189
2018-08-18,Ailina,Voyce,Female,51,168
2018-08-27,Win,Dongate,Male,34,193
2018-08-03,Elna,Panyer,Female,38,168
2018-08-22,Hamilton,Killik,Male,24,182
2018-08-29,Jacquetta,Osmar,Female,30,181
2018-08-15,Jefferey,Ridpath,Male,25,183
2018-08-30,Nester,Dightham,Male,25,186
2018-08-01,Rikki,Sidon,Female,25,170
2018-08-24,Benn,Ector,Male,36,195
2018-08-24,Elsey,Haps,Female,35,180
2018-08-01,Ruddie,Huckle,Male,33,189
2018-08-18,Jillayne,Blader,Female,40,167
2018-08-02,Tamqrah,Miguet,Female,32,173
2018-08-17,Rod,Jacquemot,Male,27,189
2018-08-13,Conan,Easen,Male,35,184
2018-08-17,Ollie,McGrorty,Female,30,168
2018-08-06,Darrell,Easdon,Male,28,189
2018-08-18,Olympia,Caudwell,Female,34,173
2018-08-01,Matti,Deveril,Female,46,185
2018-08-15,Carmina,Oherlihy,Female,31,179
2018-08-29,Deane,Borg-Bartolo,Male,51,184
2018-08-31,Joceline,MacGiolla,Female,28,173
2018-08-14,Devlen,Posse,Male,35,196
2018-08-19,Jedediah,Elvey,Male,27,193
2018-08-19,Reinold,Hillaby,Male,24,194
2018-08-21,Robinet,Jendrys,Male,38,193
2018-08-20,Titos,Ganiclef,Male,34,189
2018-08-08,Elane,Cumesky,Female,25,171
2018-08-01,Daron,Capinetti,Female,25,172
2018-08-26,Merola,Getten,Female,32,183
2018-08-12,Charis,Armatage,Female,44,174
2018-08-26,Dena,Minshall,,48,195
2018-08-30,Pincus,Mantripp,Male,50,196
2018-08-19,Hewe,Simenet,Male,42,185
2018-08-24,Bobinette,Munkton,Female,22,175
2018-08-05,Torr,Jorczyk,Male,27,189
2018-08-29,Essie,Fermoy,Female,30,183
2018-08-23,Chery,Shipton,Female,38,176
2018-08-31,Georgianne,Helgass,Female,27,186
2018-08-01,Lura,Speer,Female,48,175
2018-08-28,Giovanni,Gobel,Male,25,184
2018-08-22,Giovanni,Ausiello,Male,37,193
2018-08-12,Courtnay,Moles,Male,37,179
2018-08-06,Lorianna,Blazewski,Female,31,167
2018-08-15,Selia,Loan,Female,29,184
2018-08-16,Lloyd,Pinshon,Male,40,182
2018-08-07,Correy,Roscam,Male,51,189
2018-08-14,Even,Briar,Male,34,190
2018-08-10,Nancee,Van Arsdall,Female,32,175
2018-08-26,Faustine,Giacopini,Female,29,167
2018-08-26,Christian,Baudinot,Female,30,184
2018-08-05,Celestia,Samworth,Female,43,174
2018-08-02,Lurlene,Croall,Female,30,168
2018-08-16,Mellicent,Tesdale,Female,49,185
2018-08-21,Nerti,Josiah,Female,26,184
2018-08-28,Christean,Burnyeat,Female,29,170
2018-08-12,Maura,Figge,Female,51,172
2018-08-06,Zacharia,Briggs,Male,29,193
2018-08-05,Vassili,Ewebank,Male,22,188
2018-08-30,Jaynell,Sevier,Female,29,168
2018-08-19,Justina,Dorrity,Female,41,183
2018-08-05,Abbey,Brandes,Male,31,177
2018-08-12,Maddy,Cordet,Male,35,182
2018-08-29,Etheline,Ahrens,Female,,173
2018-08-27,Caryl,Sliney,Male,41,180
2018-08-15,Rice,Morfell,Male,40,188
2018-08-28,Ambrosio,Cumbers,Male,24,180
2018-08-27,Gladys,Butchers,Female,23,177
2018-08-13,Gwyn,Swayte,Female,37,175
2018-08-18,Elene,Mayou,Female,40,168
2018-08-01,Shermie,Quincey,Male,41,182
2018-08-28,Clementius,Button,Male,42,178
2018-08-01,Adriena,McCoughan,Female,33,185
2018-08-27,Isis,Grantham,Female,29,178
2018-08-08,Dane,Mulvany,Male,37,188
2018-08-01,Tomi,Marskell,Female,43,170
2018-08-22,Aksel,Dybell,Male,38,194
2018-08-25,Lorenzo,Holt,Male,28,179
2018-08-30,Jonas,Westgate,Male,41,196
2018-08-11,Berkley,Sollett,Male,41,186
2018-08-22,Clemence,Jewer,Female,40,169
2018-08-19,Blithe,Marqyes,Female,43,176
2018-08-16,Carroll,Gleadle,Female,30,170
2018-08-01,Bertram,Persicke,Male,29,193
2018-08-14,Lorrayne,Jacobson,Female,29,174
2018-08-01,Doralynn,Botten,Female,32,174
2018-08-03,Delcina,Bownas,Female,42,172
2018-08-06,Waverly,Ericsson,Male,22,193
2018-08-10,Ricardo,Dulen,Male,33,181
2018-08-15,Lynna,Bloan,Female,48,185
2018-08-31,Zollie,Synnot,Male,23,193
2018-08-25,Devinne,Hucquart,Female,33,172
2018-08-13,Codi,Liccardi,Female,,186
2018-08-19,Gerry,Callingham,Male,25,192
2018-08-16,Nowell,Dunkerton,Male,38,193
2018-08-13,Bevan,Balshen,,24,181
2018-08-08,Nealson,Jouannisson,Male,41,188
2018-08-15,Sigfrid,Andreas,Male,38,192
2018-08-24,Theodoric,Thackeray,Male,38,183
2018-08-01,Deborah,Caldayrou,Female,47,167
2018-08-23,Nan,Whanstall,Female,33,180
2018-08-13,Rachele,Losty,Female,31,176
2018-08-11,Eileen,Davidde,Female,22,179
2018-08-15,Ellswerth,Fewster,Male,49,185
2018-08-30,Amanda,Sante,Female,34,167
2018-08-08,Dennis,Filipputti,Male,31,183
2018-08-01,Crystie,Siemons,Female,32,167
2018-08-01,Janine,Venn,Female,43,186
2018-08-11,Edgardo,Nibloe,Male,43,182
2018-08-14,Stefanie,Andreolli,Female,29,184
2018-08-17,Hakeem,Ivatt,Male,27,189
2018-08-23,Elicia,Hazeman,Female,30,175
2018-08-25,Flss,Branthwaite,Female,48,173
2018-08-29,Karole,Antonioni,Female,38,179
2018-08-12,Nap,Talks,Male,47,193
2018-08-14,Fabiano,Langshaw,Male,46,194
2018-08-04,Gratiana,Haward,Female,27,184
2018-08-05,Onfroi,Fontaine,Male,36,191
2018-08-15,Melloney,Djorevic,Female,45,182
2018-08-12,Bastian,Kuhne,Male,47,185
2018-08-23,Corinna,Spurgin,Female,36,169
2018-08-25,Thorpe,Balston,Male,41,190
2018-08-18,Gustav,Spelling,Male,49,181
2018-08-17,Lara,Doumic,Female,46,169
2018-08-13,Olenka,Gorman,Female,28,172
2018-08-01,Heywood,Scrauniage,Male,32,178
2018-08-09,Una,Hotchkin,Female,48,179
2018-08-02,Shelden,Schapero,Male,29,189
2018-08-16,Agata,Southerden,Female,26,168
2018-08-06,Torrin,Rosthorn,Male,46,187
2018-08-09,Glynis,Mathews,Female,32,186
2018-08-05,Lief,Stratford,Male,,192
2018-08-03,Leslie,Battisson,Male,41,186
2018-08-28,Audrie,Anger,,46,177
2018-08-13,Jessee,Bahl,Male,29,180
2018-08-23,Purcell,Mollen,Male,46,189
2018-08-23,Waly,Radnedge,Female,49,170
2018-08-31,Gare,Oliffe,Male,27,189
2018-08-16,Nollie,Mildmott,Female,32,184
2018-08-26,Antonin,Drewett,Male,27,192
2018-08-10,Amii,Wixey,Female,42,171
2018-08-11,Stacy,Monteith,Male,41,189
2018-08-01,Van,Kear,Female,32,176
2018-08-03,Marie,Vina,Female,23,186
2018-08-26,Celle,Hankins,Female,51,177
2018-08-24,Winnie,Humphery,Female,29,178
2018-08-13,Kean,Hadkins,,37,183
2018-08-04,Borden,Roberti,Male,33,182
2018-08-23,Kimmi,Medeway,Female,43,183
2018-08-08,Zach,Stempe,,34,193
2018-08-24,Shaw,Paynes,Male,41,181
2018-08-03,Rosemary,Prosek,Female,39,170
2018-08-29,Silvain,Connors,Male,39,178
2018-08-29,Franny,Gueny,Female,43,171
2018-08-29,Elmore,Poppy,Male,26,193
2018-08-31,Mignonne,Ratnege,Female,26,184
2018-08-17,Christiane,Andreoletti,Female,50,172
2018-08-20,Bronson,Fellgate,Male,26,178
2018-08-05,Aristotle,Silkston,Male,34,186
2018-08-17,Celene,Cammis,Female,42,178
2018-08-15,Stanwood,Parkisson,Male,27,182
2018-08-19,Ethelred,Runciman,Male,31,182
2018-08-13,Mychal,Stitle,Male,45,178
2018-08-17,Berrie,Cribbott,Female,24,177
2018-08-23,Andriana,Prescote,,36,178
2018-08-23,Kippie,Capsey,Male,47,178
2018-08-27,Muffin,Meenan,Female,34,168
2018-08-14,Tudor,Cheetham,Male,35,181
2018-08-03,Nevsa,Tyreman,Female,,179
2018-08-02,Willie,Pollicatt,Female,35,172
2018-08-05,Koren,Muzzall,Female,51,185
2018-08-19,Connie,Ellery,Female,51,178
2018-08-10,Vitoria,Connochie,Female,37,184
2018-08-04,Ford,Shorto,Male,41,183
2018-08-25,Mildrid,Kernoghan,Female,36,172
2018-08-22,Marcy,Mettrick,Female,42,175
2018-08-17,Dorisa,Avrahamoff,Female,28,182
2018-08-10,Hallsy,Brogden,Male,22,191
2018-08-12,Calvin,Inkle,Male,49,179
2018-08-07,Bradford,Dorkin,Male,26,192
2018-08-04,Ricard,Witterick,Male,24,180
2018-08-21,Carmelita,Matson,Female,46,175
2018-08-06,Jamil,Macallam,Male,26,183
2018-08-29,Michele,Goor,Male,27,196
2018-08-24,Ruthi,Tosney,Female,28,182
2018-08-09,Vally,Pikett,Female,40,167
2018-08-01,Dulsea,Cawthery,Female,50,174
2018-08-31,Dennie,Swettenham,Female,25,168
2018-08-07,Sean,Powderham,Male,37,179
2018-08-25,My,Whatford,Male,30,196
2018-08-10,Berkly,Helis,Male,35,191
2018-08-20,Lem,Douce,Male,23,183
2018-08-05,Glendon,Quibell,Male,30,195
2018-08-31,Brittney,Ducham,Female,35,185
2018-08-20,Gussy,Juan,Female,36,179
2018-08-18,Germana,Whitters,Female,51,173
2018-08-30,Tate,Hartright,Female,40,185
2018-08-27,Tami,Grayson,Female,26,177
2018-08-03,Shayla,Pharoah,Female,49,176
2018-08-27,Candra,Falls,Female,27,186
2018-08-26,Liliane,Feasby,Female,36,176
2018-08-26,Roana,Stothert,Female,35,179
2018-08-18,Moina,Axelbey,Female,48,167
2018-08-05,Kinny,Hinkley,Male,48,191
2018-08-11,Lisha,Kindleside,Female,39,174
2018-08-21,Cori,Brend,Male,25,180
2018-08-04,Georgette,Eltune,Female,49,178
2018-08-11,Alida,Clamp,,40,183
2018-08-01,Timmie,Gahagan,,41,179
2018-08-20,Frazier,Simioli,Male,43,178
2018-08-14,Rufus,Kittow,Male,26,184
2018-08-04,Dieter,Philpin,,48,184
2018-08-09,Sayers,Gilling,Male,25,181
2018-08-10,Perla,Franzoli,Female,40,174
2018-08-11,Waylon,Baalham,Male,25,177
2018-08-01,Ellynn,Maddin,Female,24,171
2018-08-27,Joan,Faye,Female,41,180
2018-08-28,Paulita,Bartolacci,Female,23,177
2018-08-02,Michael,Tindley,Male,51,185
2018-08-29,Leona,Boorer,Female,39,172
2018-08-28,Kennedy,Corteney,Male,,192
2018-08-06,Stormie,Conkling,Female,39,175
2018-08-17,Brnaba,Wasiela,Male,48,177
2018-08-31,Hertha,Jagson,Female,33,169
2018-08-30,Nolly,Shave,Male,50,183
2018-08-04,Gerhardine,Cassin,Female,27,183
2018-08-13,Madelina,Bockett,Female,32,182
2018-08-08,Brantley,O'Conor,Male,31,195
2018-08-25,Erinn,Embra,Female,50,173
2018-08-08,Jenni,Thurborn,Female,37,177
2018-08-31,Viki,Maes,Female,31,177
2018-08-24,Ronald,Pascho,Male,47,191
2018-08-23,Min,Pattini,Female,35,186
2018-08-26,Lynnea,MacTrusty,Female,41,183
2018-08-29,Rani,Marzelo,Female,40,182
2018-08-18,Adrea,Adamoli,Female,39,175
2018-08-25,Kincaid,Grummitt,Male,39,188
2018-08-13,Cherida,Jacox,Female,41,172
2018-08-09,Diane-marie,Tallman,Female,47,182
2018-08-26,Rhodie,Leare,Female,33,167
2018-08-18,Rozamond,Chazelle,Female,33,184
2018-08-10,Derk,Dowding,Male,39,177
2018-08-05,Sherilyn,Salvatore,Female,39,183
2018-08-31,Amandi,Faveryear,Female,30,183
2018-08-18,Gianna,Saylor,Female,33,172
2018-08-01,Bernita,Rudinger,Female,42,186
2018-08-02,Virgilio,Stoggell,Male,35,191
2018-08-20,Devin,Domel,Female,44,177
2018-08-30,Anita,Poley,Female,43,167
2018-08-08,Darcey,Farrall,Female,36,169
2018-08-15,Rik,Halle,Male,22,177
2018-08-22,Guthrie,Steed,Male,39,186
2018-08-23,Fields,Gately,Male,33,182
2018-08-26,Karine,Reddie,Female,42,167
2018-08-18,Yank,Browne,Male,43,191
2018-08-16,Meggie,Supple,Female,30,183
2018-08-28,Cymbre,Lamberti,Female,25,185
2018-08-21,Danyette,Havelin,Female,25,177
2018-08-25,Dareen,Clayborn,Female,38,185
2018-08-30,Sigfrid,Cuddy,Male,50,177
2018-08-19,Dyann,Pick,Female,35,167
2018-08-22,Beale,Vallack,Male,35,189
2018-08-23,Dal,Loughman,Male,29,190
2018-08-04,Nan,Tunsley,,47,187
2018-08-05,Drugi,Mountford,Male,48,183
2018-08-22,Cristobal,Kinder,Male,36,193
2018-08-18,Mavis,Munkley,Female,27,173
2018-08-07,Jareb,Shailer,Male,,194
2018-08-14,Chuck,Balderstone,Male,22,182
2018-08-31,Joye,Klemensiewicz,Female,34,176
2018-08-09,Shae,Martinson,Female,23,180
2018-08-19,Lory,Timbrell,Female,23,186
2018-08-06,Addie,Prickett,Male,43,180
2018-08-22,Codie,Bengefield,Male,46,179
2018-08-15,Sabrina,Skellern,Female,26,173
2018-08-08,Isabelle,Cranham,Female,25,173
2018-08-20,Giffy,Danilyuk,Male,25,180
2018-08-23,Ignace,Milazzo,Male,36,191
