{
  "$schema": "https://docs.renovatebot.com/renovate-schema.json",
  "extends": [
    "config:base"
  ],
  "reviewers": ["@savini_rs"],
  "gitlabci": {
    "automerge": true
  },
  "docker-compose": {
    "fileMatch": [
      "(^|/)(?:common|setup-devel|devel|test|staging|experimental|prod|)\\.ya?ml$"
    ]
  },
  "pip_requirements": {
    "fileMatch": [
      "requirements.txt$",
      "requirements-dev.txt$",
      "requirements-docs.txt$"
    ]
  },
  "pre-commit": {
    "enabled": true,
    "automerge": true
  },
  "packageRules": [
    {
      "groupName": "Pre-commit",
      "matchFiles": [".pre-commit-config.yaml"],
      "schedule": ["on the first day of the month"]
    }
  ]
}
