%YAML 1.1
%TAG !u! tag:unity3d.com,2011:
--- !u!74 &7400000
AnimationClip:
  m_ObjectHideFlags: 0
  m_CorrespondingSourceObject: {fileID: 0}
  m_PrefabInstance: {fileID: 0}
  m_PrefabAsset: {fileID: 0}
  m_Name: WalkingTower
  serializedVersion: 6
  m_Legacy: 0
  m_Compressed: 0
  m_UseHighQualityCurve: 1
  m_RotationCurves: []
  m_CompressedRotationCurves: []
  m_EulerCurves: []
  m_PositionCurves: []
  m_ScaleCurves: []
  m_FloatCurves: []
  m_PPtrCurves:
  - curve:
    - time: 0
      value: {fileID: 21300000, guid: 662d4d01fbbc5d348a5bb87d4c0ff38a, type: 3}
    - time: 0.016666668
      value: {fileID: 21300000, guid: 97cd8b4eecbc88740af43e21b57a8608, type: 3}
    - time: 0.033333335
      value: {fileID: 21300000, guid: a513948125eac4a4e813f67dda15de30, type: 3}
    - time: 0.05
      value: {fileID: 21300000, guid: d54a813249919684f84280de8f56c572, type: 3}
    - time: 0.06666667
      value: {fileID: 21300000, guid: 316904743c500a64abcaf02c9ac53897, type: 3}
    - time: 0.083333336
      value: {fileID: 21300000, guid: a8172139dcf27064ab87b534894b6f78, type: 3}
    - time: 0.1
      value: {fileID: 21300000, guid: 06001daaeac7dc243a2c4ec6a2b43a82, type: 3}
    - time: 0.11666667
      value: {fileID: 21300000, guid: 86ad72a3c897d0948ae2d65475a2299a, type: 3}
    - time: 0.13333334
      value: {fileID: 21300000, guid: 6db39881c6b3f98499665c441d918123, type: 3}
    - time: 0.15
      value: {fileID: 21300000, guid: 2a4bc899b24467c4db608273c5f5f9ec, type: 3}
    - time: 0.16666667
      value: {fileID: 21300000, guid: b4bb3bbeca6f14d46a3fcadd86c34890, type: 3}
    - time: 0.18333334
      value: {fileID: 21300000, guid: 39d70e41cd2ef364ea44ee551d8e2c3c, type: 3}
    - time: 0.2
      value: {fileID: 21300000, guid: 54dd43676d7df6a49bbe0ac57d120f4f, type: 3}
    - time: 0.21666667
      value: {fileID: 21300000, guid: c29e0c6c24ff0b6448237a0e6f0e92d6, type: 3}
    - time: 0.23333333
      value: {fileID: 21300000, guid: 5fc8c77ce6eb78d4ba59bcf5af8c890d, type: 3}
    - time: 0.25
      value: {fileID: 21300000, guid: 25c701a638cae2e4cb15a3e532390155, type: 3}
    - time: 0.26666668
      value: {fileID: 21300000, guid: f2da9dd6ff1b8d74a9931fb8a909bfd8, type: 3}
    - time: 0.28333333
      value: {fileID: 21300000, guid: 0c1bd612634ed6c40952e3ee2880dde4, type: 3}
    - time: 0.3
      value: {fileID: 21300000, guid: a93e27a3a689475429ec0946ad7f60b4, type: 3}
    - time: 0.31666666
      value: {fileID: 21300000, guid: 167811237a1b85d4fad541ca1231aea5, type: 3}
    - time: 0.33333334
      value: {fileID: 21300000, guid: 025b0739317728d4cb34e91ea451a2ce, type: 3}
    - time: 0.35
      value: {fileID: 21300000, guid: a1b8d92ec0e514f4ea773f7c939bd825, type: 3}
    - time: 0.36666667
      value: {fileID: 21300000, guid: 09e88ab0ce28cb940991d2dc4fc58497, type: 3}
    - time: 0.38333333
      value: {fileID: 21300000, guid: f05f4d29fe8dbdc4a8158fd7872f0fc6, type: 3}
    - time: 0.4
      value: {fileID: 21300000, guid: e96a7dda3f77b0645b80fd955c412705, type: 3}
    - time: 0.41666666
      value: {fileID: 21300000, guid: 27205e7de0dc22b48ac7cc610c35c302, type: 3}
    - time: 0.43333334
      value: {fileID: 21300000, guid: 2696e4d6e4c55764b850f994697f7623, type: 3}
    - time: 0.45
      value: {fileID: 21300000, guid: 548b0d8f4b4be2145bfe08c8eefdcb12, type: 3}
    - time: 0.46666667
      value: {fileID: 21300000, guid: 21a72f7e35b39e844b67c439ca2e33f0, type: 3}
    - time: 0.48333332
      value: {fileID: 21300000, guid: 489ee7149e34cbf488ccad12e985f05e, type: 3}
    - time: 0.5
      value: {fileID: 21300000, guid: 870de04c1d4462d4bb266f2bb1ed34ea, type: 3}
    - time: 0.51666665
      value: {fileID: 21300000, guid: af1a55150ee5a5f40ab87b6c21b27302, type: 3}
    - time: 0.53333336
      value: {fileID: 21300000, guid: 9ca06651a86ba504c9c0c7417cbb35f2, type: 3}
    - time: 0.55
      value: {fileID: 21300000, guid: bdc44b88c86fe18469458cdbe9cdea1f, type: 3}
    - time: 0.56666666
      value: {fileID: 21300000, guid: ec5f96d5d9b9b384a89b5d872d7bb34a, type: 3}
    - time: 0.5833333
      value: {fileID: 21300000, guid: 8fb4852680a0826419bc388c4a1e3c91, type: 3}
    - time: 0.6
      value: {fileID: 21300000, guid: 6e6b87e211e22f74693ef6aeafb376ab, type: 3}
    - time: 0.6166667
      value: {fileID: 21300000, guid: eb04232e76e70984cbd9e150247be370, type: 3}
    - time: 0.6333333
      value: {fileID: 21300000, guid: 512e9ea072bbd8744841a9585c935a14, type: 3}
    - time: 0.65
      value: {fileID: 21300000, guid: 79793899968a0094ca772847f5f3fc30, type: 3}
    - time: 0.6666667
      value: {fileID: 21300000, guid: 571090a81007dfe4a93dceb514a514d6, type: 3}
    - time: 0.68333334
      value: {fileID: 21300000, guid: 50c0924fa64e78b408334afe8a811500, type: 3}
    - time: 0.7
      value: {fileID: 21300000, guid: 88498d2eebf59a848a38149f18f4d22d, type: 3}
    - time: 0.71666664
      value: {fileID: 21300000, guid: 7c4b9ea3d94769642878a7c72a6d955d, type: 3}
    - time: 0.73333335
      value: {fileID: 21300000, guid: 8ad2cdb696e347f46adf5104c259c06d, type: 3}
    - time: 0.75
      value: {fileID: 21300000, guid: d1845382bc22d5749a154dd8a723f333, type: 3}
    - time: 0.76666665
      value: {fileID: 21300000, guid: ea5403291dedfca4d8fb7a97e63598d1, type: 3}
    - time: 0.78333336
      value: {fileID: 21300000, guid: 6de7cbb5d7711794fb9e4ad52f81abf7, type: 3}
    - time: 0.8
      value: {fileID: 21300000, guid: c5918b0bdbf6da34da7a52eabf6af3c2, type: 3}
    - time: 0.81666666
      value: {fileID: 21300000, guid: 4b2d757abf4514541a93c922a19e2cff, type: 3}
    attribute: m_Sprite
    path: 
    classID: 212
    script: {fileID: 0}
  m_SampleRate: 60
  m_WrapMode: 0
  m_Bounds:
    m_Center: {x: 0, y: 0, z: 0}
    m_Extent: {x: 0, y: 0, z: 0}
  m_ClipBindingConstant:
    genericBindings:
    - serializedVersion: 2
      path: 0
      attribute: 0
      script: {fileID: 0}
      typeID: 212
      customType: 23
      isPPtrCurve: 1
    pptrCurveMapping:
    - {fileID: 21300000, guid: 662d4d01fbbc5d348a5bb87d4c0ff38a, type: 3}
    - {fileID: 21300000, guid: 97cd8b4eecbc88740af43e21b57a8608, type: 3}
    - {fileID: 21300000, guid: a513948125eac4a4e813f67dda15de30, type: 3}
    - {fileID: 21300000, guid: d54a813249919684f84280de8f56c572, type: 3}
    - {fileID: 21300000, guid: 316904743c500a64abcaf02c9ac53897, type: 3}
    - {fileID: 21300000, guid: a8172139dcf27064ab87b534894b6f78, type: 3}
    - {fileID: 21300000, guid: 06001daaeac7dc243a2c4ec6a2b43a82, type: 3}
    - {fileID: 21300000, guid: 86ad72a3c897d0948ae2d65475a2299a, type: 3}
    - {fileID: 21300000, guid: 6db39881c6b3f98499665c441d918123, type: 3}
    - {fileID: 21300000, guid: 2a4bc899b24467c4db608273c5f5f9ec, type: 3}
    - {fileID: 21300000, guid: b4bb3bbeca6f14d46a3fcadd86c34890, type: 3}
    - {fileID: 21300000, guid: 39d70e41cd2ef364ea44ee551d8e2c3c, type: 3}
    - {fileID: 21300000, guid: 54dd43676d7df6a49bbe0ac57d120f4f, type: 3}
    - {fileID: 21300000, guid: c29e0c6c24ff0b6448237a0e6f0e92d6, type: 3}
    - {fileID: 21300000, guid: 5fc8c77ce6eb78d4ba59bcf5af8c890d, type: 3}
    - {fileID: 21300000, guid: 25c701a638cae2e4cb15a3e532390155, type: 3}
    - {fileID: 21300000, guid: f2da9dd6ff1b8d74a9931fb8a909bfd8, type: 3}
    - {fileID: 21300000, guid: 0c1bd612634ed6c40952e3ee2880dde4, type: 3}
    - {fileID: 21300000, guid: a93e27a3a689475429ec0946ad7f60b4, type: 3}
    - {fileID: 21300000, guid: 167811237a1b85d4fad541ca1231aea5, type: 3}
    - {fileID: 21300000, guid: 025b0739317728d4cb34e91ea451a2ce, type: 3}
    - {fileID: 21300000, guid: a1b8d92ec0e514f4ea773f7c939bd825, type: 3}
    - {fileID: 21300000, guid: 09e88ab0ce28cb940991d2dc4fc58497, type: 3}
    - {fileID: 21300000, guid: f05f4d29fe8dbdc4a8158fd7872f0fc6, type: 3}
    - {fileID: 21300000, guid: e96a7dda3f77b0645b80fd955c412705, type: 3}
    - {fileID: 21300000, guid: 27205e7de0dc22b48ac7cc610c35c302, type: 3}
    - {fileID: 21300000, guid: 2696e4d6e4c55764b850f994697f7623, type: 3}
    - {fileID: 21300000, guid: 548b0d8f4b4be2145bfe08c8eefdcb12, type: 3}
    - {fileID: 21300000, guid: 21a72f7e35b39e844b67c439ca2e33f0, type: 3}
    - {fileID: 21300000, guid: 489ee7149e34cbf488ccad12e985f05e, type: 3}
    - {fileID: 21300000, guid: 870de04c1d4462d4bb266f2bb1ed34ea, type: 3}
    - {fileID: 21300000, guid: af1a55150ee5a5f40ab87b6c21b27302, type: 3}
    - {fileID: 21300000, guid: 9ca06651a86ba504c9c0c7417cbb35f2, type: 3}
    - {fileID: 21300000, guid: bdc44b88c86fe18469458cdbe9cdea1f, type: 3}
    - {fileID: 21300000, guid: ec5f96d5d9b9b384a89b5d872d7bb34a, type: 3}
    - {fileID: 21300000, guid: 8fb4852680a0826419bc388c4a1e3c91, type: 3}
    - {fileID: 21300000, guid: 6e6b87e211e22f74693ef6aeafb376ab, type: 3}
    - {fileID: 21300000, guid: eb04232e76e70984cbd9e150247be370, type: 3}
    - {fileID: 21300000, guid: 512e9ea072bbd8744841a9585c935a14, type: 3}
    - {fileID: 21300000, guid: 79793899968a0094ca772847f5f3fc30, type: 3}
    - {fileID: 21300000, guid: 571090a81007dfe4a93dceb514a514d6, type: 3}
    - {fileID: 21300000, guid: 50c0924fa64e78b408334afe8a811500, type: 3}
    - {fileID: 21300000, guid: 88498d2eebf59a848a38149f18f4d22d, type: 3}
    - {fileID: 21300000, guid: 7c4b9ea3d94769642878a7c72a6d955d, type: 3}
    - {fileID: 21300000, guid: 8ad2cdb696e347f46adf5104c259c06d, type: 3}
    - {fileID: 21300000, guid: d1845382bc22d5749a154dd8a723f333, type: 3}
    - {fileID: 21300000, guid: ea5403291dedfca4d8fb7a97e63598d1, type: 3}
    - {fileID: 21300000, guid: 6de7cbb5d7711794fb9e4ad52f81abf7, type: 3}
    - {fileID: 21300000, guid: c5918b0bdbf6da34da7a52eabf6af3c2, type: 3}
    - {fileID: 21300000, guid: 4b2d757abf4514541a93c922a19e2cff, type: 3}
  m_AnimationClipSettings:
    serializedVersion: 2
    m_AdditiveReferencePoseClip: {fileID: 0}
    m_AdditiveReferencePoseTime: 0
    m_StartTime: 0
    m_StopTime: 0.8333333
    m_OrientationOffsetY: 0
    m_Level: 0
    m_CycleOffset: 0
    m_HasAdditiveReferencePose: 0
    m_LoopTime: 1
    m_LoopBlend: 0
    m_LoopBlendOrientation: 0
    m_LoopBlendPositionY: 0
    m_LoopBlendPositionXZ: 0
    m_KeepOriginalOrientation: 0
    m_KeepOriginalPositionY: 1
    m_KeepOriginalPositionXZ: 0
    m_HeightFromFeet: 0
    m_Mirror: 0
  m_EditorCurves: []
  m_EulerEditorCurves: []
  m_HasGenericRootTransform: 0
  m_HasMotionFloatCurves: 0
  m_Events: []
