%YAML 1.1
%TAG !u! tag:unity3d.com,2011:
--- !u!29 &1
OcclusionCullingSettings:
  m_ObjectHideFlags: 0
  serializedVersion: 2
  m_OcclusionBakeSettings:
    smallestOccluder: 5
    smallestHole: 0.25
    backfaceThreshold: 100
  m_SceneGUID: 00000000000000000000000000000000
  m_OcclusionCullingData: {fileID: 0}
--- !u!104 &2
RenderSettings:
  m_ObjectHideFlags: 0
  serializedVersion: 9
  m_Fog: 0
  m_FogColor: {r: 0.5, g: 0.5, b: 0.5, a: 1}
  m_FogMode: 3
  m_FogDensity: 0.01
  m_LinearFogStart: 0
  m_LinearFogEnd: 300
  m_AmbientSkyColor: {r: 0.212, g: 0.227, b: 0.259, a: 1}
  m_AmbientEquatorColor: {r: 0.114, g: 0.125, b: 0.133, a: 1}
  m_AmbientGroundColor: {r: 0.047, g: 0.043, b: 0.035, a: 1}
  m_AmbientIntensity: 1
  m_AmbientMode: 3
  m_SubtractiveShadowColor: {r: 0.42, g: 0.478, b: 0.627, a: 1}
  m_SkyboxMaterial: {fileID: 0}
  m_HaloStrength: 0.5
  m_FlareStrength: 1
  m_FlareFadeSpeed: 3
  m_HaloTexture: {fileID: 0}
  m_SpotCookie: {fileID: 10001, guid: 0000000000000000e000000000000000, type: 0}
  m_DefaultReflectionMode: 0
  m_DefaultReflectionResolution: 128
  m_ReflectionBounces: 1
  m_ReflectionIntensity: 1
  m_CustomReflection: {fileID: 0}
  m_Sun: {fileID: 0}
  m_IndirectSpecularColor: {r: 0, g: 0, b: 0, a: 1}
  m_UseRadianceAmbientProbe: 0
--- !u!157 &3
LightmapSettings:
  m_ObjectHideFlags: 0
  serializedVersion: 12
  m_GIWorkflowMode: 1
  m_GISettings:
    serializedVersion: 2
    m_BounceScale: 1
    m_IndirectOutputScale: 1
    m_AlbedoBoost: 1
    m_EnvironmentLightingMode: 0
    m_EnableBakedLightmaps: 0
    m_EnableRealtimeLightmaps: 0
  m_LightmapEditorSettings:
    serializedVersion: 12
    m_Resolution: 2
    m_BakeResolution: 40
    m_AtlasSize: 1024
    m_AO: 0
    m_AOMaxDistance: 1
    m_CompAOExponent: 1
    m_CompAOExponentDirect: 0
    m_ExtractAmbientOcclusion: 0
    m_Padding: 2
    m_LightmapParameters: {fileID: 0}
    m_LightmapsBakeMode: 1
    m_TextureCompression: 1
    m_FinalGather: 0
    m_FinalGatherFiltering: 1
    m_FinalGatherRayCount: 256
    m_ReflectionCompression: 2
    m_MixedBakeMode: 2
    m_BakeBackend: 0
    m_PVRSampling: 1
    m_PVRDirectSampleCount: 32
    m_PVRSampleCount: 500
    m_PVRBounces: 2
    m_PVREnvironmentSampleCount: 500
    m_PVREnvironmentReferencePointCount: 2048
    m_PVRFilteringMode: 2
    m_PVRDenoiserTypeDirect: 0
    m_PVRDenoiserTypeIndirect: 0
    m_PVRDenoiserTypeAO: 0
    m_PVRFilterTypeDirect: 0
    m_PVRFilterTypeIndirect: 0
    m_PVRFilterTypeAO: 0
    m_PVREnvironmentMIS: 0
    m_PVRCulling: 1
    m_PVRFilteringGaussRadiusDirect: 1
    m_PVRFilteringGaussRadiusIndirect: 5
    m_PVRFilteringGaussRadiusAO: 2
    m_PVRFilteringAtrousPositionSigmaDirect: 0.5
    m_PVRFilteringAtrousPositionSigmaIndirect: 2
    m_PVRFilteringAtrousPositionSigmaAO: 1
    m_ExportTrainingData: 0
    m_TrainingDataDestination: TrainingData
    m_LightProbeSampleCountMultiplier: 4
  m_LightingDataAsset: {fileID: 0}
  m_LightingSettings: {fileID: 0}
--- !u!196 &4
NavMeshSettings:
  serializedVersion: 2
  m_ObjectHideFlags: 0
  m_BuildSettings:
    serializedVersion: 2
    agentTypeID: 0
    agentRadius: 0.5
    agentHeight: 2
    agentSlope: 45
    agentClimb: 0.4
    ledgeDropHeight: 0
    maxJumpAcrossDistance: 0
    minRegionArea: 2
    manualCellSize: 0
    cellSize: 0.16666667
    manualTileSize: 0
    tileSize: 256
    accuratePlacement: 0
    maxJobWorkers: 0
    preserveTilesOutsideBounds: 0
    debug:
      m_Flags: 0
  m_NavMeshData: {fileID: 0}
--- !u!1 &275759214
GameObject:
  m_ObjectHideFlags: 0
  m_CorrespondingSourceObject: {fileID: 0}
  m_PrefabInstance: {fileID: 0}
  m_PrefabAsset: {fileID: 0}
  serializedVersion: 6
  m_Component:
  - component: {fileID: 275759215}
  - component: {fileID: 275759216}
  m_Layer: 0
  m_Name: path2
  m_TagString: Untagged
  m_Icon: {fileID: 0}
  m_NavMeshLayer: 0
  m_StaticEditorFlags: 0
  m_IsActive: 1
--- !u!4 &275759215
Transform:
  m_ObjectHideFlags: 0
  m_CorrespondingSourceObject: {fileID: 0}
  m_PrefabInstance: {fileID: 0}
  m_PrefabAsset: {fileID: 0}
  m_GameObject: {fileID: 275759214}
  m_LocalRotation: {x: -0, y: -0, z: -0, w: 1}
  m_LocalPosition: {x: -3.5046353, y: -0.813, z: 0.45029742}
  m_LocalScale: {x: 0.80453825, y: 8.188638, z: 1}
  m_Children: []
  m_Father: {fileID: 2015580596}
  m_RootOrder: 2
  m_LocalEulerAnglesHint: {x: 0, y: 0, z: 0}
--- !u!212 &275759216
SpriteRenderer:
  m_ObjectHideFlags: 0
  m_CorrespondingSourceObject: {fileID: 0}
  m_PrefabInstance: {fileID: 0}
  m_PrefabAsset: {fileID: 0}
  m_GameObject: {fileID: 275759214}
  m_Enabled: 1
  m_CastShadows: 0
  m_ReceiveShadows: 0
  m_DynamicOccludee: 1
  m_MotionVectors: 1
  m_LightProbeUsage: 1
  m_ReflectionProbeUsage: 1
  m_RayTracingMode: 0
  m_RayTraceProcedural: 0
  m_RenderingLayerMask: 1
  m_RendererPriority: 0
  m_Materials:
  - {fileID: 10754, guid: 0000000000000000f000000000000000, type: 0}
  m_StaticBatchInfo:
    firstSubMesh: 0
    subMeshCount: 0
  m_StaticBatchRoot: {fileID: 0}
  m_ProbeAnchor: {fileID: 0}
  m_LightProbeVolumeOverride: {fileID: 0}
  m_ScaleInLightmap: 1
  m_ReceiveGI: 1
  m_PreserveUVs: 0
  m_IgnoreNormalsForChartDetection: 0
  m_ImportantGI: 0
  m_StitchLightmapSeams: 1
  m_SelectedEditorRenderState: 0
  m_MinimumChartSize: 4
  m_AutoUVMaxDistance: 0.5
  m_AutoUVMaxAngle: 89
  m_LightmapParameters: {fileID: 0}
  m_SortingLayerID: 0
  m_SortingLayer: 0
  m_SortingOrder: 0
  m_Sprite: {fileID: 21300000, guid: 03ae01dc982f8b8499cbe43c5ade31b6, type: 3}
  m_Color: {r: 0.8490566, g: 0.81301177, b: 0.81301177, a: 1}
  m_FlipX: 0
  m_FlipY: 0
  m_DrawMode: 0
  m_Size: {x: 1, y: 1}
  m_AdaptiveModeThreshold: 0.5
  m_SpriteTileMode: 0
  m_WasSpriteAssigned: 1
  m_MaskInteraction: 0
  m_SpriteSortPoint: 0
--- !u!1 &429257667
GameObject:
  m_ObjectHideFlags: 0
  m_CorrespondingSourceObject: {fileID: 0}
  m_PrefabInstance: {fileID: 0}
  m_PrefabAsset: {fileID: 0}
  serializedVersion: 6
  m_Component:
  - component: {fileID: 429257668}
  - component: {fileID: 429257669}
  m_Layer: 0
  m_Name: path1
  m_TagString: Untagged
  m_Icon: {fileID: 0}
  m_NavMeshLayer: 0
  m_StaticEditorFlags: 0
  m_IsActive: 1
--- !u!4 &429257668
Transform:
  m_ObjectHideFlags: 0
  m_CorrespondingSourceObject: {fileID: 0}
  m_PrefabInstance: {fileID: 0}
  m_PrefabAsset: {fileID: 0}
  m_GameObject: {fileID: 429257667}
  m_LocalRotation: {x: -0, y: -0, z: -0, w: 1}
  m_LocalPosition: {x: -2.692, y: 3.661, z: 0.45029742}
  m_LocalScale: {x: 2.3899481, y: 0.8045386, z: 1}
  m_Children: []
  m_Father: {fileID: 2015580596}
  m_RootOrder: 1
  m_LocalEulerAnglesHint: {x: 0, y: 0, z: 0}
--- !u!212 &429257669
SpriteRenderer:
  m_ObjectHideFlags: 0
  m_CorrespondingSourceObject: {fileID: 0}
  m_PrefabInstance: {fileID: 0}
  m_PrefabAsset: {fileID: 0}
  m_GameObject: {fileID: 429257667}
  m_Enabled: 1
  m_CastShadows: 0
  m_ReceiveShadows: 0
  m_DynamicOccludee: 1
  m_MotionVectors: 1
  m_LightProbeUsage: 1
  m_ReflectionProbeUsage: 1
  m_RayTracingMode: 0
  m_RayTraceProcedural: 0
  m_RenderingLayerMask: 1
  m_RendererPriority: 0
  m_Materials:
  - {fileID: 10754, guid: 0000000000000000f000000000000000, type: 0}
  m_StaticBatchInfo:
    firstSubMesh: 0
    subMeshCount: 0
  m_StaticBatchRoot: {fileID: 0}
  m_ProbeAnchor: {fileID: 0}
  m_LightProbeVolumeOverride: {fileID: 0}
  m_ScaleInLightmap: 1
  m_ReceiveGI: 1
  m_PreserveUVs: 0
  m_IgnoreNormalsForChartDetection: 0
  m_ImportantGI: 0
  m_StitchLightmapSeams: 1
  m_SelectedEditorRenderState: 0
  m_MinimumChartSize: 4
  m_AutoUVMaxDistance: 0.5
  m_AutoUVMaxAngle: 89
  m_LightmapParameters: {fileID: 0}
  m_SortingLayerID: 0
  m_SortingLayer: 0
  m_SortingOrder: 0
  m_Sprite: {fileID: 21300000, guid: 03ae01dc982f8b8499cbe43c5ade31b6, type: 3}
  m_Color: {r: 0.8490566, g: 0.81301177, b: 0.81301177, a: 1}
  m_FlipX: 0
  m_FlipY: 0
  m_DrawMode: 0
  m_Size: {x: 1, y: 1}
  m_AdaptiveModeThreshold: 0.5
  m_SpriteTileMode: 0
  m_WasSpriteAssigned: 1
  m_MaskInteraction: 0
  m_SpriteSortPoint: 0
--- !u!1 &519420028
GameObject:
  m_ObjectHideFlags: 0
  m_CorrespondingSourceObject: {fileID: 0}
  m_PrefabInstance: {fileID: 0}
  m_PrefabAsset: {fileID: 0}
  serializedVersion: 6
  m_Component:
  - component: {fileID: 519420032}
  - component: {fileID: 519420031}
  - component: {fileID: 519420029}
  m_Layer: 0
  m_Name: Main Camera
  m_TagString: MainCamera
  m_Icon: {fileID: 0}
  m_NavMeshLayer: 0
  m_StaticEditorFlags: 0
  m_IsActive: 1
--- !u!81 &519420029
AudioListener:
  m_ObjectHideFlags: 0
  m_CorrespondingSourceObject: {fileID: 0}
  m_PrefabInstance: {fileID: 0}
  m_PrefabAsset: {fileID: 0}
  m_GameObject: {fileID: 519420028}
  m_Enabled: 1
--- !u!20 &519420031
Camera:
  m_ObjectHideFlags: 0
  m_CorrespondingSourceObject: {fileID: 0}
  m_PrefabInstance: {fileID: 0}
  m_PrefabAsset: {fileID: 0}
  m_GameObject: {fileID: 519420028}
  m_Enabled: 1
  serializedVersion: 2
  m_ClearFlags: 2
  m_BackGroundColor: {r: 0.19215687, g: 0.3019608, b: 0.4745098, a: 0}
  m_projectionMatrixMode: 1
  m_GateFitMode: 2
  m_FOVAxisMode: 0
  m_SensorSize: {x: 36, y: 24}
  m_LensShift: {x: 0, y: 0}
  m_FocalLength: 50
  m_NormalizedViewPortRect:
    serializedVersion: 2
    x: 0
    y: 0
    width: 1
    height: 1
  near clip plane: 0.3
  far clip plane: 1000
  field of view: 60
  orthographic: 1
  orthographic size: 5
  m_Depth: -1
  m_CullingMask:
    serializedVersion: 2
    m_Bits: 4294967295
  m_RenderingPath: -1
  m_TargetTexture: {fileID: 0}
  m_TargetDisplay: 0
  m_TargetEye: 0
  m_HDR: 1
  m_AllowMSAA: 0
  m_AllowDynamicResolution: 0
  m_ForceIntoRT: 0
  m_OcclusionCulling: 0
  m_StereoConvergence: 10
  m_StereoSeparation: 0.022
--- !u!4 &519420032
Transform:
  m_ObjectHideFlags: 0
  m_CorrespondingSourceObject: {fileID: 0}
  m_PrefabInstance: {fileID: 0}
  m_PrefabAsset: {fileID: 0}
  m_GameObject: {fileID: 519420028}
  m_LocalRotation: {x: 0, y: 0, z: 0, w: 1}
  m_LocalPosition: {x: 0, y: 0, z: -10}
  m_LocalScale: {x: 1, y: 1, z: 1}
  m_Children: []
  m_Father: {fileID: 0}
  m_RootOrder: 0
  m_LocalEulerAnglesHint: {x: 0, y: 0, z: 0}
--- !u!1 &646438317 stripped
GameObject:
  m_CorrespondingSourceObject: {fileID: 7252125776794375461, guid: f8f171e78a31e3743a5e97b4bed34af3, type: 3}
  m_PrefabInstance: {fileID: 7252125776367028360}
  m_PrefabAsset: {fileID: 0}
--- !u!4 &646438318 stripped
Transform:
  m_CorrespondingSourceObject: {fileID: 7252125776794375462, guid: f8f171e78a31e3743a5e97b4bed34af3, type: 3}
  m_PrefabInstance: {fileID: 7252125776367028360}
  m_PrefabAsset: {fileID: 0}
--- !u!114 &963252127 stripped
MonoBehaviour:
  m_CorrespondingSourceObject: {fileID: 3374166107710414195, guid: 23a08bd3b75b17f479aa53218a442efb, type: 3}
  m_PrefabInstance: {fileID: 3374166107561120492}
  m_PrefabAsset: {fileID: 0}
  m_GameObject: {fileID: 0}
  m_Enabled: 1
  m_EditorHideFlags: 0
  m_Script: {fileID: 11500000, guid: e1a89aae7202ce243b3f13e9decf38eb, type: 3}
  m_Name: 
  m_EditorClassIdentifier: 
--- !u!1 &992544350
GameObject:
  m_ObjectHideFlags: 0
  m_CorrespondingSourceObject: {fileID: 0}
  m_PrefabInstance: {fileID: 0}
  m_PrefabAsset: {fileID: 0}
  serializedVersion: 6
  m_Component:
  - component: {fileID: 992544353}
  - component: {fileID: 992544352}
  - component: {fileID: 992544351}
  m_Layer: 0
  m_Name: EventSystem
  m_TagString: Untagged
  m_Icon: {fileID: 0}
  m_NavMeshLayer: 0
  m_StaticEditorFlags: 0
  m_IsActive: 1
--- !u!114 &992544351
MonoBehaviour:
  m_ObjectHideFlags: 0
  m_CorrespondingSourceObject: {fileID: 0}
  m_PrefabInstance: {fileID: 0}
  m_PrefabAsset: {fileID: 0}
  m_GameObject: {fileID: 992544350}
  m_Enabled: 1
  m_EditorHideFlags: 0
  m_Script: {fileID: 11500000, guid: 4f231c4fb786f3946a6b90b886c48677, type: 3}
  m_Name: 
  m_EditorClassIdentifier: 
  m_HorizontalAxis: Horizontal
  m_VerticalAxis: Vertical
  m_SubmitButton: Submit
  m_CancelButton: Cancel
  m_InputActionsPerSecond: 10
  m_RepeatDelay: 0.5
  m_ForceModuleActive: 0
--- !u!114 &992544352
MonoBehaviour:
  m_ObjectHideFlags: 0
  m_CorrespondingSourceObject: {fileID: 0}
  m_PrefabInstance: {fileID: 0}
  m_PrefabAsset: {fileID: 0}
  m_GameObject: {fileID: 992544350}
  m_Enabled: 1
  m_EditorHideFlags: 0
  m_Script: {fileID: 11500000, guid: 76c392e42b5098c458856cdf6ecaaaa1, type: 3}
  m_Name: 
  m_EditorClassIdentifier: 
  m_FirstSelected: {fileID: 0}
  m_sendNavigationEvents: 1
  m_DragThreshold: 10
--- !u!4 &992544353
Transform:
  m_ObjectHideFlags: 0
  m_CorrespondingSourceObject: {fileID: 0}
  m_PrefabInstance: {fileID: 0}
  m_PrefabAsset: {fileID: 0}
  m_GameObject: {fileID: 992544350}
  m_LocalRotation: {x: 0, y: 0, z: 0, w: 1}
  m_LocalPosition: {x: 0, y: 0, z: 0}
  m_LocalScale: {x: 1, y: 1, z: 1}
  m_Children: []
  m_Father: {fileID: 0}
  m_RootOrder: 1
  m_LocalEulerAnglesHint: {x: 0, y: 0, z: 0}
--- !u!1 &1212341126
GameObject:
  m_ObjectHideFlags: 0
  m_CorrespondingSourceObject: {fileID: 0}
  m_PrefabInstance: {fileID: 0}
  m_PrefabAsset: {fileID: 0}
  serializedVersion: 6
  m_Component:
  - component: {fileID: 1212341127}
  m_Layer: 0
  m_Name: coinsOBJ4InvisibleRectangleArea
  m_TagString: Untagged
  m_Icon: {fileID: 0}
  m_NavMeshLayer: 0
  m_StaticEditorFlags: 0
  m_IsActive: 1
--- !u!4 &1212341127
Transform:
  m_ObjectHideFlags: 0
  m_CorrespondingSourceObject: {fileID: 0}
  m_PrefabInstance: {fileID: 0}
  m_PrefabAsset: {fileID: 0}
  m_GameObject: {fileID: 1212341126}
  m_LocalRotation: {x: 0, y: 0, z: 0, w: 1}
  m_LocalPosition: {x: 1.94, y: 2.34, z: -0.86200964}
  m_LocalScale: {x: 1, y: 1, z: 1}
  m_Children: []
  m_Father: {fileID: 0}
  m_RootOrder: 12
  m_LocalEulerAnglesHint: {x: 0, y: 0, z: 0}
--- !u!1 &1330062804 stripped
GameObject:
  m_CorrespondingSourceObject: {fileID: 7252125775070539100, guid: f8f171e78a31e3743a5e97b4bed34af3, type: 3}
  m_PrefabInstance: {fileID: 7252125776367028360}
  m_PrefabAsset: {fileID: 0}
--- !u!4 &1330062805 stripped
Transform:
  m_CorrespondingSourceObject: {fileID: 7252125775070539101, guid: f8f171e78a31e3743a5e97b4bed34af3, type: 3}
  m_PrefabInstance: {fileID: 7252125776367028360}
  m_PrefabAsset: {fileID: 0}
--- !u!1 &1336892882 stripped
GameObject:
  m_CorrespondingSourceObject: {fileID: 6042354428626922558, guid: 6008536c14905db4ab0d2a815cda5355, type: 3}
  m_PrefabInstance: {fileID: 2093936873}
  m_PrefabAsset: {fileID: 0}
--- !u!1 &1752552168
GameObject:
  m_ObjectHideFlags: 0
  m_CorrespondingSourceObject: {fileID: 0}
  m_PrefabInstance: {fileID: 0}
  m_PrefabAsset: {fileID: 0}
  serializedVersion: 6
  m_Component:
  - component: {fileID: 1752552170}
  - component: {fileID: 1752552169}
  m_Layer: 0
  m_Name: BG
  m_TagString: Untagged
  m_Icon: {fileID: 0}
  m_NavMeshLayer: 0
  m_StaticEditorFlags: 0
  m_IsActive: 1
--- !u!212 &1752552169
SpriteRenderer:
  m_ObjectHideFlags: 0
  m_CorrespondingSourceObject: {fileID: 0}
  m_PrefabInstance: {fileID: 0}
  m_PrefabAsset: {fileID: 0}
  m_GameObject: {fileID: 1752552168}
  m_Enabled: 1
  m_CastShadows: 0
  m_ReceiveShadows: 0
  m_DynamicOccludee: 1
  m_MotionVectors: 1
  m_LightProbeUsage: 1
  m_ReflectionProbeUsage: 1
  m_RayTracingMode: 0
  m_RayTraceProcedural: 0
  m_RenderingLayerMask: 1
  m_RendererPriority: 0
  m_Materials:
  - {fileID: 10754, guid: 0000000000000000f000000000000000, type: 0}
  m_StaticBatchInfo:
    firstSubMesh: 0
    subMeshCount: 0
  m_StaticBatchRoot: {fileID: 0}
  m_ProbeAnchor: {fileID: 0}
  m_LightProbeVolumeOverride: {fileID: 0}
  m_ScaleInLightmap: 1
  m_ReceiveGI: 1
  m_PreserveUVs: 0
  m_IgnoreNormalsForChartDetection: 0
  m_ImportantGI: 0
  m_StitchLightmapSeams: 1
  m_SelectedEditorRenderState: 0
  m_MinimumChartSize: 4
  m_AutoUVMaxDistance: 0.5
  m_AutoUVMaxAngle: 89
  m_LightmapParameters: {fileID: 0}
  m_SortingLayerID: 0
  m_SortingLayer: 0
  m_SortingOrder: 0
  m_Sprite: {fileID: 21300000, guid: 03ae01dc982f8b8499cbe43c5ade31b6, type: 3}
  m_Color: {r: 0.19708973, g: 0.4056604, b: 0.20324495, a: 1}
  m_FlipX: 0
  m_FlipY: 0
  m_DrawMode: 0
  m_Size: {x: 1, y: 1}
  m_AdaptiveModeThreshold: 0.5
  m_SpriteTileMode: 0
  m_WasSpriteAssigned: 1
  m_MaskInteraction: 0
  m_SpriteSortPoint: 0
--- !u!4 &1752552170
Transform:
  m_ObjectHideFlags: 0
  m_CorrespondingSourceObject: {fileID: 0}
  m_PrefabInstance: {fileID: 0}
  m_PrefabAsset: {fileID: 0}
  m_GameObject: {fileID: 1752552168}
  m_LocalRotation: {x: 0, y: 0, z: 0, w: 1}
  m_LocalPosition: {x: 0.032, y: 0.021, z: 0}
  m_LocalScale: {x: 5.7996626, y: 10.1215315, z: 1}
  m_Children: []
  m_Father: {fileID: 0}
  m_RootOrder: 3
  m_LocalEulerAnglesHint: {x: 0, y: 0, z: 0}
--- !u!1 &1777903871
GameObject:
  m_ObjectHideFlags: 0
  m_CorrespondingSourceObject: {fileID: 0}
  m_PrefabInstance: {fileID: 0}
  m_PrefabAsset: {fileID: 0}
  serializedVersion: 6
  m_Component:
  - component: {fileID: 1777903872}
  - component: {fileID: 1777903873}
  m_Layer: 0
  m_Name: path0
  m_TagString: Untagged
  m_Icon: {fileID: 0}
  m_NavMeshLayer: 0
  m_StaticEditorFlags: 0
  m_IsActive: 1
--- !u!4 &1777903872
Transform:
  m_ObjectHideFlags: 0
  m_CorrespondingSourceObject: {fileID: 0}
  m_PrefabInstance: {fileID: 0}
  m_PrefabAsset: {fileID: 0}
  m_GameObject: {fileID: 1777903871}
  m_LocalRotation: {x: -0, y: -0, z: -0, w: 1}
  m_LocalPosition: {x: -1.108, y: 4.15, z: 0.45029742}
  m_LocalScale: {x: 0.8262571, y: 1.7818456, z: 1}
  m_Children: []
  m_Father: {fileID: 2015580596}
  m_RootOrder: 0
  m_LocalEulerAnglesHint: {x: 0, y: 0, z: 0}
--- !u!212 &1777903873
SpriteRenderer:
  m_ObjectHideFlags: 0
  m_CorrespondingSourceObject: {fileID: 0}
  m_PrefabInstance: {fileID: 0}
  m_PrefabAsset: {fileID: 0}
  m_GameObject: {fileID: 1777903871}
  m_Enabled: 1
  m_CastShadows: 0
  m_ReceiveShadows: 0
  m_DynamicOccludee: 1
  m_MotionVectors: 1
  m_LightProbeUsage: 1
  m_ReflectionProbeUsage: 1
  m_RayTracingMode: 0
  m_RayTraceProcedural: 0
  m_RenderingLayerMask: 1
  m_RendererPriority: 0
  m_Materials:
  - {fileID: 10754, guid: 0000000000000000f000000000000000, type: 0}
  m_StaticBatchInfo:
    firstSubMesh: 0
    subMeshCount: 0
  m_StaticBatchRoot: {fileID: 0}
  m_ProbeAnchor: {fileID: 0}
  m_LightProbeVolumeOverride: {fileID: 0}
  m_ScaleInLightmap: 1
  m_ReceiveGI: 1
  m_PreserveUVs: 0
  m_IgnoreNormalsForChartDetection: 0
  m_ImportantGI: 0
  m_StitchLightmapSeams: 1
  m_SelectedEditorRenderState: 0
  m_MinimumChartSize: 4
  m_AutoUVMaxDistance: 0.5
  m_AutoUVMaxAngle: 89
  m_LightmapParameters: {fileID: 0}
  m_SortingLayerID: 0
  m_SortingLayer: 0
  m_SortingOrder: 0
  m_Sprite: {fileID: 21300000, guid: 03ae01dc982f8b8499cbe43c5ade31b6, type: 3}
  m_Color: {r: 0.8490566, g: 0.81301177, b: 0.81301177, a: 1}
  m_FlipX: 0
  m_FlipY: 0
  m_DrawMode: 0
  m_Size: {x: 1, y: 1}
  m_AdaptiveModeThreshold: 0.5
  m_SpriteTileMode: 0
  m_WasSpriteAssigned: 1
  m_MaskInteraction: 0
  m_SpriteSortPoint: 0
--- !u!1 &1783939457 stripped
GameObject:
  m_CorrespondingSourceObject: {fileID: 7252125775658961161, guid: f8f171e78a31e3743a5e97b4bed34af3, type: 3}
  m_PrefabInstance: {fileID: 7252125776367028360}
  m_PrefabAsset: {fileID: 0}
--- !u!4 &1783939458 stripped
Transform:
  m_CorrespondingSourceObject: {fileID: 7252125775658961162, guid: f8f171e78a31e3743a5e97b4bed34af3, type: 3}
  m_PrefabInstance: {fileID: 7252125776367028360}
  m_PrefabAsset: {fileID: 0}
--- !u!1 &1995454193 stripped
GameObject:
  m_CorrespondingSourceObject: {fileID: 7252125775451635321, guid: f8f171e78a31e3743a5e97b4bed34af3, type: 3}
  m_PrefabInstance: {fileID: 7252125776367028360}
  m_PrefabAsset: {fileID: 0}
--- !u!4 &1995454194 stripped
Transform:
  m_CorrespondingSourceObject: {fileID: 7252125775451635322, guid: f8f171e78a31e3743a5e97b4bed34af3, type: 3}
  m_PrefabInstance: {fileID: 7252125776367028360}
  m_PrefabAsset: {fileID: 0}
--- !u!1 &2015580595
GameObject:
  m_ObjectHideFlags: 0
  m_CorrespondingSourceObject: {fileID: 0}
  m_PrefabInstance: {fileID: 0}
  m_PrefabAsset: {fileID: 0}
  serializedVersion: 6
  m_Component:
  - component: {fileID: 2015580596}
  m_Layer: 0
  m_Name: PathSprites
  m_TagString: Untagged
  m_Icon: {fileID: 0}
  m_NavMeshLayer: 0
  m_StaticEditorFlags: 0
  m_IsActive: 1
--- !u!4 &2015580596
Transform:
  m_ObjectHideFlags: 0
  m_CorrespondingSourceObject: {fileID: 0}
  m_PrefabInstance: {fileID: 0}
  m_PrefabAsset: {fileID: 0}
  m_GameObject: {fileID: 2015580595}
  m_LocalRotation: {x: 0, y: 0, z: 0, w: 1}
  m_LocalPosition: {x: 1.2376355, y: 0.041894343, z: -1}
  m_LocalScale: {x: 1, y: 1, z: 1}
  m_Children:
  - {fileID: 1777903872}
  - {fileID: 429257668}
  - {fileID: 275759215}
  m_Father: {fileID: 0}
  m_RootOrder: 4
  m_LocalEulerAnglesHint: {x: 0, y: 0, z: 0}
--- !u!1001 &2093936873
PrefabInstance:
  m_ObjectHideFlags: 0
  serializedVersion: 2
  m_Modification:
    m_TransformParent: {fileID: 0}
    m_Modifications:
    - target: {fileID: 3489478238746369841, guid: 6008536c14905db4ab0d2a815cda5355, type: 3}
      propertyPath: pointsAvailableToMove.Array.data[0]
      value: 
      objectReference: {fileID: 1995454194}
    - target: {fileID: 3489478238746369841, guid: 6008536c14905db4ab0d2a815cda5355, type: 3}
      propertyPath: pointsAvailableToMove.Array.data[1]
      value: 
      objectReference: {fileID: 1330062805}
    - target: {fileID: 3489478238746369841, guid: 6008536c14905db4ab0d2a815cda5355, type: 3}
      propertyPath: pointsAvailableToMove.Array.data[2]
      value: 
      objectReference: {fileID: 1783939458}
    - target: {fileID: 3489478238746369841, guid: 6008536c14905db4ab0d2a815cda5355, type: 3}
      propertyPath: pointsAvailableToMove.Array.data[3]
      value: 
      objectReference: {fileID: 646438318}
    - target: {fileID: 6042354428626922549, guid: 6008536c14905db4ab0d2a815cda5355, type: 3}
      propertyPath: m_LocalPosition.x
      value: 0.54
      objectReference: {fileID: 0}
    - target: {fileID: 6042354428626922549, guid: 6008536c14905db4ab0d2a815cda5355, type: 3}
      propertyPath: m_LocalPosition.y
      value: 0.38
      objectReference: {fileID: 0}
    - target: {fileID: 6042354428626922549, guid: 6008536c14905db4ab0d2a815cda5355, type: 3}
      propertyPath: m_LocalPosition.z
      value: -0.27140898
      objectReference: {fileID: 0}
    - target: {fileID: 6042354428626922549, guid: 6008536c14905db4ab0d2a815cda5355, type: 3}
      propertyPath: m_LocalRotation.x
      value: 0
      objectReference: {fileID: 0}
    - target: {fileID: 6042354428626922549, guid: 6008536c14905db4ab0d2a815cda5355, type: 3}
      propertyPath: m_LocalRotation.y
      value: 0
      objectReference: {fileID: 0}
    - target: {fileID: 6042354428626922549, guid: 6008536c14905db4ab0d2a815cda5355, type: 3}
      propertyPath: m_LocalRotation.z
      value: 0
      objectReference: {fileID: 0}
    - target: {fileID: 6042354428626922549, guid: 6008536c14905db4ab0d2a815cda5355, type: 3}
      propertyPath: m_LocalRotation.w
      value: 1
      objectReference: {fileID: 0}
    - target: {fileID: 6042354428626922549, guid: 6008536c14905db4ab0d2a815cda5355, type: 3}
      propertyPath: m_RootOrder
      value: 6
      objectReference: {fileID: 0}
    - target: {fileID: 6042354428626922549, guid: 6008536c14905db4ab0d2a815cda5355, type: 3}
      propertyPath: m_LocalEulerAnglesHint.x
      value: 0
      objectReference: {fileID: 0}
    - target: {fileID: 6042354428626922549, guid: 6008536c14905db4ab0d2a815cda5355, type: 3}
      propertyPath: m_LocalEulerAnglesHint.y
      value: 0
      objectReference: {fileID: 0}
    - target: {fileID: 6042354428626922549, guid: 6008536c14905db4ab0d2a815cda5355, type: 3}
      propertyPath: m_LocalEulerAnglesHint.z
      value: 0
      objectReference: {fileID: 0}
    - target: {fileID: 6042354428626922558, guid: 6008536c14905db4ab0d2a815cda5355, type: 3}
      propertyPath: m_Name
      value: Turret
      objectReference: {fileID: 0}
    m_RemovedComponents: []
  m_SourcePrefab: {fileID: 100100000, guid: 6008536c14905db4ab0d2a815cda5355, type: 3}
--- !u!1001 &3374166107561120492
PrefabInstance:
  m_ObjectHideFlags: 0
  serializedVersion: 2
  m_Modification:
    m_TransformParent: {fileID: 0}
    m_Modifications:
    - target: {fileID: 3374166107821330084, guid: 23a08bd3b75b17f479aa53218a442efb, type: 3}
      propertyPath: m_LocalPosition.x
      value: 0
      objectReference: {fileID: 0}
    - target: {fileID: 3374166107821330084, guid: 23a08bd3b75b17f479aa53218a442efb, type: 3}
      propertyPath: m_LocalPosition.y
      value: 0
      objectReference: {fileID: 0}
    - target: {fileID: 3374166107821330084, guid: 23a08bd3b75b17f479aa53218a442efb, type: 3}
      propertyPath: m_LocalPosition.z
      value: 0
      objectReference: {fileID: 0}
    - target: {fileID: 3374166107821330084, guid: 23a08bd3b75b17f479aa53218a442efb, type: 3}
      propertyPath: m_LocalRotation.x
      value: 0
      objectReference: {fileID: 0}
    - target: {fileID: 3374166107821330084, guid: 23a08bd3b75b17f479aa53218a442efb, type: 3}
      propertyPath: m_LocalRotation.y
      value: 0
      objectReference: {fileID: 0}
    - target: {fileID: 3374166107821330084, guid: 23a08bd3b75b17f479aa53218a442efb, type: 3}
      propertyPath: m_LocalRotation.z
      value: 0
      objectReference: {fileID: 0}
    - target: {fileID: 3374166107821330084, guid: 23a08bd3b75b17f479aa53218a442efb, type: 3}
      propertyPath: m_LocalRotation.w
      value: 1
      objectReference: {fileID: 0}
    - target: {fileID: 3374166107821330084, guid: 23a08bd3b75b17f479aa53218a442efb, type: 3}
      propertyPath: m_RootOrder
      value: 9
      objectReference: {fileID: 0}
    - target: {fileID: 3374166107821330084, guid: 23a08bd3b75b17f479aa53218a442efb, type: 3}
      propertyPath: m_LocalEulerAnglesHint.x
      value: 0
      objectReference: {fileID: 0}
    - target: {fileID: 3374166107821330084, guid: 23a08bd3b75b17f479aa53218a442efb, type: 3}
      propertyPath: m_LocalEulerAnglesHint.y
      value: 0
      objectReference: {fileID: 0}
    - target: {fileID: 3374166107821330084, guid: 23a08bd3b75b17f479aa53218a442efb, type: 3}
      propertyPath: m_LocalEulerAnglesHint.z
      value: 0
      objectReference: {fileID: 0}
    - target: {fileID: 3374166107821330091, guid: 23a08bd3b75b17f479aa53218a442efb, type: 3}
      propertyPath: m_Name
      value: Waves
      objectReference: {fileID: 0}
    m_RemovedComponents: []
  m_SourcePrefab: {fileID: 100100000, guid: 23a08bd3b75b17f479aa53218a442efb, type: 3}
--- !u!1001 &7252125776367028360
PrefabInstance:
  m_ObjectHideFlags: 0
  serializedVersion: 2
  m_Modification:
    m_TransformParent: {fileID: 0}
    m_Modifications:
    - target: {fileID: 7252125775128128742, guid: f8f171e78a31e3743a5e97b4bed34af3, type: 3}
      propertyPath: m_Name
      value: Waypoints
      objectReference: {fileID: 0}
    - target: {fileID: 7252125775128128743, guid: f8f171e78a31e3743a5e97b4bed34af3, type: 3}
      propertyPath: m_LocalPosition.x
      value: 0
      objectReference: {fileID: 0}
    - target: {fileID: 7252125775128128743, guid: f8f171e78a31e3743a5e97b4bed34af3, type: 3}
      propertyPath: m_LocalPosition.y
      value: 0
      objectReference: {fileID: 0}
    - target: {fileID: 7252125775128128743, guid: f8f171e78a31e3743a5e97b4bed34af3, type: 3}
      propertyPath: m_LocalPosition.z
      value: -0.45029742
      objectReference: {fileID: 0}
    - target: {fileID: 7252125775128128743, guid: f8f171e78a31e3743a5e97b4bed34af3, type: 3}
      propertyPath: m_LocalRotation.x
      value: 0
      objectReference: {fileID: 0}
    - target: {fileID: 7252125775128128743, guid: f8f171e78a31e3743a5e97b4bed34af3, type: 3}
      propertyPath: m_LocalRotation.y
      value: 0
      objectReference: {fileID: 0}
    - target: {fileID: 7252125775128128743, guid: f8f171e78a31e3743a5e97b4bed34af3, type: 3}
      propertyPath: m_LocalRotation.z
      value: 0
      objectReference: {fileID: 0}
    - target: {fileID: 7252125775128128743, guid: f8f171e78a31e3743a5e97b4bed34af3, type: 3}
      propertyPath: m_LocalRotation.w
      value: 1
      objectReference: {fileID: 0}
    - target: {fileID: 7252125775128128743, guid: f8f171e78a31e3743a5e97b4bed34af3, type: 3}
      propertyPath: m_RootOrder
      value: 8
      objectReference: {fileID: 0}
    - target: {fileID: 7252125775128128743, guid: f8f171e78a31e3743a5e97b4bed34af3, type: 3}
      propertyPath: m_LocalEulerAnglesHint.x
      value: 0
      objectReference: {fileID: 0}
    - target: {fileID: 7252125775128128743, guid: f8f171e78a31e3743a5e97b4bed34af3, type: 3}
      propertyPath: m_LocalEulerAnglesHint.y
      value: 0
      objectReference: {fileID: 0}
    - target: {fileID: 7252125775128128743, guid: f8f171e78a31e3743a5e97b4bed34af3, type: 3}
      propertyPath: m_LocalEulerAnglesHint.z
      value: 0
      objectReference: {fileID: 0}
    m_RemovedComponents: []
  m_SourcePrefab: {fileID: 100100000, guid: f8f171e78a31e3743a5e97b4bed34af3, type: 3}
--- !u!1001 &7421590541469148895
PrefabInstance:
  m_ObjectHideFlags: 0
  serializedVersion: 2
  m_Modification:
    m_TransformParent: {fileID: 0}
    m_Modifications:
    - target: {fileID: 7421590540820922607, guid: 1dd69f559fe95fe43b1087e846c63267, type: 3}
      propertyPath: m_LocalPosition.x
      value: 1.84
      objectReference: {fileID: 0}
    - target: {fileID: 7421590540820922607, guid: 1dd69f559fe95fe43b1087e846c63267, type: 3}
      propertyPath: m_LocalPosition.y
      value: -0.275
      objectReference: {fileID: 0}
    - target: {fileID: 7421590540820922607, guid: 1dd69f559fe95fe43b1087e846c63267, type: 3}
      propertyPath: m_LocalPosition.z
      value: -0.86200964
      objectReference: {fileID: 0}
    - target: {fileID: 7421590540820922607, guid: 1dd69f559fe95fe43b1087e846c63267, type: 3}
      propertyPath: m_LocalRotation.x
      value: 0
      objectReference: {fileID: 0}
    - target: {fileID: 7421590540820922607, guid: 1dd69f559fe95fe43b1087e846c63267, type: 3}
      propertyPath: m_LocalRotation.y
      value: 0
      objectReference: {fileID: 0}
    - target: {fileID: 7421590540820922607, guid: 1dd69f559fe95fe43b1087e846c63267, type: 3}
      propertyPath: m_LocalRotation.z
      value: 0
      objectReference: {fileID: 0}
    - target: {fileID: 7421590540820922607, guid: 1dd69f559fe95fe43b1087e846c63267, type: 3}
      propertyPath: m_LocalRotation.w
      value: 1
      objectReference: {fileID: 0}
    - target: {fileID: 7421590540820922607, guid: 1dd69f559fe95fe43b1087e846c63267, type: 3}
      propertyPath: m_RootOrder
      value: 13
      objectReference: {fileID: 0}
    - target: {fileID: 7421590540820922607, guid: 1dd69f559fe95fe43b1087e846c63267, type: 3}
      propertyPath: m_LocalEulerAnglesHint.x
      value: 0
      objectReference: {fileID: 0}
    - target: {fileID: 7421590540820922607, guid: 1dd69f559fe95fe43b1087e846c63267, type: 3}
      propertyPath: m_LocalEulerAnglesHint.y
      value: 0
      objectReference: {fileID: 0}
    - target: {fileID: 7421590540820922607, guid: 1dd69f559fe95fe43b1087e846c63267, type: 3}
      propertyPath: m_LocalEulerAnglesHint.z
      value: 0
      objectReference: {fileID: 0}
    - target: {fileID: 7421590540820922610, guid: 1dd69f559fe95fe43b1087e846c63267, type: 3}
      propertyPath: m_Name
      value: Coin
      objectReference: {fileID: 0}
    m_RemovedComponents: []
  m_SourcePrefab: {fileID: 100100000, guid: 1dd69f559fe95fe43b1087e846c63267, type: 3}
--- !u!1001 &7590926333335149456
PrefabInstance:
  m_ObjectHideFlags: 0
  serializedVersion: 2
  m_Modification:
    m_TransformParent: {fileID: 0}
    m_Modifications:
    - target: {fileID: 1042040165, guid: 81dd2d73e1d135341912934756631ff8, type: 3}
      propertyPath: objectATMaxEdge
      value: 
      objectReference: {fileID: 1212341127}
    - target: {fileID: 3928717075159612163, guid: 81dd2d73e1d135341912934756631ff8, type: 3}
      propertyPath: m_AnchorMin.x
      value: 0
      objectReference: {fileID: 0}
    - target: {fileID: 3928717075159612163, guid: 81dd2d73e1d135341912934756631ff8, type: 3}
      propertyPath: m_AnchorMax.x
      value: 0
      objectReference: {fileID: 0}
    - target: {fileID: 3928717075159612163, guid: 81dd2d73e1d135341912934756631ff8, type: 3}
      propertyPath: m_AnchorMax.y
      value: 0
      objectReference: {fileID: 0}
    - target: {fileID: 7590926333936324133, guid: 81dd2d73e1d135341912934756631ff8, type: 3}
      propertyPath: m_Name
      value: Player
      objectReference: {fileID: 0}
    - target: {fileID: 7590926333936324138, guid: 81dd2d73e1d135341912934756631ff8, type: 3}
      propertyPath: turretObj
      value: 
      objectReference: {fileID: 1336892882}
    - target: {fileID: 7590926333936324142, guid: 81dd2d73e1d135341912934756631ff8, type: 3}
      propertyPath: m_LocalPosition.x
      value: 0.49837595
      objectReference: {fileID: 0}
    - target: {fileID: 7590926333936324142, guid: 81dd2d73e1d135341912934756631ff8, type: 3}
      propertyPath: m_LocalPosition.y
      value: -0.7024275
      objectReference: {fileID: 0}
    - target: {fileID: 7590926333936324142, guid: 81dd2d73e1d135341912934756631ff8, type: 3}
      propertyPath: m_LocalPosition.z
      value: -0.19312811
      objectReference: {fileID: 0}
    - target: {fileID: 7590926333936324142, guid: 81dd2d73e1d135341912934756631ff8, type: 3}
      propertyPath: m_LocalRotation.x
      value: 0
      objectReference: {fileID: 0}
    - target: {fileID: 7590926333936324142, guid: 81dd2d73e1d135341912934756631ff8, type: 3}
      propertyPath: m_LocalRotation.y
      value: 0
      objectReference: {fileID: 0}
    - target: {fileID: 7590926333936324142, guid: 81dd2d73e1d135341912934756631ff8, type: 3}
      propertyPath: m_LocalRotation.z
      value: 0
      objectReference: {fileID: 0}
    - target: {fileID: 7590926333936324142, guid: 81dd2d73e1d135341912934756631ff8, type: 3}
      propertyPath: m_LocalRotation.w
      value: 1
      objectReference: {fileID: 0}
    - target: {fileID: 7590926333936324142, guid: 81dd2d73e1d135341912934756631ff8, type: 3}
      propertyPath: m_RootOrder
      value: 5
      objectReference: {fileID: 0}
    - target: {fileID: 7590926333936324142, guid: 81dd2d73e1d135341912934756631ff8, type: 3}
      propertyPath: m_LocalEulerAnglesHint.x
      value: 0
      objectReference: {fileID: 0}
    - target: {fileID: 7590926333936324142, guid: 81dd2d73e1d135341912934756631ff8, type: 3}
      propertyPath: m_LocalEulerAnglesHint.y
      value: 0
      objectReference: {fileID: 0}
    - target: {fileID: 7590926333936324142, guid: 81dd2d73e1d135341912934756631ff8, type: 3}
      propertyPath: m_LocalEulerAnglesHint.z
      value: 0
      objectReference: {fileID: 0}
    m_RemovedComponents: []
  m_SourcePrefab: {fileID: 100100000, guid: 81dd2d73e1d135341912934756631ff8, type: 3}
--- !u!114 &7590926333335149457 stripped
MonoBehaviour:
  m_CorrespondingSourceObject: {fileID: 7838088061061699582, guid: 81dd2d73e1d135341912934756631ff8, type: 3}
  m_PrefabInstance: {fileID: 7590926333335149456}
  m_PrefabAsset: {fileID: 0}
  m_GameObject: {fileID: 0}
  m_Enabled: 1
  m_EditorHideFlags: 0
  m_Script: {fileID: 11500000, guid: 67db9e8f0e2ae9c40bc1e2b64352a6b4, type: 3}
  m_Name: 
  m_EditorClassIdentifier: 
--- !u!1001 &7677836216847450114
PrefabInstance:
  m_ObjectHideFlags: 0
  serializedVersion: 2
  m_Modification:
    m_TransformParent: {fileID: 0}
    m_Modifications:
    - target: {fileID: 7677836217041442056, guid: da6c3c0365ba5d142abc8f97a99c983c, type: 3}
      propertyPath: m_LocalPosition.x
      value: 0.5065077
      objectReference: {fileID: 0}
    - target: {fileID: 7677836217041442056, guid: da6c3c0365ba5d142abc8f97a99c983c, type: 3}
      propertyPath: m_LocalPosition.y
      value: 0.3601967
      objectReference: {fileID: 0}
    - target: {fileID: 7677836217041442056, guid: da6c3c0365ba5d142abc8f97a99c983c, type: 3}
      propertyPath: m_LocalPosition.z
      value: -0.2707395
      objectReference: {fileID: 0}
    - target: {fileID: 7677836217041442056, guid: da6c3c0365ba5d142abc8f97a99c983c, type: 3}
      propertyPath: m_LocalRotation.x
      value: 0
      objectReference: {fileID: 0}
    - target: {fileID: 7677836217041442056, guid: da6c3c0365ba5d142abc8f97a99c983c, type: 3}
      propertyPath: m_LocalRotation.y
      value: 0
      objectReference: {fileID: 0}
    - target: {fileID: 7677836217041442056, guid: da6c3c0365ba5d142abc8f97a99c983c, type: 3}
      propertyPath: m_LocalRotation.z
      value: 0
      objectReference: {fileID: 0}
    - target: {fileID: 7677836217041442056, guid: da6c3c0365ba5d142abc8f97a99c983c, type: 3}
      propertyPath: m_LocalRotation.w
      value: 1
      objectReference: {fileID: 0}
    - target: {fileID: 7677836217041442056, guid: da6c3c0365ba5d142abc8f97a99c983c, type: 3}
      propertyPath: m_RootOrder
      value: 10
      objectReference: {fileID: 0}
    - target: {fileID: 7677836217041442056, guid: da6c3c0365ba5d142abc8f97a99c983c, type: 3}
      propertyPath: m_LocalEulerAnglesHint.x
      value: 0
      objectReference: {fileID: 0}
    - target: {fileID: 7677836217041442056, guid: da6c3c0365ba5d142abc8f97a99c983c, type: 3}
      propertyPath: m_LocalEulerAnglesHint.y
      value: 0
      objectReference: {fileID: 0}
    - target: {fileID: 7677836217041442056, guid: da6c3c0365ba5d142abc8f97a99c983c, type: 3}
      propertyPath: m_LocalEulerAnglesHint.z
      value: 0
      objectReference: {fileID: 0}
    - target: {fileID: 7677836217041442059, guid: da6c3c0365ba5d142abc8f97a99c983c, type: 3}
      propertyPath: m_Name
      value: ExternalBordersGROUP
      objectReference: {fileID: 0}
    m_RemovedComponents: []
  m_SourcePrefab: {fileID: 100100000, guid: da6c3c0365ba5d142abc8f97a99c983c, type: 3}
--- !u!1001 &8375897674196648358
PrefabInstance:
  m_ObjectHideFlags: 0
  serializedVersion: 2
  m_Modification:
    m_TransformParent: {fileID: 0}
    m_Modifications:
    - target: {fileID: 8375897675294055128, guid: 7a1c0090dafd3564484bfdb010296984, type: 3}
      propertyPath: m_LocalPosition.x
      value: 0.5065077
      objectReference: {fileID: 0}
    - target: {fileID: 8375897675294055128, guid: 7a1c0090dafd3564484bfdb010296984, type: 3}
      propertyPath: m_LocalPosition.y
      value: 0.3601967
      objectReference: {fileID: 0}
    - target: {fileID: 8375897675294055128, guid: 7a1c0090dafd3564484bfdb010296984, type: 3}
      propertyPath: m_LocalPosition.z
      value: -0.2707395
      objectReference: {fileID: 0}
    - target: {fileID: 8375897675294055128, guid: 7a1c0090dafd3564484bfdb010296984, type: 3}
      propertyPath: m_LocalRotation.x
      value: 0
      objectReference: {fileID: 0}
    - target: {fileID: 8375897675294055128, guid: 7a1c0090dafd3564484bfdb010296984, type: 3}
      propertyPath: m_LocalRotation.y
      value: 0
      objectReference: {fileID: 0}
    - target: {fileID: 8375897675294055128, guid: 7a1c0090dafd3564484bfdb010296984, type: 3}
      propertyPath: m_LocalRotation.z
      value: 0
      objectReference: {fileID: 0}
    - target: {fileID: 8375897675294055128, guid: 7a1c0090dafd3564484bfdb010296984, type: 3}
      propertyPath: m_LocalRotation.w
      value: 1
      objectReference: {fileID: 0}
    - target: {fileID: 8375897675294055128, guid: 7a1c0090dafd3564484bfdb010296984, type: 3}
      propertyPath: m_RootOrder
      value: 7
      objectReference: {fileID: 0}
    - target: {fileID: 8375897675294055128, guid: 7a1c0090dafd3564484bfdb010296984, type: 3}
      propertyPath: m_LocalEulerAnglesHint.x
      value: 0
      objectReference: {fileID: 0}
    - target: {fileID: 8375897675294055128, guid: 7a1c0090dafd3564484bfdb010296984, type: 3}
      propertyPath: m_LocalEulerAnglesHint.y
      value: 0
      objectReference: {fileID: 0}
    - target: {fileID: 8375897675294055128, guid: 7a1c0090dafd3564484bfdb010296984, type: 3}
      propertyPath: m_LocalEulerAnglesHint.z
      value: 0
      objectReference: {fileID: 0}
    - target: {fileID: 8375897675294055133, guid: 7a1c0090dafd3564484bfdb010296984, type: 3}
      propertyPath: m_Name
      value: TurretPlatformSpawningAndReturnPosition
      objectReference: {fileID: 0}
    m_RemovedComponents: []
  m_SourcePrefab: {fileID: 100100000, guid: 7a1c0090dafd3564484bfdb010296984, type: 3}
--- !u!1001 &8828476860196444518
PrefabInstance:
  m_ObjectHideFlags: 0
  serializedVersion: 2
  m_Modification:
    m_TransformParent: {fileID: 0}
    m_Modifications:
    - target: {fileID: 8828476860151170620, guid: 73d63f75c4c147d48bb3e8a26500085c, type: 3}
      propertyPath: enemyPaths.Array.data[0].waypoints.Array.data[0]
      value: 
      objectReference: {fileID: 1995454193}
    - target: {fileID: 8828476860151170620, guid: 73d63f75c4c147d48bb3e8a26500085c, type: 3}
      propertyPath: enemyPaths.Array.data[0].waypoints.Array.data[1]
      value: 
      objectReference: {fileID: 1330062804}
    - target: {fileID: 8828476860151170620, guid: 73d63f75c4c147d48bb3e8a26500085c, type: 3}
      propertyPath: enemyPaths.Array.data[0].waypoints.Array.data[2]
      value: 
      objectReference: {fileID: 1783939457}
    - target: {fileID: 8828476860151170620, guid: 73d63f75c4c147d48bb3e8a26500085c, type: 3}
      propertyPath: enemyPaths.Array.data[0].waypoints.Array.data[3]
      value: 
      objectReference: {fileID: 646438317}
    - target: {fileID: 8828476860151170621, guid: 73d63f75c4c147d48bb3e8a26500085c, type: 3}
      propertyPath: m_LocalPosition.x
      value: 0
      objectReference: {fileID: 0}
    - target: {fileID: 8828476860151170621, guid: 73d63f75c4c147d48bb3e8a26500085c, type: 3}
      propertyPath: m_LocalPosition.y
      value: 0
      objectReference: {fileID: 0}
    - target: {fileID: 8828476860151170621, guid: 73d63f75c4c147d48bb3e8a26500085c, type: 3}
      propertyPath: m_LocalPosition.z
      value: 0
      objectReference: {fileID: 0}
    - target: {fileID: 8828476860151170621, guid: 73d63f75c4c147d48bb3e8a26500085c, type: 3}
      propertyPath: m_LocalRotation.x
      value: 0
      objectReference: {fileID: 0}
    - target: {fileID: 8828476860151170621, guid: 73d63f75c4c147d48bb3e8a26500085c, type: 3}
      propertyPath: m_LocalRotation.y
      value: 0
      objectReference: {fileID: 0}
    - target: {fileID: 8828476860151170621, guid: 73d63f75c4c147d48bb3e8a26500085c, type: 3}
      propertyPath: m_LocalRotation.z
      value: 0
      objectReference: {fileID: 0}
    - target: {fileID: 8828476860151170621, guid: 73d63f75c4c147d48bb3e8a26500085c, type: 3}
      propertyPath: m_LocalRotation.w
      value: 1
      objectReference: {fileID: 0}
    - target: {fileID: 8828476860151170621, guid: 73d63f75c4c147d48bb3e8a26500085c, type: 3}
      propertyPath: m_RootOrder
      value: 2
      objectReference: {fileID: 0}
    - target: {fileID: 8828476860151170621, guid: 73d63f75c4c147d48bb3e8a26500085c, type: 3}
      propertyPath: m_LocalEulerAnglesHint.x
      value: 0
      objectReference: {fileID: 0}
    - target: {fileID: 8828476860151170621, guid: 73d63f75c4c147d48bb3e8a26500085c, type: 3}
      propertyPath: m_LocalEulerAnglesHint.y
      value: 0
      objectReference: {fileID: 0}
    - target: {fileID: 8828476860151170621, guid: 73d63f75c4c147d48bb3e8a26500085c, type: 3}
      propertyPath: m_LocalEulerAnglesHint.z
      value: 0
      objectReference: {fileID: 0}
    - target: {fileID: 8828476860151170622, guid: 73d63f75c4c147d48bb3e8a26500085c, type: 3}
      propertyPath: m_Name
      value: SpawnManager
      objectReference: {fileID: 0}
    - target: {fileID: 8828476860151170623, guid: 73d63f75c4c147d48bb3e8a26500085c, type: 3}
      propertyPath: activeWave.Array.data[0]
      value: 
      objectReference: {fileID: 963252127}
    m_RemovedComponents: []
  m_SourcePrefab: {fileID: 100100000, guid: 73d63f75c4c147d48bb3e8a26500085c, type: 3}
--- !u!1001 &9178912572904123641
PrefabInstance:
  m_ObjectHideFlags: 0
  serializedVersion: 2
  m_Modification:
    m_TransformParent: {fileID: 0}
    m_Modifications:
    - target: {fileID: 9178912572999982161, guid: a0d30e4efc987f8448a6bd7f89bdb98c, type: 3}
      propertyPath: m_Name
      value: INVwallCollider
      objectReference: {fileID: 0}
    - target: {fileID: 9178912572999982162, guid: a0d30e4efc987f8448a6bd7f89bdb98c, type: 3}
      propertyPath: healthslider
      value: 
      objectReference: {fileID: 7590926333335149457}
    - target: {fileID: 9178912572999982162, guid: a0d30e4efc987f8448a6bd7f89bdb98c, type: 3}
      propertyPath: maxWallHealth
      value: 10
      objectReference: {fileID: 0}
    - target: {fileID: 9178912572999982163, guid: a0d30e4efc987f8448a6bd7f89bdb98c, type: 3}
      propertyPath: m_LocalPosition.x
      value: -2.19
      objectReference: {fileID: 0}
    - target: {fileID: 9178912572999982163, guid: a0d30e4efc987f8448a6bd7f89bdb98c, type: 3}
      propertyPath: m_LocalPosition.y
      value: -4.39
      objectReference: {fileID: 0}
    - target: {fileID: 9178912572999982163, guid: a0d30e4efc987f8448a6bd7f89bdb98c, type: 3}
      propertyPath: m_LocalPosition.z
      value: -0.2707395
      objectReference: {fileID: 0}
    - target: {fileID: 9178912572999982163, guid: a0d30e4efc987f8448a6bd7f89bdb98c, type: 3}
      propertyPath: m_LocalRotation.x
      value: 0
      objectReference: {fileID: 0}
    - target: {fileID: 9178912572999982163, guid: a0d30e4efc987f8448a6bd7f89bdb98c, type: 3}
      propertyPath: m_LocalRotation.y
      value: 0
      objectReference: {fileID: 0}
    - target: {fileID: 9178912572999982163, guid: a0d30e4efc987f8448a6bd7f89bdb98c, type: 3}
      propertyPath: m_LocalRotation.z
      value: 0
      objectReference: {fileID: 0}
    - target: {fileID: 9178912572999982163, guid: a0d30e4efc987f8448a6bd7f89bdb98c, type: 3}
      propertyPath: m_LocalRotation.w
      value: 1
      objectReference: {fileID: 0}
    - target: {fileID: 9178912572999982163, guid: a0d30e4efc987f8448a6bd7f89bdb98c, type: 3}
      propertyPath: m_RootOrder
      value: 11
      objectReference: {fileID: 0}
    - target: {fileID: 9178912572999982163, guid: a0d30e4efc987f8448a6bd7f89bdb98c, type: 3}
      propertyPath: m_LocalEulerAnglesHint.x
      value: 0
      objectReference: {fileID: 0}
    - target: {fileID: 9178912572999982163, guid: a0d30e4efc987f8448a6bd7f89bdb98c, type: 3}
      propertyPath: m_LocalEulerAnglesHint.y
      value: 0
      objectReference: {fileID: 0}
    - target: {fileID: 9178912572999982163, guid: a0d30e4efc987f8448a6bd7f89bdb98c, type: 3}
      propertyPath: m_LocalEulerAnglesHint.z
      value: 0
      objectReference: {fileID: 0}
    m_RemovedComponents: []
  m_SourcePrefab: {fileID: 100100000, guid: a0d30e4efc987f8448a6bd7f89bdb98c, type: 3}
