%YAML 1.1
%TAG !u! tag:unity3d.com,2011:
--- !u!74 &7400000
AnimationClip:
  m_ObjectHideFlags: 0
  m_CorrespondingSourceObject: {fileID: 0}
  m_PrefabInstance: {fileID: 0}
  m_PrefabAsset: {fileID: 0}
  m_Name: StandingUpTower
  serializedVersion: 6
  m_Legacy: 0
  m_Compressed: 0
  m_UseHighQualityCurve: 1
  m_RotationCurves: []
  m_CompressedRotationCurves: []
  m_EulerCurves: []
  m_PositionCurves: []
  m_ScaleCurves: []
  m_FloatCurves: []
  m_PPtrCurves:
  - curve:
    - time: 0
      value: {fileID: 21300000, guid: 097a657ea25f72b4ea97280a00ce1d24, type: 3}
    - time: 0.016666668
      value: {fileID: 21300000, guid: 0dca5bc60e7d45e4481abe285997ad7f, type: 3}
    - time: 0.033333335
      value: {fileID: 21300000, guid: 26c20b7d03da0fe4990f22485419a1d1, type: 3}
    - time: 0.05
      value: {fileID: 21300000, guid: ef09e5e2bff3e6745b38f2828a4a4d61, type: 3}
    - time: 0.06666667
      value: {fileID: 21300000, guid: 641934efb30f9a14c98e11ec9d13a70a, type: 3}
    - time: 0.083333336
      value: {fileID: 21300000, guid: fa63c7f544f1faa4aa6b08b3efdcd404, type: 3}
    - time: 0.1
      value: {fileID: 21300000, guid: 81fcbced45981634b81527b15171a88d, type: 3}
    - time: 0.11666667
      value: {fileID: 21300000, guid: 39e9f8395a5731542bfb6f290efd9492, type: 3}
    - time: 0.13333334
      value: {fileID: 21300000, guid: b452fede3ac7e2d4fa95ae0529a528ab, type: 3}
    - time: 0.15
      value: {fileID: 21300000, guid: efd2f9c32ee9c924da19226826b20f93, type: 3}
    - time: 0.16666667
      value: {fileID: 21300000, guid: 46d555882a3cdbd45887ca8d1c41ec50, type: 3}
    - time: 0.18333334
      value: {fileID: 21300000, guid: 714e45a5564096e4f890ce298461689f, type: 3}
    - time: 0.2
      value: {fileID: 21300000, guid: e0ce805cf7cd7b4458b7c43732c73e51, type: 3}
    - time: 0.21666667
      value: {fileID: 21300000, guid: e2f022dda4df7bb409f6219c79fafd23, type: 3}
    - time: 0.23333333
      value: {fileID: 21300000, guid: a2122b154019c3343bcb6f4d938e1e17, type: 3}
    - time: 0.25
      value: {fileID: 21300000, guid: 9d239fbbc89ab514da0eb79414ba5499, type: 3}
    - time: 0.26666668
      value: {fileID: 21300000, guid: 22122fec6c651e844a557ecf4373041a, type: 3}
    - time: 0.28333333
      value: {fileID: 21300000, guid: 938f4b1927861a6469f5537a78a45454, type: 3}
    - time: 0.3
      value: {fileID: 21300000, guid: ecf78d6a5ae800c4a9f0670f5845a99b, type: 3}
    - time: 0.31666666
      value: {fileID: 21300000, guid: 7b0a37ffb263d674bb849b68637ed16e, type: 3}
    - time: 0.33333334
      value: {fileID: 21300000, guid: 3ee5a7e23d8a2e44486312827fd1ae07, type: 3}
    - time: 0.35
      value: {fileID: 21300000, guid: 8fbc9ec8ea903dd4d92f8127648e3321, type: 3}
    - time: 0.36666667
      value: {fileID: 21300000, guid: 9dc85a1200310904898c8d6776d74841, type: 3}
    - time: 0.38333333
      value: {fileID: 21300000, guid: 6137f2c6b44cb744e8bb0a37182e0b7f, type: 3}
    - time: 0.4
      value: {fileID: 21300000, guid: 41ae1728816189543b076d6b2fc7f338, type: 3}
    attribute: m_Sprite
    path: 
    classID: 212
    script: {fileID: 0}
  m_SampleRate: 60
  m_WrapMode: 0
  m_Bounds:
    m_Center: {x: 0, y: 0, z: 0}
    m_Extent: {x: 0, y: 0, z: 0}
  m_ClipBindingConstant:
    genericBindings:
    - serializedVersion: 2
      path: 0
      attribute: 0
      script: {fileID: 0}
      typeID: 212
      customType: 23
      isPPtrCurve: 1
    pptrCurveMapping:
    - {fileID: 21300000, guid: 097a657ea25f72b4ea97280a00ce1d24, type: 3}
    - {fileID: 21300000, guid: 0dca5bc60e7d45e4481abe285997ad7f, type: 3}
    - {fileID: 21300000, guid: 26c20b7d03da0fe4990f22485419a1d1, type: 3}
    - {fileID: 21300000, guid: ef09e5e2bff3e6745b38f2828a4a4d61, type: 3}
    - {fileID: 21300000, guid: 641934efb30f9a14c98e11ec9d13a70a, type: 3}
    - {fileID: 21300000, guid: fa63c7f544f1faa4aa6b08b3efdcd404, type: 3}
    - {fileID: 21300000, guid: 81fcbced45981634b81527b15171a88d, type: 3}
    - {fileID: 21300000, guid: 39e9f8395a5731542bfb6f290efd9492, type: 3}
    - {fileID: 21300000, guid: b452fede3ac7e2d4fa95ae0529a528ab, type: 3}
    - {fileID: 21300000, guid: efd2f9c32ee9c924da19226826b20f93, type: 3}
    - {fileID: 21300000, guid: 46d555882a3cdbd45887ca8d1c41ec50, type: 3}
    - {fileID: 21300000, guid: 714e45a5564096e4f890ce298461689f, type: 3}
    - {fileID: 21300000, guid: e0ce805cf7cd7b4458b7c43732c73e51, type: 3}
    - {fileID: 21300000, guid: e2f022dda4df7bb409f6219c79fafd23, type: 3}
    - {fileID: 21300000, guid: a2122b154019c3343bcb6f4d938e1e17, type: 3}
    - {fileID: 21300000, guid: 9d239fbbc89ab514da0eb79414ba5499, type: 3}
    - {fileID: 21300000, guid: 22122fec6c651e844a557ecf4373041a, type: 3}
    - {fileID: 21300000, guid: 938f4b1927861a6469f5537a78a45454, type: 3}
    - {fileID: 21300000, guid: ecf78d6a5ae800c4a9f0670f5845a99b, type: 3}
    - {fileID: 21300000, guid: 7b0a37ffb263d674bb849b68637ed16e, type: 3}
    - {fileID: 21300000, guid: 3ee5a7e23d8a2e44486312827fd1ae07, type: 3}
    - {fileID: 21300000, guid: 8fbc9ec8ea903dd4d92f8127648e3321, type: 3}
    - {fileID: 21300000, guid: 9dc85a1200310904898c8d6776d74841, type: 3}
    - {fileID: 21300000, guid: 6137f2c6b44cb744e8bb0a37182e0b7f, type: 3}
    - {fileID: 21300000, guid: 41ae1728816189543b076d6b2fc7f338, type: 3}
  m_AnimationClipSettings:
    serializedVersion: 2
    m_AdditiveReferencePoseClip: {fileID: 0}
    m_AdditiveReferencePoseTime: 0
    m_StartTime: 0
    m_StopTime: 0.4166667
    m_OrientationOffsetY: 0
    m_Level: 0
    m_CycleOffset: 0
    m_HasAdditiveReferencePose: 0
    m_LoopTime: 0
    m_LoopBlend: 0
    m_LoopBlendOrientation: 0
    m_LoopBlendPositionY: 0
    m_LoopBlendPositionXZ: 0
    m_KeepOriginalOrientation: 0
    m_KeepOriginalPositionY: 1
    m_KeepOriginalPositionXZ: 0
    m_HeightFromFeet: 0
    m_Mirror: 0
  m_EditorCurves: []
  m_EulerEditorCurves: []
  m_HasGenericRootTransform: 0
  m_HasMotionFloatCurves: 0
  m_Events: []
