{
	"info": {
		"_postman_id": "1efbb8a0-7153-4abc-85f6-c405c7ada36f",
		"name": "cicd-api",
		"description": "API development for CICD",
		"schema": "https://schema.getpostman.com/json/collection/v2.1.0/collection.json"
	},
	"item": [
		{
			"name": "healthy-none",
			"request": {
				"method": "GET",
				"header": [],
				"url": {
					"raw": "ac96d74696fba11eabed20ade1da7c71-1367644835.eu-central-1.elb.amazonaws.com:80/",
					"host": [
						"ac96d74696fba11eabed20ade1da7c71-1367644835",
						"eu-central-1",
						"elb",
						"amazonaws",
						"com"
					],
					"port": "80",
					"path": [
						""
					]
				},
				"description": "Get request for API call back test."
			},
			"response": []
		},
		{
			"name": "post-dict",
			"request": {
				"method": "POST",
				"header": [
					{
						"key": "Content-Type",
						"name": "Content-Type",
						"value": "application/json",
						"type": "text"
					}
				],
				"body": {
					"mode": "raw",
					"raw": "{\n\t\"email\": \"myemail@yahoo.com\",\n\t\"password\": \"password!\"\n}",
					"options": {
						"raw": {
							"language": "json"
						}
					}
				},
				"url": {
					"raw": "ac96d74696fba11eabed20ade1da7c71-1367644835.eu-central-1.elb.amazonaws.com:80/auth",
					"host": [
						"ac96d74696fba11eabed20ade1da7c71-1367644835",
						"eu-central-1",
						"elb",
						"amazonaws",
						"com"
					],
					"port": "80",
					"path": [
						"auth"
					]
				},
				"description": "JWT Token Conversion"
			},
			"response": []
		},
		{
			"name": "contents-token",
			"request": {
				"auth": {
					"type": "bearer",
					"bearer": [
						{
							"key": "token",
							"value": "eyJ0eXAiOiJKV1QiLCJhbGciOiJIUzI1NiJ9.eyJleHAiOjE1ODY0NzU4MDIsIm5iZiI6MTU4NTI2NjIwMiwiZW1haWwiOiJteWVtYWlsQHlhaG9vLmNvbSJ9.FN69ShcDHxFE801YZjagw5RJDQYA24ttFcyX5A7DpiU",
							"type": "string"
						}
					]
				},
				"method": "GET",
				"header": [],
				"url": {
					"raw": "ac96d74696fba11eabed20ade1da7c71-1367644835.eu-central-1.elb.amazonaws.com:80/contents",
					"host": [
						"ac96d74696fba11eabed20ade1da7c71-1367644835",
						"eu-central-1",
						"elb",
						"amazonaws",
						"com"
					],
					"port": "80",
					"path": [
						"contents"
					]
				},
				"description": "send barerer token to decode"
			},
			"response": []
		}
	],
	"protocolProfileBehavior": {}
}