<svg width="39" height="40" viewBox="0 0 39 40" fill="none" xmlns="http://www.w3.org/2000/svg">
<path d="M38.742 20.371C38.742 18.7458 38.6102 17.5599 38.3248 16.3301H19.7676V23.6651H30.6602C30.4407 25.4879 29.2548 28.2331 26.6194 30.0777L26.5825 30.3233L32.4499 34.8687L32.8564 34.9093C36.5898 31.4613 38.742 26.3883 38.742 20.371Z" fill="#4285F4"/>
<path d="M19.7662 39.697C25.1027 39.697 29.5827 37.94 32.8551 34.9094L26.6181 30.0779C24.949 31.2418 22.709 32.0544 19.7662 32.0544C14.5395 32.0544 10.1034 28.6066 8.52201 23.841L8.29022 23.8607L2.18916 28.5823L2.10938 28.8041C5.3596 35.2607 12.0358 39.697 19.7662 39.697Z" fill="#34A853"/>
<path d="M8.52281 23.841C8.10556 22.6111 7.86408 21.2934 7.86408 19.9319C7.86408 18.5702 8.10556 17.2526 8.50086 16.0227L8.48981 15.7608L2.31229 10.9633L2.11018 11.0594C0.770603 13.7387 0.00195312 16.7475 0.00195312 19.9319C0.00195312 23.1162 0.770603 26.1248 2.11018 28.8041L8.52281 23.841Z" fill="#FBBC05"/>
<path d="M19.7662 7.80924C23.4776 7.80924 25.9811 9.4124 27.4087 10.7521L32.9868 5.30572C29.5609 2.12136 25.1027 0.166801 19.7662 0.166801C12.0358 0.166801 5.3596 4.60293 2.10938 11.0595L8.50006 16.0228C10.1034 11.2572 14.5395 7.80924 19.7662 7.80924Z" fill="#EB4335"/>
</svg>
