<svg width="23" height="22" viewBox="0 0 23 22" fill="none" xmlns="http://www.w3.org/2000/svg">
<rect x="1.69141" y="0.75" width="19.6189" height="19.6189" rx="4.25" stroke="white" stroke-width="1.5"/>
<circle cx="11.5024" cy="10.5594" r="4.52972" stroke="white" stroke-width="1.5"/>
<circle cx="17.8372" cy="4.22379" r="0.75" fill="white" stroke="white" stroke-width="0.611888"/>
</svg>
