<svg width="40" height="40" viewBox="0 0 40 40" fill="none" xmlns="http://www.w3.org/2000/svg">
<path d="M1 6L7 8.5L14 27.5" stroke="#585858"/>
<circle cx="16" cy="32" r="4.5" stroke="#585858"/>
<rect x="14.033" y="11.0178" width="15.8198" height="15.8198" transform="rotate(-20.295 14.033 11.0178)" stroke="#585858"/>
<path d="M20.5 31L38 24.5" stroke="#585858"/>
<path d="M21.3438 8.56092L22.9423 13.0269" stroke="#585858"/>
</svg>
