{
  "project_info": {
    "project_number": "961591814082",
    "firebase_url": "https://doubleme-holowalks.firebaseio.com",
    "project_id": "doubleme-holowalks",
    "storage_bucket": "doubleme-holowalks.appspot.com"
  },
  "client": [
    {
      "client_info": {
        "mobilesdk_app_id": "1:961591814082:android:bfc87081c2cbb3d1",
        "android_client_info": {
          "package_name": "com.pygd.holowalks"
        }
      },
      "oauth_client": [
        {
          "client_id": "961591814082-k9dlulucjn968h08l3tkpp64d83v9r0e.apps.googleusercontent.com",
          "client_type": 3
        }
      ],
      "api_key": [
        {
          "current_key": "AIzaSyC12Dy7dIuXwzS-Kq5FAZDVUyq6AswZOjc"
        }
      ],
      "services": {
        "appinvite_service": {
          "other_platform_oauth_client": [
            {
              "client_id": "961591814082-k9dlulucjn968h08l3tkpp64d83v9r0e.apps.googleusercontent.com",
              "client_type": 3
            },
            {
              "client_id": "961591814082-2rpnubic3ves5qp18893l3uo9d3dnp5r.apps.googleusercontent.com",
              "client_type": 2,
              "ios_info": {
                "bundle_id": "com.pygd.holowalks"
              }
            }
          ]
        }
      }
    }
  ],
  "configuration_version": "1"
}