%YAML 1.1
%TAG !u! tag:unity3d.com,2011:
--- !u!114 &11400000
MonoBehaviour:
  m_ObjectHideFlags: 0
  m_CorrespondingSourceObject: {fileID: 0}
  m_PrefabInstance: {fileID: 0}
  m_PrefabAsset: {fileID: 0}
  m_GameObject: {fileID: 0}
  m_Enabled: 1
  m_EditorHideFlags: 0
  m_Script: {fileID: 11500000, guid: 4bb0b5551b599ba4db718d16dce7901a, type: 3}
  m_Name: cloudStorage
  m_EditorClassIdentifier: 
  S3BucketName: holowalks-uploads-develop
  IdentityPoolId: ap-northeast-2:e3658a1e-47a7-4b21-8710-f2e89cdb54b4
  CognitoIdentityRegion: ap-northeast-2
  S3Region: ap-northeast-2
