{
  "name": "Chemistry App",
  "versionCode": 1,
  "lessons": [
    {
      "id": 35,
      "name": "Kinetics I",
      "isPremium": true
    },
    {
      "id": 36,
      "name": "Kinetics II",
      "isPremium": true
    },
    {
      "id": 37,
      "name": "Kinetics III",
      "isPremium": true
    }
  ]
}