{
  "name": "Chemistry App",
  "versionCode": 2,
  "units": [
    {
      "id": 1,
      "name": "Atomic Theory, Nomenclature and Quantitative Chemistry",
      "isPremium": false
    },
    {
      "id": 2,
      "name": "Chemical Bonding",
      "isPremium": false
    },
    {
      "id": 3,
      "name": "Aqueous Solutions and Chemical Reactions",
      "isPremium": true
    },
    {
      "id": 4,
      "name": "Thermodynamics",
      "isPremium": true
    },
    {
      "id": 5,
      "name": "Equilibrium",
      "isPremium": true
    },
    {
      "id": 6,
      "name": "Electrochemistry",
      "isPremium": true
    },
    {
      "id": 7,
      "name": "Intermolecular Forces and Solids",
      "isPremium": true
    },
    {
      "id": 8,
      "name": "Solutions",
      "isPremium": true
    },
    {
      "id": 9,
      "name": "Gases",
      "isPremium": true
    },
    {
      "id": 10,
      "name": "Acids and Bases",
      "isPremium": true
    },
    {
      "id": 11,
      "name": "Kinetics",
      "isPremium": true
    }
  ]
}
