{
  "id": 33,
  "name": "33",
  "isPremium": true,
  "slides": [
    {
      "id": 1,
      "name": "1.png",
      "hasNote": false
    },
    {
      "id": 2,
      "name": "2.png",
      "hasNote": true
    },
    {
      "id": 3,
      "name": "3.png",
      "hasNote": true
    },
    {
      "id": 4,
      "name": "4.png",
      "hasNote": true
    },
    {
      "id": 5,
      "name": "5.png",
      "hasNote": true
    },
    {
      "id": 6,
      "name": "6.png",
      "hasNote": true
    },
    {
      "id": 7,
      "name": "7.png",
      "hasNote": true
    },
    {
      "id": 8,
      "name": "8.png",
      "hasNote": true
    },
    {
      "id": 9,
      "name": "9.png",
      "hasNote": true
    },
    {
      "id": 10,
      "name": "10.png",
      "hasNote": true
    },
    {
      "id": 11,
      "name": "11.png",
      "hasNote": true
    },
    {
      "id": 12,
      "name": "12.png",
      "hasNote": true
    },
    {
      "id": 13,
      "name": "13.png",
      "hasNote": true
    },
    {
      "id": 14,
      "name": "14.png",
      "hasNote": true
    },
    {
      "id": 15,
      "name": "15.png",
      "hasNote": true
    },
    {
      "id": 16,
      "name": "16.png",
      "hasNote": true
    },
    {
      "id": 17,
      "name": "17.png",
      "hasNote": true
    },
    {
      "id": 18,
      "name": "18.png",
      "hasNote": true
    },
    {
      "id": 19,
      "name": "19.png",
      "hasNote": true
    },
    {
      "id": 20,
      "name": "20.png",
      "hasNote": true
    },
    {
      "id": 21,
      "name": "21.png",
      "hasNote": true
    },
    {
      "id": 22,
      "name": "22.png",
      "hasNote": true
    },
    {
      "id": 23,
      "name": "23.png",
      "hasNote": true
    },
    {
      "id": 24,
      "name": "24.png",
      "hasNote": true
    },
    {
      "id": 25,
      "name": "25.png",
      "hasNote": true
    },
    {
      "id": 26,
      "name": "26.png",
      "hasNote": true
    },
    {
      "id": 27,
      "name": "27.png",
      "hasNote": true
    },
    {
      "id": 28,
      "name": "28.png",
      "hasNote": true
    },
    {
      "id": 29,
      "name": "29.png",
      "hasNote": true
    },
    {
      "id": 30,
      "name": "30.png",
      "hasNote": true
    },
    {
      "id": 31,
      "name": "31.png",
      "hasNote": true
    },
    {
      "id": 32,
      "name": "32.png",
      "hasNote": true
    }
  ]
}