{
  "name": "Chemistry App",
  "versionCode": 1,
  "lessons": [
    {
      "id": 21,
      "name": "Electrochemistry I",
      "isPremium": false
    },
    {
      "id": 22,
      "name": "Electrochemistry II",
      "isPremium": false
    },
    {
      "id": 23,
      "name": "Multiple Choice 1",
      "isPremium": false
    },
    {
      "id": 24,
      "name": "Multiple Choice 2",
      "isPremium": false
    },
    {
      "id": 25,
      "name": "Multiple Choice 1",
      "isPremium": true
    },
    {
      "id": 26,
      "name": "Multiple Choice 2",
      "isPremium": true
    }
  ]
}
