2008.12.14 21:49 B D:\bz2\msSQLjdbc\lib\msbase.jar <-- LAN /home/matrix/msSQLjdbc/lib msbase.jar
2008.12.14 21:49 B D:\bz2\msSQLjdbc\lib\mssqlserver.jar <-- LAN /home/matrix/msSQLjdbc/lib mssqlserver.jar
2008.12.14 21:49 B D:\bz2\msSQLjdbc\lib\msutil.jar <-- LAN /home/matrix/msSQLjdbc/lib msutil.jar
