2008.12.14 21:49 B D:\bz2\msSQLjdbc\Help\wwhdata\js\book.js <-- LAN /home/matrix/msSQLjdbc/Help/wwhdata/js book.js
2008.12.14 21:49 B D:\bz2\msSQLjdbc\Help\wwhdata\js\files.js <-- LAN /home/matrix/msSQLjdbc/Help/wwhdata/js files.js
2008.12.14 21:49 B D:\bz2\msSQLjdbc\Help\wwhdata\js\index.js <-- LAN /home/matrix/msSQLjdbc/Help/wwhdata/js index.js
2008.12.14 21:49 B D:\bz2\msSQLjdbc\Help\wwhdata\js\search.js <-- LAN /home/matrix/msSQLjdbc/Help/wwhdata/js search.js
2008.12.14 21:49 B D:\bz2\msSQLjdbc\Help\wwhdata\js\search0.js <-- LAN /home/matrix/msSQLjdbc/Help/wwhdata/js search0.js
2008.12.14 21:49 B D:\bz2\msSQLjdbc\Help\wwhdata\js\search1.js <-- LAN /home/matrix/msSQLjdbc/Help/wwhdata/js search1.js
2008.12.14 21:49 B D:\bz2\msSQLjdbc\Help\wwhdata\js\search10.js <-- LAN /home/matrix/msSQLjdbc/Help/wwhdata/js search10.js
2008.12.14 21:49 B D:\bz2\msSQLjdbc\Help\wwhdata\js\search11.js <-- LAN /home/matrix/msSQLjdbc/Help/wwhdata/js search11.js
2008.12.14 21:49 B D:\bz2\msSQLjdbc\Help\wwhdata\js\search2.js <-- LAN /home/matrix/msSQLjdbc/Help/wwhdata/js search2.js
2008.12.14 21:49 B D:\bz2\msSQLjdbc\Help\wwhdata\js\search3.js <-- LAN /home/matrix/msSQLjdbc/Help/wwhdata/js search3.js
2008.12.14 21:49 B D:\bz2\msSQLjdbc\Help\wwhdata\js\search4.js <-- LAN /home/matrix/msSQLjdbc/Help/wwhdata/js search4.js
2008.12.14 21:49 B D:\bz2\msSQLjdbc\Help\wwhdata\js\search5.js <-- LAN /home/matrix/msSQLjdbc/Help/wwhdata/js search5.js
2008.12.14 21:49 B D:\bz2\msSQLjdbc\Help\wwhdata\js\search6.js <-- LAN /home/matrix/msSQLjdbc/Help/wwhdata/js search6.js
2008.12.14 21:49 B D:\bz2\msSQLjdbc\Help\wwhdata\js\search7.js <-- LAN /home/matrix/msSQLjdbc/Help/wwhdata/js search7.js
2008.12.14 21:49 B D:\bz2\msSQLjdbc\Help\wwhdata\js\search8.js <-- LAN /home/matrix/msSQLjdbc/Help/wwhdata/js search8.js
2008.12.14 21:49 B D:\bz2\msSQLjdbc\Help\wwhdata\js\search9.js <-- LAN /home/matrix/msSQLjdbc/Help/wwhdata/js search9.js
2008.12.14 21:49 B D:\bz2\msSQLjdbc\Help\wwhdata\js\toc.js <-- LAN /home/matrix/msSQLjdbc/Help/wwhdata/js toc.js
