{
    "0": {
        "nl": "add two numbers, and then print the result",
        "tgt_code": "def add_two_numbers(num_1, num_2):\n    result = num_1 + num_2\n    print(result)"
    },
    "1": {
        "nl": "get a number as kilometers from users, and then convert kilometers to miles",
        "tgt_code": "def km_to_miles():\n    km = float(input(\"Kilometers: \"))\n    miles = km * 0.621371\n    return miles"
    },
    "2": {
        "nl": "get a number as temperature in celsius from users, and then convert temperature in celsius to fahrenheit",
        "tgt_code": "def convert_to_fahrenheit():\n    celsius = float(input(\"Celsius: \"))\n    fahrenheit = (celsius * 1.8) + 32\n    return fahrenheit"
    },
    "3": {
        "nl": "get an integer number from users, check if the number is odd or even",
        "tgt_code": "def check_odd_or_even():\n    num = int(input(\"Number: \"))\n    if num % 2 == 0:\n        print(\"The number is even\")\n    else:\n        print(\"The number is odd\")"
    },
    "4": {
        "nl": "count the number of occurrences of each word in a text, and then sort the dictionary in the descending order of occurrences",
        "tgt_code": "from collections import Counter\n\ndef count_words_sort(text):\n    words = text.split()\n    word_counts = Counter(words)\n    sorted_words = sorted(word_counts.items(), key=lambda x: x[1], reverse=True)\n    print(sorted_words)"
    },
    "5": {
        "nl": "convert a string to uppercase, and then replace all spaces in the string with underscores",
        "tgt_code": "def convert_to_upper_snake_case(text):\n    uppercase = text.upper()\n    replaced = uppercase.replace(\" \", \"_\")\n    return replaced"
    },
    "6": {
        "nl": "filter a list of names starting with \"A\", and then sort these names in alphabetical order",
        "tgt_code": "def filter_sort_names(names):\n    filtered = [name for name in names if name.startswith(\"A\")]\n    sorted_names = sorted(filtered)\n    return filtered, sorted_names"
    },
    "7": {
        "nl": "find the square of each number in a list, and then count how many of them are greater than 50",
        "tgt_code": "def find_square_count_greater_than_50(numbers):\n    squares = [number ** 2 for number in numbers]\n    count = sum(1 for num in squares if num > 50)\n    return squares, count"
    },
    "8": {
        "nl": "filter a list of names starting with \"B\", and then count and sort these names in alphabetical order",
        "tgt_code": "def filter_count_sort_names(names):\n    filtered = [name for name in names if name.startswith(\"B\")]\n    count = len(filtered)\n    sorted_names = sorted(filtered)\n    return filtered, count, sorted_names"
    },
	"9": {
		"nl": "count the number of occurrences of each word in a text using Counter, and then sort the dictionary in the descending order of occurrences",
		"tgt_code": "from collections import Counter\n\ndef count_words_sort(text):\n    words = text.split()\n    word_counts = Counter(words)\n    sorted_words = sorted(word_counts.items(), key=lambda x: x[1], reverse=True)\n    print(sorted_words)"
	},
	"10": {
		"nl": "filter a list of names starting with \"B\", and then return these names in alphabetical order",
		"tgt_code": "def filter_sort_names(names):\n    filtered = [name for name in names if name.startswith(\"B\")]\n    sorted_names = sorted(filtered)\n    return sorted_names"
	},
	"11":  {
		"nl": "generate a random integer number between two ranges, and then return the square of the number",
		"tgt_code": "import random\ndef square_of_random_number(star, end):\n    random_number = random.randint(star, end)\n    square = random_number**2\n    return square"
	},
	"12": {
		"nl": "get a number from users, check if the number is positive, negative or 0",
		"tgt_code": "def check_number():\n    number = int(input(\"Enter a number: \"))\n    if number > 0:\n        print(\"Positive number\")\n    elif number == 0:\n        print(\"Zero\")\n    else:\n        print(\"Negative number\")"
	},
	"13": {
		"nl": "find the average of a list of numbers, check if the average is greater than 50",
		"tgt_code": "def check_average(numbers):\n    average = sum(numbers) / len(numbers)\n    if average > 50:\n        return True\n    else:\n        return False "
	},
	"14": {
		"nl": "determine the maximum value of a list of numbers, check if the maximum value is smaller than 100",
		"tgt_code": "def check_max_value(numbers):\n    maximum = max(numbers)\n    if maximum < 100:\n        return True\n    else:\n        return False"
	},
	"15": {
		"nl": "filter a list of numbers that smaller than 1000, and then calculate the minimum value of the filtered numbers list",
		"tgt_code": "def filter_min(numbers):\n    filtered_numbers = filter(lambda x: x < 1000, numbers)\n    minimum = min(filtered_numbers)\n    return minimum"
	},
	"16": {
		"nl": "get a word from users, and then count the occurrences of the word in a given text",
		"tgt_code": "def count_occurrences(text):\n    word = input(\"Enter a word: \")\n    count = text.count(word)\n    return count"
	},
	"17": {
		"nl": "get a text from users, calculate the average word length in the text",
		"tgt_code": "def average_word_length():\n    text = input(\"Enter a text: \")\n    words = text.split()\n    average = sum(len(word) for word in words) / len(words)\n    return average"
	},
	"18": {
		"nl": "get a text from users, find the longest word in the text",
		"tgt_code": "def find_longest_word():\n    text = input(\"Enter a text: \")\n    words = text.split()\n    longest = max(words, key=len)\n    return longest"
	},
	"19": {
		"nl": "find the shortest word in a text, check if the word is longer than 5 characters",
		"tgt_code": "def check_shortest_word(text):\n    words = text.split()\n    shortest = min(words, key=len)\n    if len(shortest) > 5:\n        return True\n    else:\n        return False"
	},
	"20": {
		"nl": "count the number of uppercase letters in a string, check if the number is greater than or equal to 1",
		"tgt_code": "def check_uppercase(string):\n    count = sum(1 for char in string if char.isupper())\n    if count >= 1:\n        return True\n    else:\n        return False"
	},
	"21": {
		"nl": "count the number of lowercase letters in a string, check if the number is equal to length of the string",
		"tgt_code": "def check_lower_case(string):\n    count = sum(1 for char in string if char.islower())\n    if count == len(string):\n        return True\n    else:\n        return False"
	},
	"22": {
		"nl": "count the number of digits in a string, check if the number is greater than or equal to 1",
		"tgt_code": "def check_digit(string):\n    count = sum(1 for char in string if char.isdigit())\n    if count >= 1:\n        return True\n    else:\n        return False"
	},
	"23": {
		"nl": "find the longest word in a text, and then return the length of the word",
		"tgt_code": "def longest_word(text):\n    words = text.split()\n    longest = max(words, key=len)\n    length = len(longest)\n    return length"
	},
	"24": {
		"nl": "strip all spaces on the left and right sides of the string, check if the string starts with a specific substring",
		"tgt_code": "def check_start_with(string, substring):\n    stripped_string = string.strip()\n    check = stripped_string.startswith(substring)\n    return check"
	},
	"25": {
		"nl": "count the occurrences of a substring in a text, check if the number of occurrences is equal to 10",
		"tgt_code": "def check_occurrences(text, substring):\n    count = text.count(substring)\n    if count == 10:\n        return True\n    else:\n        return False"
	},
	"26": {
		"nl": "filter a dataframe including only records with sales greater than 1000, and then write the filtered dataframe to a new csv file",
		"tgt_code": "def filter_sales(df, output_file):\n    filtered_df = df[df[\"Sales\"] > 1000]\n    filtered_df.to_csv(output_file)"
	},
	"27": {
		"nl": "check if a string contains a specific substring, and then return the first index of the substring",
		"tgt_code": "def find_substring(text, substring):\n    check = substring in text\n    if check:\n        index = text.find(substring)\n        return index"
	},
	"28": {
		"nl": "read data from a CSV file with pandas, and then return the number of rows in the dataframe",
		"tgt_code": "import pandas as pd\n\ndef get_num_rows(input_file):\n    df = pd.read_csv(input_file)\n    rows = df.shape[0]\n    return rows"
	}
}