{
  "arity": 3,
  "topK": 1,
  "pseudoCounts": 10,
  "aic": 1,
  "bs": 1000000,
  "topI": 300,
  "structurePenalty": 10,
  "CPUs": 2,
  "DSL": {
    "logVariable": 0,
    "productions": [
      {
        "expression": "concatenate",
        "logProbability": 0
      },
      {
        "expression": "nthString",
        "logProbability": 0
      },
      {
        "expression": "split",
        "logProbability": 0
      },
      {
        "expression": "chr2str",
        "logProbability": 0
      },
      {
        "expression": "nthChar",
        "logProbability": 0
      },
      {
        "expression": "'.'",
        "logProbability": 0
      },
      {
        "expression": "','",
        "logProbability": 0
      },
      {
        "expression": "'-'",
        "logProbability": 0
      },
      {
        "expression": "0",
        "logProbability": 0
      },
      {
        "expression": "1",
        "logProbability": 0
      },
      {
        "expression": "2",
        "logProbability": 0
      },
      {
        "expression": "3",
        "logProbability": 0
      },
      {
        "expression": "4",
        "logProbability": 0
      }
    ]
  },
  "iterations": 99,
  "frontiers": [
    {
      "request": {
        "constructor": "->",
        "arguments": [
          {
            "constructor": "list",
            "arguments": [
              {
                "constructor": "char",
                "arguments": []
              }
            ]
          },
          {
            "constructor": "list",
            "arguments": [
              {
                "constructor": "char",
                "arguments": []
              }
            ]
          }
        ]
      },
      "task": "tb1_initials_inOrder",
      "programs": [
        {
          "program": "(lambda (concatenate (chr2str (nthChar 0 $0)) (chr2str (nthChar 0 (nthString 1 (split ',' $0))))))",
          "logLikelihood": 0
        }
      ]
    },
    {
      "request": {
        "constructor": "->",
        "arguments": [
          {
            "constructor": "list",
            "arguments": [
              {
                "constructor": "char",
                "arguments": []
              }
            ]
          },
          {
            "constructor": "list",
            "arguments": [
              {
                "constructor": "char",
                "arguments": []
              }
            ]
          }
        ]
      },
      "task": "tb1_initials",
      "programs": [
        {
          "program": "(lambda (concatenate (chr2str (nthChar 0 (nthString 1 (split ',' $0)))) (chr2str (nthChar 0 $0))))",
          "logLikelihood": 0
        }
      ]
    }
  ]
}