<?xml version="1.0" standalone="no"?>
<!DOCTYPE svg PUBLIC "-//W3C//DTD SVG 20010904//EN"
 "http://www.w3.org/TR/2001/REC-SVG-20010904/DTD/svg10.dtd">
<svg version="1.0" xmlns="http://www.w3.org/2000/svg"
 width="40px" height="40px" viewBox="0 0 512.000000 512.000000"
 preserveAspectRatio="xMidYMid meet">

<g transform="translate(0.000000,512.000000) scale(0.100000,-0.100000)"
fill="var(--background, black)" stroke="none">
<path d="M690 2560 l0 -2560 1280 0 1280 0 0 640 0 640 -22 4 c-13 3 -59 10
-103 16 -100 15 -258 66 -356 115 -244 124 -444 321 -567 563 -74 144 -112
270 -137 445 l-6 47 -565 0 -566 0 -29 29 c-39 40 -39 82 0 122 l29 29 565 0
564 0 12 78 c68 430 311 775 680 966 144 74 251 107 469 142 l32 5 0 639 0
640 -1280 0 -1280 0 0 -2560z m2344 1524 c34 -35 35 -83 2 -121 l-24 -28
-1047 0 -1047 0 -24 28 c-33 38 -32 86 2 121 l27 26 1042 0 1042 0 27 -26z m2
-2927 c33 -38 32 -86 -2 -121 l-27 -26 -1042 0 -1042 0 -27 26 c-43 44 -29
121 28 144 11 5 484 8 1054 7 l1034 -2 24 -28z"/>
<path d="M3219 3649 c-418 -44 -786 -338 -918 -734 -59 -176 -74 -350 -46
-525 75 -457 411 -808 870 -905 94 -20 297 -23 398 -6 80 14 232 63 302 99
148 74 337 239 419 365 126 194 186 394 186 624 0 303 -119 577 -341 788 -180
171 -395 269 -644 294 -118 12 -116 12 -226 0z m182 -205 l24 -26 3 -384 3
-384 380 0 381 0 29 -29 c20 -20 29 -39 29 -61 0 -22 -9 -41 -29 -61 l-29 -29
-381 0 -380 0 -3 -384 -3 -384 -24 -26 c-30 -32 -87 -35 -122 -7 l-24 19 -5
389 -5 388 -385 5 c-212 3 -391 9 -399 14 -7 5 -19 24 -27 42 -12 29 -12 39 0
68 8 18 20 37 27 42 8 5 187 11 399 14 l385 5 5 388 5 389 24 19 c35 28 92 25
122 -7z"/>
</g>
<title>Add Column</title>
</svg>
