objectid,username,working_title,description,due_date
1,Ally435,pigeon_logo,A logo for my blog about my pet pigeon,10 Aug 2021
2,LemongrabThree,lemon_king,Oil painting of the earl of lemongrab as a 17th-century king,2022-06-01
3,john.doe,starguardiansinged,design sketch for Star Guardian Singed League of Legends skin,06/17/2021
4,Sergio_Torres,marble_statue,a 7' tall marble statue of myself,13.02.2022
5,AlexSchmitt95,album_art,album art for the first 3 of my solo albums, next tuesday
6,AliHusseini,dd_wizard_char,"My Dungeons and Dragons character Grabthar, a dwarven warrior, who looks like me (use picture I sent in WhatsApp for reference", 07 Jul 2021
7,XxX_o_ssjgogeta_o_XxX,Sgt. Johnson from Halo riding a nuclear bomb like in Dr. Strangelove,,Next Tuesday
8,LFP_Jesus,lc_tat,a neat shoulder tattoo design based on lambda calculus. be creative!,10 Aug 2021
9,Jenny_H,portrait_greg,a portrait of my spider plant greg on canvas,18 Sep 2021
