<?xml version="1.0" encoding="utf-8"?>
<!-- Generator: Adobe Illustrator 25.4.1, SVG Export Plug-In . SVG Version: 6.00 Build 0)  -->
<svg version="1.1" id="Ebene_1" xmlns="http://www.w3.org/2000/svg" xmlns:xlink="http://www.w3.org/1999/xlink" x="0px" y="0px"
	 viewBox="0 0 123.8 24.7" style="enable-background:new 0 0 123.8 24.7;" xml:space="preserve">
<style type="text/css">
	.st0{fill:#FFFFFF;}
</style>
<path class="st0" d="M15.5,7.3l-2.4,11.1c-1,4.9-3.3,6.3-7.4,6.3c-4.4,0-6.4-2.2-5.4-7L2.8,5.9c1-4.7,3.4-6,7-6
	C14.6,0,16.5,2.4,15.5,7.3z M8.4,5.8L5.6,18.9c-0.2,0.9,0,1.5,0.6,1.5s0.9-0.5,1.1-1.5l2.8-13.2c0.2-1.1,0-1.4-0.6-1.4
	S8.6,4.7,8.4,5.8L8.4,5.8z"/>
<path class="st0" d="M19,0.4h6.3c5,0,6.1,3,5.3,6.8l-0.5,2.4c-0.9,4.1-2.3,6-6.8,6h-1.8l-1.8,8.8H14L19,0.4z M22.4,11.1h0.5
	c0.9,0,1.3-0.4,1.5-1.6l0.7-3.4c0.3-1.3,0-1.7-0.8-1.7h-0.5L22.4,11.1z"/>
<path class="st0" d="M41.4,14.1h-4.7l-1.1,5.7h5.5l-1.4,4.5H29l5.1-24h10.5l-1,4.5h-4.9l-1,4.6h4.7L41.4,14.1z"/>
<path class="st0" d="M41.7,24.3l5.1-24H53c-0.4,6.6-1,15.6-1,16.6h0.3c0.4-3.8,1.7-13.5,2.2-15.7l0.2-0.9h5.2l-5.1,24h-6.4
	c0.4-6.3,1-15.6,1.1-16.4h-0.3c-0.4,2.7-1.7,13.1-2.3,15.8l-0.1,0.6H41.7z"/>
<path class="st0" d="M61.1,5.1h-2.8V0.4h11.4v4.7h-2.8v19.3h-5.7V5.1z"/>
<path class="st0" d="M75.5,19.3l-0.3,5h-5.8l2.6-24H81l2.5,24h-5.9l-0.3-5L75.5,19.3z M77.1,14.5c-0.1-1.8-0.5-8.1-0.6-9.4h-0.2
	c0,1-0.4,7.1-0.5,9.4H77.1z"/>
<path class="st0" d="M85.2,0.4h6.7c3.7,0,6.3,1.4,6.3,5.4v1.2c0,3-1.2,4.1-2.5,4.5c1.3,0.5,2.9,1.5,2.9,4.5v2.1
	c0,4.5-1.7,6.4-6.5,6.4h-6.8L85.2,0.4z M91.4,9.4c0.6,0,1-0.4,1-1.4V6.1c0-0.8-0.1-1.5-1.2-1.5h-0.5v4.8L91.4,9.4z M90.8,20.1h0.5
	c1,0,1.2-0.6,1.2-1.7v-3.3c0-1.1-0.3-1.6-1.3-1.6h-0.3V20.1z"/>
<path class="st0" d="M100.4,0.4h5.7v19.1h5.3l-0.6,4.9h-10.5V0.4z"/>
<path class="st0" d="M122.9,14.1h-4.4v5.5h5.3l-0.6,4.7h-10.4v-24h10.3v4.7h-4.6v4.3h4.4V14.1z"/>
</svg>
