<svg id="Group_39" data-name="Group 39" xmlns="http://www.w3.org/2000/svg" width="23" height="16.7" viewBox="0 0 23 16.7">
  <rect id="Rectangle_5" data-name="Rectangle 5" width="13" height="1.7" transform="translate(5)"/>
  <rect id="Rectangle_7" data-name="Rectangle 7" width="13" height="1.7" transform="translate(5 15)"/>
  <rect id="Rectangle_6" data-name="Rectangle 6" width="23" height="1.7" transform="translate(0 8)"/>
</svg>
