<svg xmlns="http://www.w3.org/2000/svg" width="25.198" height="22.312" viewBox="0 0 25.198 22.312">
  <g id="add_1_" data-name="add (1)" transform="translate(0 -24)">
    <g id="Group_235" data-name="Group 235" transform="translate(0 24)">
      <g id="Group_234" data-name="Group 234" transform="translate(0 0)">
        <path id="Path_123" data-name="Path 123" d="M1.731,0A1.731,1.731,0,1,1,0,1.731,1.731,1.731,0,0,1,1.731,0Z" transform="translate(7.766 5.506)"/>
        <path id="Path_121" data-name="Path 121" d="M23.707,37.609a5.331,5.331,0,0,0-2.981-1.419v-8.8a3.462,3.462,0,0,0-.986-2.4,3.36,3.36,0,0,0-2.4-.986H3.39a3.462,3.462,0,0,0-2.4.986A3.36,3.36,0,0,0,0,27.39V41.744a3.462,3.462,0,0,0,.986,2.4,3.359,3.359,0,0,0,2.4.986H16.878a5.087,5.087,0,0,0,6.828-7.526ZM1.274,27.39A2.135,2.135,0,0,1,3.39,25.274H17.335a2.135,2.135,0,0,1,2.116,2.116v7.5l-3.558-3.534a.646.646,0,0,0-.914,0L9.617,36.743,5.987,33.088a.646.646,0,0,0-.914,0l-3.8,3.847ZM3.366,43.884V43.86a2.11,2.11,0,0,1-1.491-.625,2.194,2.194,0,0,1-.6-1.491V38.739l4.28-4.28,3.631,3.631a.669.669,0,0,0,.914,0L15.46,32.7l3.51,3.534-.216.072a2.232,2.232,0,0,0-.313.1c-.1.024-.192.072-.289.1a.72.72,0,0,0-.192.1,2.234,2.234,0,0,0-.24.12l-.361.216c-.072.048-.12.072-.192.12-.048.024-.072.048-.12.072a2.9,2.9,0,0,0-.577.5,5.086,5.086,0,0,0-1.491,3.607A5.286,5.286,0,0,0,15.1,42.3c.024.1.048.168.072.264.072.24.144.481.24.721v.024a4.411,4.411,0,0,0,.313.577Zm19.4.024a3.8,3.8,0,0,1-5.314.048c-.1-.1-.192-.216-.289-.313-.072-.072-.144-.168-.216-.24a2.283,2.283,0,0,1-.24-.409c-.048-.1-.1-.168-.144-.264a2.031,2.031,0,0,1-.12-.409c-.024-.1-.072-.216-.1-.313a3.979,3.979,0,0,1-.072-.769,3.859,3.859,0,0,1,1.106-2.693,3.758,3.758,0,0,1,2.693-1.106,3.859,3.859,0,0,1,2.693,1.106,3.717,3.717,0,0,1,1.106,2.693A3.845,3.845,0,0,1,22.769,43.908Z" transform="translate(0 -24)"/>
        <path id="Path_122" data-name="Path 122" d="M292.481,266.516h-1.467v-1.467a.649.649,0,0,0-1.3,0v1.467h-1.467a.649.649,0,1,0,0,1.3h1.467v1.467a.649.649,0,0,0,1.3,0v-1.467h1.467a.649.649,0,1,0,0-1.3Z" transform="translate(-270.313 -249.95)"/>
      </g>
    </g>
  </g>
</svg>
