<svg xmlns="http://www.w3.org/2000/svg" width="14.607" height="14.607" viewBox="0 0 14.607 14.607">
  <g id="instagram" transform="translate(0.15 0.15)">
    <g id="Group_187" data-name="Group 187">
      <g id="Group_186" data-name="Group 186">
        <path id="Path_106" data-name="Path 106" d="M10.151,0h-6A4.161,4.161,0,0,0,0,4.156v6a4.161,4.161,0,0,0,4.156,4.156h6a4.161,4.161,0,0,0,4.156-4.156v-6A4.161,4.161,0,0,0,10.151,0ZM13.19,10.151a3.042,3.042,0,0,1-3.038,3.038h-6a3.042,3.042,0,0,1-3.038-3.038v-6A3.042,3.042,0,0,1,4.156,1.118h6A3.042,3.042,0,0,1,13.19,4.156Z" stroke="#fff" stroke-width="0.3"/>
      </g>
    </g>
    <g id="Group_189" data-name="Group 189" transform="translate(3.297 3.297)">
      <g id="Group_188" data-name="Group 188">
        <path id="Path_107" data-name="Path 107" d="M121.856,118a3.856,3.856,0,1,0,3.856,3.856A3.861,3.861,0,0,0,121.856,118Zm0,6.595a2.739,2.739,0,1,1,2.739-2.739A2.742,2.742,0,0,1,121.856,124.595Z" transform="translate(-118 -118)" stroke="#fff" stroke-width="0.3"/>
      </g>
    </g>
    <g id="Group_191" data-name="Group 191" transform="translate(9.969 3.144)">
      <g id="Group_190" data-name="Group 190" transform="translate(0 0)">
        <circle id="Ellipse_9" data-name="Ellipse 9" cx="0.75" cy="0.75" r="0.75" transform="translate(-0.112 -0.919)" stroke="#fff" stroke-width="0.3"/>
      </g>
    </g>
  </g>
</svg>
