<svg xmlns="http://www.w3.org/2000/svg" width="19.797" height="22.15" viewBox="0 0 19.797 22.15">
  <g id="Group_131" data-name="Group 131" transform="translate(0.65)">
    <g id="Rectangle_2" data-name="Rectangle 2" transform="translate(2.307)" fill="none" stroke="#000" stroke-width="1.3">
      <rect width="13.844" height="22.15" rx="2" stroke="none"/>
      <rect x="0.65" y="0.65" width="12.544" height="20.85" rx="1.35" fill="none"/>
    </g>
    <line id="Line_1" data-name="Line 1" y2="17.535" transform="translate(0 2.307)" fill="none" stroke="#000" stroke-linecap="round" stroke-width="1.3"/>
    <line id="Line_2" data-name="Line 2" y2="17.535" transform="translate(18.497 2.307)" fill="none" stroke="#000" stroke-linecap="round" stroke-width="1.3"/>
  </g>
</svg>
