<svg xmlns="http://www.w3.org/2000/svg" xmlns:xlink="http://www.w3.org/1999/xlink" width="30.648" height="30.2" viewBox="0 0 30.648 30.2">
  <defs>
    <filter id="Path_53" x="0" y="0" width="30.648" height="30.2" filterUnits="userSpaceOnUse">
      <feOffset dy="2" input="SourceAlpha"/>
      <feGaussianBlur stdDeviation="1" result="blur"/>
      <feFlood flood-opacity="0.259"/>
      <feComposite operator="in" in2="blur"/>
      <feComposite in="SourceGraphic"/>
    </filter>
  </defs>
  <g transform="matrix(1, 0, 0, 1, 0, 0)" filter="url(#Path_53)">
    <path id="Path_53-2" data-name="Path 53" d="M24.968,27h-5.6a1.651,1.651,0,0,1-1.681-1.681v-8.4a.529.529,0,0,0-.56-.56h-5.6a.529.529,0,0,0-.56.56v8.4A1.651,1.651,0,0,1,9.282,27h-5.6A1.651,1.651,0,0,1,2,25.319v-10.2a1.612,1.612,0,0,1,.5-1.176L13.148,3.3a1.625,1.625,0,0,1,2.353,0L26.144,13.948a1.612,1.612,0,0,1,.5,1.176v10.2A1.651,1.651,0,0,1,24.968,27ZM11.523,15.236h5.6a1.651,1.651,0,0,1,1.681,1.681v8.4a.529.529,0,0,0,.56.56h5.6a.529.529,0,0,0,.56-.56v-10.2a.509.509,0,0,0-.168-.392L14.716,4.088a.542.542,0,0,0-.784,0L3.288,14.732a.509.509,0,0,0-.168.392v10.2a.529.529,0,0,0,.56.56h5.6a.529.529,0,0,0,.56-.56v-8.4A1.651,1.651,0,0,1,11.523,15.236Z" transform="translate(1 -1.8)" fill="#306060"/>
  </g>
</svg>
