<svg xmlns="http://www.w3.org/2000/svg" width="229" height="318" viewBox="0 0 229 318">
  <g id="Group_1" data-name="Group 1" transform="translate(-279 -200)">
    <g id="Rectangle_1" data-name="Rectangle 1" transform="translate(279 216)" fill="none" stroke="#3e3e3e" stroke-width="10">
      <rect width="229" height="302" stroke="none"/>
      <rect x="5" y="5" width="219" height="292" fill="none"/>
    </g>
    <g id="Path_1" data-name="Path 1" transform="translate(279 200)" fill="#2c2c2a">
      <path d="M 228.5 15.5 L 0.5 15.5 L 0.5 0.5 L 228.5 0.5 L 228.5 15.5 Z" stroke="none"/>
      <path d="M 1 1 L 1 15 L 228 15 L 228 1 L 1 1 M 0 0 L 229 0 L 229 16 L 0 16 L 0 0 Z" stroke="none" fill="#2c2c2a"/>
    </g>
    <g id="Ellipse_1" data-name="Ellipse 1" transform="translate(284 205)" fill="#b5b5b5" stroke="#b5b5b5" stroke-width="1">
      <circle cx="3.5" cy="3.5" r="3.5" stroke="none"/>
      <circle cx="3.5" cy="3.5" r="3" fill="none"/>
    </g>
    <g id="Ellipse_2" data-name="Ellipse 2" transform="translate(293 205)" fill="#b5b5b5" stroke="#b5b5b5" stroke-width="1">
      <circle cx="3.5" cy="3.5" r="3.5" stroke="none"/>
      <circle cx="3.5" cy="3.5" r="3" fill="none"/>
    </g>
    <g id="Ellipse_3" data-name="Ellipse 3" transform="translate(302 205)" fill="#b5b5b5" stroke="#b5b5b5" stroke-width="1">
      <circle cx="3.5" cy="3.5" r="3.5" stroke="none"/>
      <circle cx="3.5" cy="3.5" r="3" fill="none"/>
    </g>
  </g>
</svg>
