<svg xmlns="http://www.w3.org/2000/svg" width="58" height="1" viewBox="0 0 58 1">
  <line id="Line_6" data-name="Line 6" x2="57" transform="translate(0.5 0.5)" fill="none" stroke="#707070" stroke-linecap="round" stroke-width="1" stroke-dasharray="3"/>
</svg>
