﻿{
  "$schema": "https://json.schemastore.org/launchsettings.json",
  "iisSettings": {
    "windowsAuthentication": false,
    "anonymousAuthentication": true,
    "iisExpress": {
      "applicationUrl": "http://localhost:46368",
      "sslPort": 44369
    }
  },
  "profiles": {
    "Cnam.TestValidation.WebApi": {
      "commandName": "Project",
      "dotnetRunMessages": true,
      "launchBrowser": true,
      "launchUrl": "swagger",
      "applicationUrl": "https://localhost:7210;",
      "environmentVariables": {
        "ASPNETCORE_ENVIRONMENT": "Development"
      },
    },
      "Cnam.TestValidation.WebApi.prod": {
        "commandName": "Project",
        "dotnetRunMessages": true,
        "launchBrowser": true,
        "launchUrl": "swagger",
        "applicationUrl": "https://localhost:7210;",
        "environmentVariables": {
          "ASPNETCORE_ENVIRONMENT": "Production"
        }
      },
      "IIS Express": {
        "commandName": "IISExpress",
        "launchBrowser": true,
        "launchUrl": "swagger",
        "environmentVariables": {
          "ASPNETCORE_ENVIRONMENT": "Development"
        }
      }
    }
}
