99954 #UTIL: 350
99955 #UTIL: 600
8998866105125 #UTIL: 900
8992952951290 #UTIL: 1000
8886013300601 #UTIL: 1250
8996001440087 #UTIL: 1250
8992736524306 #UTIL: 1350
8998866604512 #UTIL: 1500
089686386219 #UTIL: 1600
30982 #UTIL: 1650
711844110182 #UTIL: 1650
8991001790071 #UTIL: 1700
8998685024003 #UTIL: 1700
8999999524821 #UTIL: 1750
8991001242983 #UTIL: 1800
99956 #UTIL: 1800
8999999531225 #UTIL: 1850
8999999531232 #UTIL: 1850
8992388111206 #UTIL: 1900
8994504102112 #UTIL: 1900
8994504102129 #UTIL: 1900
8998866602563 #UTIL: 1900
97514 #UTIL: 1950
8993039242577 #UTIL: 2000
8993335515689 #UTIL: 2050
8991002105645 #UTIL: 2100
17281 #UTIL: 2200
089686017700 #UTIL: 2300
8993093665848 #UTIL: 2300
8997032711016 #UTIL: 2300
8992770061010 #UTIL: 2350
8998777110218 #UTIL: 2350
8992742370683 #UTIL: 2400
089686011494 #UTIL: 2450
00703 #UTIL: 2500
089686043297 #UTIL: 2500
089686044119 #UTIL: 2500
8991102385084 #UTIL: 2500
8992770011060 #UTIL: 2500
8992911011324 #UTIL: 2600
8999999524791 #UTIL: 2700
8992716109554 #UTIL: 2750
8992770033208 #UTIL: 2750
8999908043009 #UTIL: 2750
8993093665602 #UTIL: 2800
8992802064026 #UTIL: 2850
14908 #UTIL: 3000
089686048049 #UTIL: 3150
7622300442477 #UTIL: 3200
8991002121041 #UTIL: 3250
8998866608879 #UTIL: 3250
74509 #UTIL: 3300
8991102022347 #UTIL: 3350
8991102021210 #UTIL: 3400
8993351124223 #UTIL: 3400
8994171101289 #UTIL: 3450
8992727000048 #UTIL: 3500
8993226112508 #UTIL: 3500
78903 #UTIL: 3600
8992933325119 #UTIL: 3600
8992741950220 #UTIL: 3650
8886020001287 #UTIL: 3700
8993175538909 #UTIL: 3700
8992752011057 #UTIL: 3750
8998866602570 #UTIL: 3800
8991002101265 #UTIL: 3850
8992946521836 #UTIL: 3850
8998866200851 #UTIL: 3850
8992761166205 #UTIL: 3900
089686420333 #UTIL: 3950
8888103000217 #UTIL: 4000
8999999706081 #UTIL: 4000
8993004785160 #UTIL: 4050
8998009010569 #UTIL: 4100
8992696520103 #UTIL: 4200
97265 #UTIL: 4200
31404 #UTIL: 4300
8999999533731 #UTIL: 4300
8991102385176 #UTIL: 4350
8992858687101 #UTIL: 4400
4801010561309 #UTIL: 4450
00316 #UTIL: 4500
8999999500641 #UTIL: 4500
8999999530426 #UTIL: 4500
8991001780140 #UTIL: 4600
8999999524814 #UTIL: 4600
8995177105776 #UTIL: 4700
8992772198011 #UTIL: 4750
8993189270291 #UTIL: 4750
8886008101091 #UTIL: 4850
8992388112654 #UTIL: 4900
8992753184002 #UTIL: 4900
8998009010231 #UTIL: 4900
089686011036 #UTIL: 5000
089686910704 #UTIL: 5000
8998866605199 #UTIL: 5000
8998866820134 #UTIL: 5000
8999999294021 #UTIL: 5000
8999999534042 #UTIL: 5000
8998009010927 #UTIL: 5100
8998899400204 #UTIL: 5100
8999999526856 #UTIL: 5100
8999999529291 #UTIL: 5100
4902430803380 #UTIL: 5150
4902430745703 #UTIL: 5200
8999999042639 #UTIL: 5200
12878 #UTIL: 5250
8999999058388 #UTIL: 5250
8999999058395 #UTIL: 5250
4711036014140 #UTIL: 5300
8992761164546 #UTIL: 5350
00420372 #UTIL: 5380
8992931005099 #UTIL: 5400
8992933712117 #UTIL: 5400
14888 #UTIL: 5500
8991002105683 #UTIL: 5600
8998899001319 #UTIL: 5650
8996006853387 #UTIL: 5700
8992942120316 #UTIL: 5750
8995757501004 #UTIL: 5750
8886057883672 #UTIL: 5900
8992796011105 #UTIL: 5900
8992796011204 #UTIL: 5900
10306 #UTIL: 6000
8992718853158 #UTIL: 6000
8992907230012 #UTIL: 6000
8992946526824 #UTIL: 6000
8997009510055 #UTIL: 6000
8999999542177 #UTIL: 6000
8991038773382 #UTIL: 6050
8999999706173 #UTIL: 6250
00162319 #UTIL: 6297
089686401011 #UTIL: 6350
8995177108883 #UTIL: 6350
8992775315057 #UTIL: 6400
8887229020031 #UTIL: 6450
8888166336612 #UTIL: 6500
8992775315095 #UTIL: 6500
8990800020013 #UTIL: 6550
8993189271373 #UTIL: 6550
8991038110514 #UTIL: 6650
8997225200037 #UTIL: 6650
8999999501990 #UTIL: 6650
8991102020152 #UTIL: 6700
8998866605137 #UTIL: 6700
25899 #UTIL: 6750
8935001724384 #UTIL: 6800
7622210462534 #UTIL: 6850
089686010015 #UTIL: 6900
8858702410656 #UTIL: 6900
8993417489914 #UTIL: 6900
8993189270338 #UTIL: 6950
8992907140014 #UTIL: 7000
8999999034153 #UTIL: 7000
8886013281481 #UTIL: 7050
8992931025035 #UTIL: 7100
8998866104098 #UTIL: 7100
8999999707774 #UTIL: 7100
8996196076405 #UTIL: 7200
8998103012483 #UTIL: 7250
8993189320279 #UTIL: 7300
8996001440360 #UTIL: 7300
8851019210117 #UTIL: 7350
8851019210124 #UTIL: 7350
8888166607415 #UTIL: 7350
8998866608305 #UTIL: 7400
8995077603099 #UTIL: 7500
8999908214805 #UTIL: 7500
8992760221028 #UTIL: 7550
8995077601439 #UTIL: 7700
8998899013091 #UTIL: 7700
8999999518738 #UTIL: 7700
8992718853561 #UTIL: 7800
8993560033286 #UTIL: 7850
8886013402206 #UTIL: 8100
8991002103764 #UTIL: 8250
8992804901541 #UTIL: 8400
8991002103788 #UTIL: 8500
00355063 #UTIL: 8550
8888166336568 #UTIL: 8550
8997212600017 #UTIL: 8600
55651 #UTIL: 8700
97908 #UTIL: 8800
8999999001247 #UTIL: 8900
8888166607392 #UTIL: 9000
8888166991224 #UTIL: 9000
8995077602658 #UTIL: 9050
8888166992559 #UTIL: 9100
8888166995475 #UTIL: 9100
8991102021418 #UTIL: 9100
8991001302434 #UTIL: 9150
8993024210079 #UTIL: 9200
089686598056 #UTIL: 9300
8991038111757 #UTIL: 9500
8992994110112 #UTIL: 9500
8993200664054 #UTIL: 9500
8998866609050 #UTIL: 9500
8991038110354 #UTIL: 9600
8998288016825 #UTIL: 9650
089686598599 #UTIL: 9750
8992770096128 #UTIL: 9750
8993093665473 #UTIL: 9800
8999225783770 #UTIL: 9800
8992745320074 #UTIL: 9850
10153 #UTIL: 10000
12818 #UTIL: 10000
8992761136277 #UTIL: 10000
8998889308046 #UTIL: 10100
8999908286802 #UTIL: 10300
089686040166 #UTIL: 10350
4902430542753 #UTIL: 10400
8991111153094 #UTIL: 10400
8998866500708 #UTIL: 10400
4902430557139 #UTIL: 10450
8999999012625 #UTIL: 10450
8992933651218 #UTIL: 10500
8992947110060 #UTIL: 10500
8999999537180 #UTIL: 10500
4902430870962 #UTIL: 10550
00149815 #UTIL: 10623
4902430566896 #UTIL: 10700
4902430566889 #UTIL: 10750
8999999059347 #UTIL: 10800
089686598421 #UTIL: 10900
4902430566988 #UTIL: 10900
8999999528812 #UTIL: 10900
00251 #UTIL: 11000
8997029070027 #UTIL: 11000
8999999710873 #UTIL: 11000
98795 #UTIL: 11000
8886030633904 #UTIL: 11050
8993175538862 #UTIL: 11100
8999999034160 #UTIL: 11200
8992745999997 #UTIL: 11300
8995899250228 #UTIL: 11300
8992736025162 #UTIL: 11400
8990800014227 #UTIL: 11450
8992753700509 #UTIL: 11550
8901526540068 #UTIL: 11600
8995077603310 #UTIL: 11600
8998866200448 #UTIL: 11650
8992856893689 #UTIL: 11800
8999999501594 #UTIL: 11850
8886013223207 #UTIL: 11900
8886020001089 #UTIL: 11900
8992727005142 #UTIL: 11950
8999225906377 #UTIL: 11950
8992802095068 #UTIL: 12000
8992907110017 #UTIL: 12000
089686010343 #UTIL: 12100
8998009020186 #UTIL: 12200
089686400465 #UTIL: 12250
14907 #UTIL: 12300
50819317 #UTIL: 12450
96349 #UTIL: 12550
8992946121012 #UTIL: 12650
8993189270314 #UTIL: 12650
8997014450216 #UTIL: 12800
4902430401173 #UTIL: 12900
8999999407919 #UTIL: 12900
8992745326694 #UTIL: 12950
711844110083 #UTIL: 13000
8991001780430 #UTIL: 13000
8999999047221 #UTIL: 13200
8992745560203 #UTIL: 13300
8992761136222 #UTIL: 13300
8992856898172 #UTIL: 13300
8993379500221 #UTIL: 13300
8998103012605 #UTIL: 13450
8993053121360 #UTIL: 13550
8992979130012 #UTIL: 13600
8992772193085 #UTIL: 13700
57169 #UTIL: 13850
8992222072502 #UTIL: 14000
8999999525941 #UTIL: 14100
8999777010638 #UTIL: 14150
8992946521829 #UTIL: 14200
8992222090858 #UTIL: 14550
8992748195204 #UTIL: 14550
8992856891654 #UTIL: 14600
089686010046 #UTIL: 14700
16188 #UTIL: 14700
8991001111289 #UTIL: 14700
8992727005289 #UTIL: 14700
8995077600135 #UTIL: 14750
8992832601628 #UTIL: 14900
8999999007782 #UTIL: 14900
8999999533724 #UTIL: 14910
8992772195096 #UTIL: 14950
55673 #UTIL: 15000
8999999500399 #UTIL: 15000
8999999524807 #UTIL: 15000
8998989300155 #UTIL: 15100
011747233033 #UTIL: 15200
8886030229916 #UTIL: 15300
8999979004541 #UTIL: 15400
16660 #UTIL: 15600
8999999049409 #UTIL: 15700
8992222051392 #UTIL: 15750
8992745550532 #UTIL: 15850
8992952925765 #UTIL: 15850
8993560025168 #UTIL: 15850
8997207941576 #UTIL: 15900
13144 #UTIL: 16000
8995077600166 #UTIL: 16000
8999999008499 #UTIL: 16000
8992696430280 #UTIL: 16150
8990800016146 #UTIL: 16200
8992747180201 #UTIL: 16350
8999777000387 #UTIL: 16650
8999777012984 #UTIL: 16700
17273 #UTIL: 16800
55906 #UTIL: 16850
8992779268403 #UTIL: 17000
8992736925134 #UTIL: 17150
13319 #UTIL: 17200
8886012800270 #UTIL: 17250
8934839119577 #UTIL: 17250
8993560033002 #UTIL: 17350
8992696430266 #UTIL: 17400
8886020033370 #UTIL: 17500
14912 #UTIL: 17550
8999999527372 #UTIL: 17650
8992696428690 #UTIL: 17700
8998009010262 #UTIL: 17700
8999999706180 #UTIL: 17850
00231 #UTIL: 18050
8999999016128 #UTIL: 18150
8886012800317 #UTIL: 18300
8992772198059 #UTIL: 18300
00133173 #UTIL: 18409
28453 #UTIL: 18450
17306 #UTIL: 18600
8992998057130 #UTIL: 19000
8886022930240 #UTIL: 19200
089686596250 #UTIL: 19300
8853301200301 #UTIL: 19500
8992753102204 #UTIL: 19600
4902430787468 #UTIL: 19850
8999999540210 #UTIL: 20000
8994357010015 #UTIL: 20550
9310022807619 #UTIL: 20800
8999999041748 #UTIL: 21250
8991111153117 #UTIL: 21700
8999999530433 #UTIL: 21800
8991111101699 #UTIL: 22250
8999999006204 #UTIL: 22600
25334 #UTIL: 22650
6908594424087 #UTIL: 22650
8999999039110 #UTIL: 22950
8991002105423 #UTIL: 23100
8999999049447 #UTIL: 23100
8993379500238 #UTIL: 23200
8999999525729 #UTIL: 23200
8992727004381 #UTIL: 23400
8993200661657 #UTIL: 23400
8992138235008 #UTIL: 23500
8999999529734 #UTIL: 23600
00217071 #UTIL: 23952
8886020001133 #UTIL: 24200
8992745130420 #UTIL: 24300
8993351124209 #UTIL: 24400
8993110071119 #UTIL: 24500
4902430737142 #UTIL: 25100
8995177102058 #UTIL: 25400
089686043204 #UTIL: 2500
089686043204 8992775204009 #UTIL: 25450
8992775204009 #UTIL: 22950
8999999053031 #UTIL: 25800
76164217 #UTIL: 25900
8999999549299 #UTIL: 26600
4801010560500 #UTIL: 26700
8996001603017 #UTIL: 26700
8992826112062 #UTIL: 26750
8998889712003 #UTIL: 27000
8992222054980 #UTIL: 27150
8992628022156 #UTIL: 27200
7614500010310 #UTIL: 27350
12364 #UTIL: 27450
8999999534844 #UTIL: 27500
8999999390198 #UTIL: 27750
8992779261206 #UTIL: 27900
8992138222503 #UTIL: 28200
8998866607346 #UTIL: 28800
8992745120476 #UTIL: 28900
4800888141125 #UTIL: 29000
8853301550062 #UTIL: 29000
9300830022557 #UTIL: 29000
9300830038527 #UTIL: 29050
9556182023272 #UTIL: 29450
4902430832748 #UTIL: 29500
8886015726409 #UTIL: 29700
8992748195303 #UTIL: 29800
8999999045913 #UTIL: 30000
8992222053136 #UTIL: 30500
8998866608732 #UTIL: 30500
8888826019589 #UTIL: 30600
8992304073441 #UTIL: 30950
8999999528881 #UTIL: 30950
8993560145019 #UTIL: 31000
8999999003043 #UTIL: 31000
8999999049485 #UTIL: 31400
089686010947 #UTIL: 32320
8998866612210 #UTIL: 33000
22093 #UTIL: 33200
8993189270628 #UTIL: 33600
8992802618731 #UTIL: 33700
6946537047443 #UTIL: 33800
8999999533717 #UTIL: 34180
8992907952631 #UTIL: 36000
8998866608084 #UTIL: 37600
8992138215000 #UTIL: 37950
8992759174021 #UTIL: 38450
8999999518998 #UTIL: 38500
8992696405240 #UTIL: 39100
12133 #UTIL: 39750
4902430733021 #UTIL: 40950
8992802220040 #UTIL: 40950
00537179 #UTIL: 41017
66799 #UTIL: 41700
8997212370095 #UTIL: 44000
Z0015 #UTIL: 44950
8998866610223 #UTIL: 45450
8992747180225 #UTIL: 46850
8993053121018 #UTIL: 46900
8992759313529 #UTIL: 49500
14733 #UTIL: 52700
8850007700050 #UTIL: 54100
8993018519003 #UTIL: 54650
66808 #UTIL: 55000
8992761002015 #UTIL: 55800
8998889160194 #UTIL: 56400
8991818000004 #UTIL: 57000
8850125072893 #UTIL: 57700
8993005116017 #UTIL: 59700
8992694247415 #UTIL: 61650
8999999520113 #UTIL: 71900
00373258 #UTIL: 72273
8886008101053 #UTIL: 72620
8998889851726 #UTIL: 73200
8994171101371 #UTIL: 73500
8999099920714 #UTIL: 79450
8999999028466 #UTIL: 82950
8992696405493 #UTIL: 85700
44580 #UTIL: 90600
8718696820742 #UTIL: 96300
9129 #UTIL: 111400
8999999514556 #UTIL: 124200
8999979003070 #UTIL: 151800
9415007022633 #UTIL: 167100
13037 #UTIL: 180600
