\relax 
\providecommand\hyper@newdestlabel[2]{}
\providecommand\babel@aux[2]{}
\@nameuse{bbl@beforestart}
\catcode `"\active 
\providecommand\HyperFirstAtBeginDocument{\AtBeginDocument}
\HyperFirstAtBeginDocument{\ifx\hyper@anchor\@undefined
\global\let\oldcontentsline\contentsline
\gdef\contentsline#1#2#3#4{\oldcontentsline{#1}{#2}{#3}}
\global\let\oldnewlabel\newlabel
\gdef\newlabel#1#2{\newlabelxx{#1}#2}
\gdef\newlabelxx#1#2#3#4#5#6{\oldnewlabel{#1}{{#2}{#3}}}
\AtEndDocument{\ifx\hyper@anchor\@undefined
\let\contentsline\oldcontentsline
\let\newlabel\oldnewlabel
\fi}
\fi}
\global\let\hyper@last\relax 
\gdef\HyperFirstAtBeginDocument#1{#1}
\providecommand\HyField@AuxAddToFields[1]{}
\providecommand\HyField@AuxAddToCoFields[2]{}
\babel@aux{slovene}{}
\@writefile{toc}{\contentsline {section}{\numberline {1}Uvod}{2}{section.1}\protected@file@percent }
\@writefile{toc}{\contentsline {section}{\numberline {2}Strojno učenje}{3}{section.2}\protected@file@percent }
\@writefile{toc}{\contentsline {subsection}{\numberline {2.1}Analiza podatkov}{4}{subsection.2.1}\protected@file@percent }
\@writefile{lof}{\contentsline {figure}{\numberline {1}{\ignorespaces width=0.5\textwidth }}{4}{figure.1}\protected@file@percent }
\newlabel{fig:hists}{{1}{4}{width=0.5\textwidth }{figure.1}{}}
\@writefile{lof}{\contentsline {figure}{\numberline {2}{\ignorespaces width=0.5\textwidth }}{5}{figure.2}\protected@file@percent }
\newlabel{fig:correlations}{{2}{5}{width=0.5\textwidth }{figure.2}{}}
\@writefile{toc}{\contentsline {subsection}{\numberline {2.2}BDT}{5}{subsection.2.2}\protected@file@percent }
\@writefile{toc}{\contentsline {subsubsection}{\numberline {2.2.1}Primerjava glede na vhodne podatke}{6}{subsubsection.2.2.1}\protected@file@percent }
\@writefile{lot}{\contentsline {table}{\numberline {1}{\ignorespaces ROC AUC vrednosti za izbrano karakteristiko}}{7}{table.1}\protected@file@percent }
\newlabel{tab:roc_bdt}{{1}{7}{ROC AUC vrednosti za izbrano karakteristiko}{table.1}{}}
\@writefile{lof}{\contentsline {figure}{\numberline {3}{\ignorespaces width=0.5\textwidth }}{7}{figure.3}\protected@file@percent }
\newlabel{fig:BDT_Roc_podatki}{{3}{7}{width=0.5\textwidth }{figure.3}{}}
\newlabel{fig:bdt_ml_score0}{{4(a)}{8}{Subfigure 4(a)}{subfigure.4.1}{}}
\newlabel{sub@fig:bdt_ml_score0}{{(a)}{8}{Subfigure 4(a)\relax }{subfigure.4.1}{}}
\newlabel{fig:bdt_ml_score1}{{4(b)}{8}{Subfigure 4(b)}{subfigure.4.2}{}}
\newlabel{sub@fig:bdt_ml_score1}{{(b)}{8}{Subfigure 4(b)\relax }{subfigure.4.2}{}}
\newlabel{fig:bdt_ml_score2}{{4(c)}{8}{Subfigure 4(c)}{subfigure.4.3}{}}
\newlabel{sub@fig:bdt_ml_score2}{{(c)}{8}{Subfigure 4(c)\relax }{subfigure.4.3}{}}
\@writefile{lof}{\contentsline {figure}{\numberline {4}{\ignorespaces Napovedni histogrami BDT modela v različnih kombinacijah vhodnih karakteristik.}}{8}{figure.4}\protected@file@percent }
\newlabel{fig:bdt_roc_combined}{{4}{8}{Napovedni histogrami BDT modela v različnih kombinacijah vhodnih karakteristik}{figure.4}{}}
\@writefile{toc}{\contentsline {subsubsection}{\numberline {2.2.2}Primerjava glede na parametre modela}{8}{subsubsection.2.2.2}\protected@file@percent }
\@writefile{lof}{\contentsline {figure}{\numberline {5}{\ignorespaces width=0.5\textwidth }}{8}{figure.5}\protected@file@percent }
\newlabel{fig:bdt_max_depth}{{5}{8}{width=0.5\textwidth }{figure.5}{}}
\@writefile{lof}{\contentsline {subfigure}{\numberline{(a)}{\ignorespaces {}}}{8}{figure.5}\protected@file@percent }
\@writefile{lof}{\contentsline {subfigure}{\numberline{(b)}{\ignorespaces {}}}{8}{figure.5}\protected@file@percent }
\@writefile{lof}{\contentsline {subfigure}{\numberline{(c)}{\ignorespaces {}}}{8}{figure.5}\protected@file@percent }
\@writefile{lof}{\contentsline {figure}{\numberline {6}{\ignorespaces width=0.5\textwidth }}{9}{figure.6}\protected@file@percent }
\newlabel{fig:bdt_learning_rate}{{6}{9}{width=0.5\textwidth }{figure.6}{}}
\@writefile{lot}{\contentsline {table}{\numberline {2}{\ignorespaces Primerjava ROC AUC vrednosti za različne vrste normalizacije. Uporabljeni so bili parametri: maksimalna globina dreves = 8, korak učenja = 0.1 in maksimalno število dreves = 1500 (vsi načini so maksimum ROC AUC dosegli okoli iteracije 1000).}}{10}{table.2}\protected@file@percent }
\newlabel{tab:BDT_norm}{{2}{10}{Primerjava ROC AUC vrednosti za različne vrste normalizacije. Uporabljeni so bili parametri: maksimalna globina dreves = 8, korak učenja = 0.1 in maksimalno število dreves = 1500 (vsi načini so maksimum ROC AUC dosegli okoli iteracije 1000)}{table.2}{}}
\@writefile{lof}{\contentsline {figure}{\numberline {7}{\ignorespaces width=0.5\textwidth }}{10}{figure.7}\protected@file@percent }
\newlabel{fig:bdt_best1}{{7}{10}{width=0.5\textwidth }{figure.7}{}}
\@writefile{lof}{\contentsline {figure}{\numberline {8}{\ignorespaces width=0.5\textwidth }}{10}{figure.8}\protected@file@percent }
\newlabel{fig:bdt_best2}{{8}{10}{width=0.5\textwidth }{figure.8}{}}
\@writefile{lof}{\contentsline {figure}{\numberline {9}{\ignorespaces width=0.5\textwidth }}{11}{figure.9}\protected@file@percent }
\newlabel{fig:bdt_hists}{{9}{11}{width=0.5\textwidth }{figure.9}{}}
\@writefile{toc}{\contentsline {subsection}{\numberline {2.3}DNN}{11}{subsection.2.3}\protected@file@percent }
\@writefile{toc}{\contentsline {subsubsection}{\numberline {2.3.1}Primerjava glede na vhodne podatke}{12}{subsubsection.2.3.1}\protected@file@percent }
\@writefile{lof}{\contentsline {figure}{\numberline {10}{\ignorespaces ROC krivulja za DNN model. Opazujemo primerjavo med uporabljenimi karakteristikami.}}{12}{figure.10}\protected@file@percent }
\newlabel{fig:dnn_roc_curve}{{10}{12}{ROC krivulja za DNN model. Opazujemo primerjavo med uporabljenimi karakteristikami}{figure.10}{}}
\newlabel{fig:dnn_ml_score0}{{11(a)}{12}{Subfigure 11(a)}{subfigure.11.1}{}}
\newlabel{sub@fig:dnn_ml_score0}{{(a)}{12}{Subfigure 11(a)\relax }{subfigure.11.1}{}}
\newlabel{fig:dnn_ml_score1}{{11(b)}{12}{Subfigure 11(b)}{subfigure.11.2}{}}
\newlabel{sub@fig:dnn_ml_score1}{{(b)}{12}{Subfigure 11(b)\relax }{subfigure.11.2}{}}
\newlabel{fig:dnn_ml_score2}{{11(c)}{12}{Subfigure 11(c)}{subfigure.11.3}{}}
\newlabel{sub@fig:dnn_ml_score2}{{(c)}{12}{Subfigure 11(c)\relax }{subfigure.11.3}{}}
\@writefile{lof}{\contentsline {figure}{\numberline {11}{\ignorespaces Napovedni histogrami DNN modela v različnih kombinacijah vhodnih karakteristik.}}{12}{figure.11}\protected@file@percent }
\newlabel{fig:dnn_hists}{{11}{12}{Napovedni histogrami DNN modela v različnih kombinacijah vhodnih karakteristik}{figure.11}{}}
\@writefile{lof}{\contentsline {subfigure}{\numberline{(a)}{\ignorespaces {}}}{12}{figure.11}\protected@file@percent }
\@writefile{lof}{\contentsline {subfigure}{\numberline{(b)}{\ignorespaces {}}}{12}{figure.11}\protected@file@percent }
\@writefile{lof}{\contentsline {subfigure}{\numberline{(c)}{\ignorespaces {}}}{12}{figure.11}\protected@file@percent }
\@writefile{toc}{\contentsline {subsubsection}{\numberline {2.3.2}Primerjava glede na parametre modela}{12}{subsubsection.2.3.2}\protected@file@percent }
\@writefile{lof}{\contentsline {figure}{\numberline {12}{\ignorespaces width=0.5\textwidth }}{13}{figure.12}\protected@file@percent }
\newlabel{fig:dnn_batch}{{12}{13}{width=0.5\textwidth }{figure.12}{}}
\@writefile{lot}{\contentsline {table}{\numberline {3}{\ignorespaces Primerjava vrednosti ROC AUC za različne spremembe parametrov.}}{14}{table.3}\protected@file@percent }
\newlabel{tab:roc_auc_comparison}{{3}{14}{Primerjava vrednosti ROC AUC za različne spremembe parametrov}{table.3}{}}
\@writefile{lof}{\contentsline {figure}{\numberline {13}{\ignorespaces width=0.5\textwidth }}{14}{figure.13}\protected@file@percent }
\newlabel{fig:dnn_norm1}{{13}{14}{width=0.5\textwidth }{figure.13}{}}
\@writefile{lof}{\contentsline {figure}{\numberline {14}{\ignorespaces width=0.5\textwidth }}{15}{figure.14}\protected@file@percent }
\newlabel{fig:dnn_norm2}{{14}{15}{width=0.5\textwidth }{figure.14}{}}
\@writefile{lof}{\contentsline {figure}{\numberline {15}{\ignorespaces width=0.5\textwidth }}{15}{figure.15}\protected@file@percent }
\newlabel{fig:dnn_sloji1}{{15}{15}{width=0.5\textwidth }{figure.15}{}}
\@writefile{lof}{\contentsline {figure}{\numberline {16}{\ignorespaces width=0.5\textwidth }}{16}{figure.16}\protected@file@percent }
\newlabel{fig:dnn_sloji2}{{16}{16}{width=0.5\textwidth }{figure.16}{}}
\newlabel{fig:dnn_batch_roc_curve}{{17(a)}{16}{Subfigure 17(a)}{subfigure.17.1}{}}
\newlabel{sub@fig:dnn_batch_roc_curve}{{(a)}{16}{Subfigure 17(a)\relax }{subfigure.17.1}{}}
\newlabel{fig:dnn_batch_ml_score}{{17(b)}{16}{Subfigure 17(b)}{subfigure.17.2}{}}
\newlabel{sub@fig:dnn_batch_ml_score}{{(b)}{16}{Subfigure 17(b)\relax }{subfigure.17.2}{}}
\@writefile{lof}{\contentsline {figure}{\numberline {17}{\ignorespaces ROC krivulja in napovedni histogram za končni model.}}{16}{figure.17}\protected@file@percent }
\newlabel{fig:dnn_best1}{{17}{16}{ROC krivulja in napovedni histogram za končni model}{figure.17}{}}
\@writefile{lof}{\contentsline {subfigure}{\numberline{(a)}{\ignorespaces {}}}{16}{figure.17}\protected@file@percent }
\@writefile{lof}{\contentsline {subfigure}{\numberline{(b)}{\ignorespaces {}}}{16}{figure.17}\protected@file@percent }
\@writefile{lof}{\contentsline {figure}{\numberline {18}{\ignorespaces width=0.5\textwidth }}{17}{figure.18}\protected@file@percent }
\newlabel{fig:dnn_best2}{{18}{17}{width=0.5\textwidth }{figure.18}{}}
\@writefile{lof}{\contentsline {figure}{\numberline {19}{\ignorespaces width=0.5\textwidth }}{17}{figure.19}\protected@file@percent }
\newlabel{fig:dnn_best3}{{19}{17}{width=0.5\textwidth }{figure.19}{}}
\bibstyle{plain}
\@writefile{lof}{\contentsline {figure}{\numberline {20}{\ignorespaces width=0.5\textwidth }}{18}{figure.20}\protected@file@percent }
\newlabel{fig:overtraining1}{{20}{18}{width=0.5\textwidth }{figure.20}{}}
\@writefile{lof}{\contentsline {figure}{\numberline {21}{\ignorespaces width=0.5\textwidth }}{18}{figure.21}\protected@file@percent }
\newlabel{fig:overtraining2}{{21}{18}{width=0.5\textwidth }{figure.21}{}}
\@writefile{toc}{\contentsline {section}{\numberline {3}Ugotovitve}{18}{section.3}\protected@file@percent }
\@writefile{toc}{\contentsline {section}{\numberline {4}Zaključek}{18}{section.4}\protected@file@percent }
\bibcite{geron2019hands-on}{1}
\bibcite{prokhorenkova2017catboost}{2}
\bibcite{Chen_2016}{3}
\bibcite{Baldi:2014kfa}{4}
\gdef \@abspage@last{20}
