\BOOKMARK [1][-]{section.1}{\376\377\000U\000v\000o\000d}{}% 1
\BOOKMARK [1][-]{section.2}{\376\377\000S\000t\000r\000o\000j\000n\000o\000\040\000u\001\015\000e\000n\000j\000e}{}% 2
\BOOKMARK [2][-]{subsection.2.1}{\376\377\000A\000n\000a\000l\000i\000z\000a\000\040\000p\000o\000d\000a\000t\000k\000o\000v}{section.2}% 3
\BOOKMARK [2][-]{subsection.2.2}{\376\377\000B\000D\000T}{section.2}% 4
\BOOKMARK [3][-]{subsubsection.2.2.1}{\376\377\000P\000r\000i\000m\000e\000r\000j\000a\000v\000a\000\040\000g\000l\000e\000d\000e\000\040\000n\000a\000\040\000v\000h\000o\000d\000n\000e\000\040\000p\000o\000d\000a\000t\000k\000e}{subsection.2.2}% 5
\BOOKMARK [3][-]{subsubsection.2.2.2}{\376\377\000P\000r\000i\000m\000e\000r\000j\000a\000v\000a\000\040\000g\000l\000e\000d\000e\000\040\000n\000a\000\040\000p\000a\000r\000a\000m\000e\000t\000r\000e\000\040\000m\000o\000d\000e\000l\000a}{subsection.2.2}% 6
\BOOKMARK [2][-]{subsection.2.3}{\376\377\000D\000N\000N}{section.2}% 7
\BOOKMARK [3][-]{subsubsection.2.3.1}{\376\377\000P\000r\000i\000m\000e\000r\000j\000a\000v\000a\000\040\000g\000l\000e\000d\000e\000\040\000n\000a\000\040\000v\000h\000o\000d\000n\000e\000\040\000p\000o\000d\000a\000t\000k\000e}{subsection.2.3}% 8
\BOOKMARK [3][-]{subsubsection.2.3.2}{\376\377\000P\000r\000i\000m\000e\000r\000j\000a\000v\000a\000\040\000g\000l\000e\000d\000e\000\040\000n\000a\000\040\000p\000a\000r\000a\000m\000e\000t\000r\000e\000\040\000m\000o\000d\000e\000l\000a}{subsection.2.3}% 9
\BOOKMARK [1][-]{section.3}{\376\377\000U\000g\000o\000t\000o\000v\000i\000t\000v\000e}{}% 10
\BOOKMARK [1][-]{section.4}{\376\377\000Z\000a\000k\000l\000j\000u\001\015\000e\000k}{}% 11
