{
  "npmci": {
    "npmGlobalTools": [],
    "npmAccessLevel": "public"
  },
  "gitzone": {
    "projectType": "npm",
    "module": {
      "githost": "gitlab.com",
      "gitscope": "push.rocks",
      "gitrepo": "smarttime",
      "description": "handle time in smart ways",
      "npmPackagename": "@push.rocks/smarttime",
      "license": "MIT"
    }
  }
}