{
  "npmci": {
    "npmGlobalTools": [],
    "npmAccessLevel": "public"
  },
  "npmdocker": {
    "command": "rm -r node_modules && yarn install && yarn test"
  },
  "gitzone": {
    "projectType": "npm",
    "module": {
      "githost": "gitlab.com",
      "gitscope": "push.rocks",
      "gitrepo": "smartrx",
      "description": "smart wrapper for rxjs",
      "npmPackagename": "@push.rocks/smartrx",
      "license": "MIT"
    }
  }
}