{
  "npmts": {
    "coverageTreshold": 50
  },
  "npmci": {
    "npmGlobalTools": [],
    "npmAccessLevel": "public"
  },
  "gitzone": {
    "projectType": "npm",
    "module": {
      "githost": "gitlab.com",
      "gitscope": "push.rocks",
      "gitrepo": "smartrequest",
      "description": "dropin replacement for request",
      "npmPackagename": "@push.rocks/smartrequest",
      "license": "MIT"
    }
  }
}