{
  "npmci": {
    "npmGlobalTools": [],
    "npmAccessLevel": "public"
  },
  "gitzone": {
    "projectType": "npm",
    "module": {
      "githost": "gitlab.com",
      "gitscope": "push.rocks",
      "gitrepo": "smartlog-receiver",
      "description": "a receiver for smartlog-destination-receiver",
      "npmPackagename": "@push.rocks/smartlog-receiver",
      "license": "MIT"
    }
  }
}