{
  "npmci": {
    "npmGlobalTools": []
  },
  "gitzone": {
    "projectType": "npm",
    "module": {
      "githost": "gitlab.com",
      "gitscope": "push.rocks",
      "gitrepo": "smartbucket",
      "description": "simple cloud independent object storage",
      "npmPackagename": "@push.rocks/smartbucket",
      "license": "MIT"
    }
  }
}