{
  "gitzone": {
    "projectType": "npm",
    "module": {
      "githost": "gitlab.com",
      "gitscope": "push.rocks",
      "gitrepo": "logcontext",
      "description": "enrich logs with context",
      "npmPackagename": "@push.rocks/logcontext",
      "license": "MIT"
    }
  },
  "npmci": {
    "npmAccessLevel": "public",
    "npmGlobalTools": []
  }
}