{
  "npmci": {
    "npmGlobalTools": [],
    "npmAccessLevel": "public"
  },
  "gitzone": {
    "projectType": "npm",
    "module": {
      "githost": "gitlab.com",
      "gitscope": "push.rocks",
      "gitrepo": "early",
      "description": "minimal and fast loading plugin for startup time measuring",
      "npmPackagename": "@push.rocks/early",
      "license": "MIT"
    }
  }
}