module example/postgres

go 1.22.1

require (
	github.com/golang-migrate/migrate/v4 v4.17.0
	github.com/lib/pq v1.10.9
)

require (
	github.com/hashicorp/errwrap v1.1.0 // indirect
	github.com/hashicorp/go-multierror v1.1.1 // indirect
	go.uber.org/atomic v1.7.0 // indirect
)
