Application,testcsv,testAttr2,poolversion,Quotation,Model,CustomerCreditStatus
validInStock,FALSE,domestic,scheme1,oneMonth,ground,denied
,,,,,,
validInStock,FALSE,domestic,scheme2,immediate,air,approved
,,,,,,
validInStock,FALSE,foreign,scheme1,oneMonth,sea,denied
,,,,,,
validInStock,FALSE,foreign,scheme3,oneMonth,sea,denied
,,,,,,
validInStock,FALSE,foreign,scheme3,oneWeek,ground,denied
,,,,,,
validInStock,TRUE,domestic,scheme2,immediate,air,unknown
,,,,,,
validOutOfStock,FALSE,foreign,scheme1,oneWeek,air,approved
,,,,,,
validOutOfStock,TRUE,domestic,scheme2,oneWeek,ground,denied
,,,,,,
validOutOfStock,TRUE,foreign,scheme2,oneWeek,ground,unknown
,,,,,,
validOutOfStock,TRUE,foreign,scheme3,oneMonth,sea,denied
