{
  "name": "JPALanguages",
  "fields": [
    {
      "fieldName": "thaiSpeaking",
      "fieldType": "String"
    },
    {
      "fieldName": "thaiUnderstanding",
      "fieldType": "String"
    },
    {
      "fieldName": "thaiReading",
      "fieldType": "String"
    },
    {
      "fieldName": "thaiWriting",
      "fieldType": "String"
    },
    {
      "fieldName": "englishSpeaking",
      "fieldType": "String"
    },
    {
      "fieldName": "englishUnderstanding",
      "fieldType": "String"
    },
    {
      "fieldName": "englishReading",
      "fieldType": "String"
    },
    {
      "fieldName": "englishWriting",
      "fieldType": "String"
    },
    {
      "fieldName": "chineseSpeaking",
      "fieldType": "String"
    },
    {
      "fieldName": "chineseUnderstanding",
      "fieldType": "String"
    },
    {
      "fieldName": "chineseReading",
      "fieldType": "String"
    },
    {
      "fieldName": "chineseWriting",
      "fieldType": "String"
    },
    {
      "fieldName": "otherLanguage",
      "fieldType": "String"
    },
    {
      "fieldName": "otherSpeaking",
      "fieldType": "String"
    },
    {
      "fieldName": "otherUnderstanding",
      "fieldType": "String"
    },
    {
      "fieldName": "otherReading",
      "fieldType": "String"
    },
    {
      "fieldName": "otherWriting",
      "fieldType": "String"
    }
  ],
  "relationships": [],
  "changelogDate": "20210217130452",
  "entityTableName": "jpa_languages",
  "dto": "no",
  "pagination": "no",
  "service": "no",
  "jpaMetamodelFiltering": false,
  "fluentMethods": true,
  "readOnly": false,
  "embedded": false,
  "clientRootFolder": "",
  "applications": "*"
}
