{
  "name": "CardPrivilege",
  "fields": [
    {
      "fieldName": "cardId",
      "fieldType": "String"
    },
    {
      "fieldName": "cardName",
      "fieldType": "String"
    },
    {
      "fieldName": "privilegeId",
      "fieldType": "String"
    },
    {
      "fieldName": "privilegeName",
      "fieldType": "String"
    },
    {
      "fieldName": "quota",
      "fieldType": "Integer"
    },
    {
      "fieldName": "validityPeriod",
      "fieldType": "CardPrivilegeValidity",
      "fieldValues": "YEARLY,LIFE_TIME"
    },
    {
      "fieldName": "active",
      "fieldType": "Boolean"
    }
  ],
  "relationships": [],
  "changelogDate": "20210225082918",
  "entityTableName": "card_privilege",
  "dto": "no",
  "pagination": "no",
  "service": "no",
  "jpaMetamodelFiltering": false,
  "fluentMethods": true,
  "readOnly": false,
  "embedded": false,
  "clientRootFolder": "",
  "applications": "*"
}
