{
  "name": "Vendor",
  "fields": [
    {
      "fieldName": "name",
      "fieldType": "String"
    },
    {
      "fieldName": "description",
      "fieldType": "String"
    },
    {
      "fieldName": "mobile",
      "fieldType": "String"
    },
    {
      "fieldName": "email",
      "fieldType": "String"
    },
    {
      "fieldName": "photos",
      "fieldType": "String"
    },
    {
      "fieldName": "rating",
      "fieldType": "String"
    },
    {
      "fieldName": "webSite",
      "fieldType": "String"
    },
    {
      "fieldName": "status",
      "fieldType": "String"
    },
    {
      "fieldName": "active",
      "fieldType": "Boolean"
    }
  ],
  "relationships": [
    {
      "relationshipType": "one-to-many",
      "otherEntityName": "vendorsContact",
      "otherEntityRelationshipName": "vendor",
      "relationshipName": "contacts"
    }
  ],
  "changelogDate": "20210220134724",
  "entityTableName": "vendor",
  "dto": "no",
  "pagination": "no",
  "service": "no",
  "jpaMetamodelFiltering": false,
  "fluentMethods": true,
  "readOnly": false,
  "embedded": false,
  "clientRootFolder": "",
  "applications": "*"
}
