{
  "name": "VendorsContact",
  "fields": [
    {
      "fieldName": "title",
      "fieldType": "String"
    },
    {
      "fieldName": "firstName",
      "fieldType": "String"
    },
    {
      "fieldName": "lastName",
      "fieldType": "String"
    },
    {
      "fieldName": "mobile",
      "fieldType": "String"
    },
    {
      "fieldName": "email",
      "fieldType": "String"
    },
    {
      "fieldName": "businessTitle",
      "fieldType": "String"
    },
    {
      "fieldName": "contactTagId",
      "fieldType": "String"
    },
    {
      "fieldName": "contactTagName",
      "fieldType": "String"
    },
    {
      "fieldName": "active",
      "fieldType": "Boolean"
    }
  ],
  "relationships": [
    {
      "relationshipType": "many-to-one",
      "otherEntityName": "vendor",
      "otherEntityRelationshipName": "contacts",
      "relationshipName": "vendor",
      "otherEntityField": "id"
    },
    {
      "relationshipType": "many-to-one",
      "otherEntityName": "shop",
      "otherEntityRelationshipName": "contacts",
      "relationshipName": "shop",
      "otherEntityField": "id"
    }
  ],
  "changelogDate": "20210220135024",
  "entityTableName": "vendors_contact",
  "dto": "no",
  "pagination": "no",
  "service": "no",
  "jpaMetamodelFiltering": false,
  "fluentMethods": true,
  "readOnly": false,
  "embedded": false,
  "clientRootFolder": "",
  "applications": "*"
}
