{
  "name": "Nationalities",
  "fields": [
    {
      "fieldName": "name",
      "fieldType": "String"
    }
  ],
  "relationships": [],
  "changelogDate": "20210126181128",
  "entityTableName": "nationalities",
  "dto": "no",
  "pagination": "no",
  "service": "no",
  "jpaMetamodelFiltering": false,
  "fluentMethods": true,
  "readOnly": false,
  "embedded": false,
  "clientRootFolder": "",
  "applications": "*"
}
