{
  "name": "Staff",
  "fields": [
    {
      "fieldName": "firstName",
      "fieldType": "String"
    },
    {
      "fieldName": "lastName",
      "fieldType": "String"
    },
    {
      "fieldName": "email",
      "fieldType": "String"
    },
    {
      "fieldName": "password",
      "fieldType": "String"
    },
    {
      "fieldName": "status",
      "fieldType": "StaffStatus",
      "fieldValues": "ACTIVE,PENDING,INACTIVE"
    },
    {
      "fieldName": "loginType",
      "fieldType": "StaffLoginType",
      "fieldValues": "PASSWORD,LDAP"
    }
  ],
  "relationships": [
    {
      "relationshipType": "one-to-one",
      "otherEntityName": "team",
      "otherEntityRelationshipName": "staff",
      "relationshipName": "team",
      "otherEntityField": "id",
      "ownerSide": true
    }
  ],
  "changelogDate": "20210125153048",
  "entityTableName": "staff",
  "dto": "no",
  "pagination": "no",
  "service": "no",
  "jpaMetamodelFiltering": false,
  "fluentMethods": true,
  "readOnly": false,
  "embedded": false,
  "clientRootFolder": "",
  "applications": "*"
}
