{
  "name": "InputField",
  "fields": [
    {
      "fieldName": "name",
      "fieldType": "String"
    },
    {
      "fieldName": "label",
      "fieldType": "String"
    },
    {
      "fieldName": "link",
      "fieldType": "String"
    }
  ],
  "relationships": [
    {
      "relationshipType": "many-to-one",
      "otherEntityName": "caseStep",
      "otherEntityRelationshipName": "inputFields",
      "relationshipName": "caseStep",
      "otherEntityField": "id"
    },
    {
      "relationshipType": "many-to-one",
      "otherEntityName": "caseStepInstance",
      "otherEntityRelationshipName": "inputFields",
      "relationshipName": "caseStepInstance",
      "otherEntityField": "id"
    }
  ],
  "changelogDate": "20210131075048",
  "entityTableName": "input_field",
  "dto": "no",
  "pagination": "no",
  "service": "no",
  "jpaMetamodelFiltering": false,
  "fluentMethods": true,
  "readOnly": false,
  "embedded": false,
  "clientRootFolder": "",
  "applications": "*"
}
