{
  "name": "CaseStepInstance",
  "fields": [
    {
      "fieldName": "name",
      "fieldType": "String"
    },
    {
      "fieldName": "stepId",
      "fieldType": "String"
    },
    {
      "fieldName": "caseInstanceId",
      "fieldType": "String"
    },
    {
      "fieldName": "begin",
      "fieldType": "Boolean"
    }
  ],
  "relationships": [
    {
      "relationshipType": "one-to-one",
      "otherEntityName": "team",
      "otherEntityRelationshipName": "caseStepInstance",
      "relationshipName": "team",
      "otherEntityField": "id",
      "ownerSide": true
    },
    {
      "relationshipType": "one-to-one",
      "otherEntityName": "stepOwner",
      "otherEntityRelationshipName": "caseStepInstance",
      "relationshipName": "stepOwner",
      "otherEntityField": "id",
      "ownerSide": true
    },
    {
      "relationshipType": "one-to-many",
      "otherEntityName": "actionInstance",
      "otherEntityRelationshipName": "caseStepInstance",
      "relationshipName": "actionInstances"
    },
    {
      "relationshipType": "one-to-many",
      "otherEntityName": "verifyField",
      "otherEntityRelationshipName": "caseStepInstance",
      "relationshipName": "verifyFields"
    },
    {
      "relationshipType": "one-to-many",
      "otherEntityName": "inputField",
      "otherEntityRelationshipName": "caseStepInstance",
      "relationshipName": "inputFields"
    },
    {
      "relationshipType": "many-to-one",
      "otherEntityName": "caseStepState",
      "otherEntityRelationshipName": "caseStepInstance",
      "relationshipName": "state",
      "otherEntityField": "id"
    }
  ],
  "changelogDate": "20210131074448",
  "entityTableName": "case_step_instance",
  "dto": "no",
  "pagination": "no",
  "service": "no",
  "jpaMetamodelFiltering": false,
  "fluentMethods": true,
  "readOnly": false,
  "embedded": false,
  "clientRootFolder": "",
  "applications": "*"
}
