<?xml version="1.0" encoding="UTF-8" standalone="no"?>
<!-- Created with Inkscape (http://www.inkscape.org/) -->

<svg
   xmlns:dc="http://purl.org/dc/elements/1.1/"
   xmlns:cc="http://creativecommons.org/ns#"
   xmlns:rdf="http://www.w3.org/1999/02/22-rdf-syntax-ns#"
   xmlns:svg="http://www.w3.org/2000/svg"
   xmlns="http://www.w3.org/2000/svg"
   xmlns:sodipodi="http://sodipodi.sourceforge.net/DTD/sodipodi-0.dtd"
   xmlns:inkscape="http://www.inkscape.org/namespaces/inkscape"
   width="210mm"
   height="297mm"
   viewBox="0 0 744.09448819 1052.3622047"
   id="svg2"
   version="1.1"
   inkscape:version="0.91 r13725"
   sodipodi:docname="logo.svg">
  <defs
     id="defs4" />
  <sodipodi:namedview
     id="base"
     pagecolor="#ffffff"
     bordercolor="#666666"
     borderopacity="1.0"
     inkscape:pageopacity="0.0"
     inkscape:pageshadow="2"
     inkscape:zoom="0.7"
     inkscape:cx="73.447188"
     inkscape:cy="583.98339"
     inkscape:document-units="px"
     inkscape:current-layer="layer1"
     showgrid="false"
     inkscape:window-width="1440"
     inkscape:window-height="871"
     inkscape:window-x="0"
     inkscape:window-y="0"
     inkscape:window-maximized="1" />
  <metadata
     id="metadata7">
    <rdf:RDF>
      <cc:Work
         rdf:about="">
        <dc:format>image/svg+xml</dc:format>
        <dc:type
           rdf:resource="http://purl.org/dc/dcmitype/StillImage" />
      </cc:Work>
    </rdf:RDF>
  </metadata>
  <g
     inkscape:label="Layer 1"
     inkscape:groupmode="layer"
     id="layer1">
    <path
       sodipodi:type="spiral"
       style="fill:#800000;fill-rule:evenodd;stroke:none;stroke-width:10;stroke-linecap:round;stroke-linejoin:miter;stroke-opacity:0.50196081;stroke-miterlimit:4;stroke-dasharray:none;fill-opacity:0.50196081"
       id="path4134"
       sodipodi:cx="327.14285"
       sodipodi:cy="350.93362"
       sodipodi:expansion="1"
       sodipodi:revolution="3"
       sodipodi:radius="200.8604"
       sodipodi:argument="-18.849556"
       sodipodi:t0="0"
       d="m 327.14285,350.93362 c 10.07082,0 4.96859,13.57527 0,16.73837 -13.46456,8.57181 -29.34873,-3.76987 -33.47673,-16.73836 -7.38402,-23.1976 11.35687,-45.52112 33.47673,-50.21511 32.46179,-6.8886 61.9819,18.9778 66.95347,50.2151 6.62632,41.63441 -26.60172,78.55409 -66.95346,83.69184 -50.77855,6.46532 -95.1816,-34.22487 -100.43021,-83.69183 -6.35677,-59.91112 41.84714,-111.84069 100.4302,-117.16857 69.0381,-6.27872 128.51955,49.46878 133.90693,117.16856 6.21995,78.16207 -57.09002,145.21161 -133.90692,150.6453 -87.28425,6.1741 -161.91292,-64.71099 -167.38367,-150.64529 -6.13736,-96.4053 72.33178,-178.62095 167.38365,-184.12204 105.5256,-6.10725 195.33404,79.95245 200.86041,184.12202"
       inkscape:export-xdpi="24.417953"
       inkscape:export-ydpi="24.417953" />
  </g>
</svg>
