0-1,"Last over-current amount from Port #1 (u16) in mA, otherwise 0"
2-3,"Last over-current amount from Port #2 (u16) in mA, otherwise 0"
4-5,"Last over-current amount from Port #3 (u16) in mA, otherwise 0"
6-7,"Last over-current amount from Port #4 (u16) in mA, otherwise 0"