{
  "posts": [
    {
      "title": "Mardi Himal Trek\"",
      "authorName": "Pukar Bhandari",
      "content": "The Mardi Himal trek is a relatively new trekking route that sits in the revered Annapurna region which is bordered by the Kaligandaki and Marshyangdi rivers. The Mardi Himal sits in the tranquil Annapurna Conservation Area, and travelers are left spellbound by its splendid flora and fauna. Feast your eyes on the lavish sight of the glorious mountains of Annapurna, Machhapuchhre, and indulge in some cultural awakening in the quaint settlements of Sano Dobhan and Thulo Kharka. The Mardi Himal trekking experience is unparalleled in terms of natural allure and religious significance, and it further solidifies the statement, “Heaven is a myth, but Nepal is real.”",
      "date": "2019-11-18T04:18:05.887Z",
      "id": 1
    },
    {
      "title": "Annapurna Base Camp trek",
      "authorName": "Pukar Bhandari",
      "content": "Annapurna Base Camp trek of Nepal is also known as Annapurna Sanctuary trek or ABC trekking. To reach to the base camp of Annapurna the hiking path goes through a hidden alpine amphitheater overshadowed by surrounding ice bound giants including Annapurna One peak over 8,000 meters (26,000 ft), thirteen peaks over 7,000 meters (23,000 ft), & sixteen more over 6,000 meters (20,000 ft).",
      "date": "2019-11-18T04:18:56.058Z",
      "id": 2
    },
    {
      "title": "Everest Base Camp Trek",
      "authorName": "Pukar Bhandari",
      "content": "This is a classic Nepal trek and climbing experience that will take you into the heart of the world’s majestic Himalayas mountains – the Khumbu valley. Our Island peak expedition offers a unique chance for beginning mountaineers to climb in a relatively lesser-traveled region amidst the mighty Himalayas. The summit of Island peak stands adjacent to one of the world’s largest ice walls and offers stunning views of Ama Dablam and the pyramid of Makalu.",
      "date": "2019-11-18T04:19:32.004Z",
      "id": 3
    },
    {
      "title": "Gosainkunda Trek",
      "authorName": "Pukar Bhandari",
      "content": "A seven hours bus drive to Dhunche which is 105 Kilometers north east of Kathmandu brings you to the starting point of this spectacular Langtang trek to the splendid Langtang valley region of central Nepal. Moving up a gentle gradient, you pass along the dramatic ridges through villages inhabited by Tibetans, Tamangs and Sherpa people where you will come across the lush forest of Rhododendrons, conifers and oaks.",
      "date": "2019-11-18T04:19:56.272Z",
      "id": 4
    },
    {
      "title": "Panch Pokhari Trek",
      "authorName": "Pukar Bhandari",
      "content": "The Panch Pokhari (Five Ponds) Path is a new trekking area in Nepal. Panch Pokhari (4,100 m) is located northeast of Kathmandu at the base of the Jugal Himal. The period from March to May is the best time for trek to Panch Pokhari. This place has cultural, religious, and ecological importance. An important festival, the Janai Purnima festival, is held here every year in August, when Brahmin castes come here for the ritual changing of the sacred thread (janai) they wear around their bodies. Thus, the five ponds (Panch Pokhari) are regarded as sacred ponds. Situated as they are at the base of the Jugal Himal, the ecology is pretty diverse and of considerable interest. The trek takes you through Sherpa and Tamang villages, so it’s something of a Nepal cultural trek, as well.",
      "date": "2019-11-18T04:21:08.959Z",
      "id": 5
    },
    {
      "title": "Manaslu Trek",
      "authorName": "Pukar Bhandari",
      "content": "The Manaslu circuit trek is an underappreciated trek located in the remote western region of Nepal. The trek revolves around the Manaslu Mountain (8163m) which means “Spirit Mountain.” Like its name, the trek provides the opportunity to trekkers for a spiritual awakening by witnessing the cultural heritage, unrivaled beauty, and extreme wilderness.",
      "date": "2019-11-18T04:21:53.498Z",
      "id": 6
    },
    {
      "title": "Langtang trek",
      "authorName": "Pukar Bhandari",
      "content": "You will pass through mountain grazing cattle on the rich alpine pastures under the watchful eyes of their herders. Breathtaking mountain views emerge on your ascent as the vegetation becomes sparser and the conditions more challenging. Once you enter the core Langtang valley from Ghora Tabala you will find fluttering prayer flags in the main trails, brightly painted shortens, Mani walls (carved Tibetan mantra Om Mani Padme Hum) and yak herders welcome you to the land of these high mountain people.",
      "date": "2019-11-18T04:22:30.280Z",
      "id": 7
    },
    {
      "title": "ABC Circuit Trek",
      "authorName": "Pukar Bhandari",
      "content": "The  Annapurna Circuit Trek or Around the Annapurna Trek is one of the most popular treks in the world. Normally, it takes about 15-18 days to complete around the Annapurna trek; however, the number of days can always be abridged by taking flights or vehicles, or extended by taking one or more side trips. The entire trail is adorned with a variety of rich natural and cultural heritages that stimulates trekkers to explore more.",
      "date": "2019-11-18T04:22:53.691Z",
      "id": 8
    },
    {
      "title": "Shey-Phoksundo Trek",
      "authorName": "Pukar Bhandari",
      "content": "Among many beautiful places in Nepal, Phoksundo Lake is considered one of the most beautiful and exotic tourist destinations located in Dolpo, the largest territorial district. Phoksundo Lake Trek is a short and easy journey to one of the most beautiful and deepest lakes of Nepal. Phoksundo is an alpine freshwater lake which is also considered sacred by the followers of Buddhist and Bon-po religions, making the trek an amazing mix of nature and culture.",
      "date": "2019-11-18T04:23:26.035Z",
      "id": 9
    }
  ]
}