{
    "current_program_scene": "cam2A",
    "current_scene": "cam2A",
    "current_transition": "Stinger",
    "groups": [],
    "modules": {
        "auto-scene-switcher": {
            "active": false,
            "interval": 300,
            "non_matching_scene": "",
            "switch_if_not_matching": false,
            "switches": []
        },
        "captions": {
            "enabled": false,
            "lang_id": 2058,
            "provider": "mssapi",
            "source": ""
        },
        "decklink_captions": {
            "source": ""
        },
        "output-timer": {
            "autoStartRecordTimer": false,
            "autoStartStreamTimer": false,
            "pauseRecordTimer": false,
            "recordTimerHours": 0,
            "recordTimerMinutes": 0,
            "recordTimerSeconds": 0,
            "streamTimerHours": 0,
            "streamTimerMinutes": 0,
            "streamTimerSeconds": 0
        },
        "scripts-tool": []
    },
    "name": "Flisol2021",
    "preview_locked": false,
    "quick_transitions": [
        {
            "duration": 300,
            "fade_to_black": false,
            "hotkeys": [],
            "id": 1,
            "name": "Desvanecimiento"
        },
        {
            "duration": 1000,
            "fade_to_black": false,
            "hotkeys": [],
            "id": 3,
            "name": "Desvanecimiento"
        },
        {
            "duration": 3000,
            "fade_to_black": false,
            "hotkeys": [],
            "id": 4,
            "name": "Desvanecimiento"
        },
        {
            "duration": 300,
            "fade_to_black": false,
            "hotkeys": [],
            "id": 6,
            "name": "Stinger"
        }
    ],
    "saved_projectors": [],
    "scaling_enabled": false,
    "scaling_level": 0,
    "scaling_off_x": 0.0,
    "scaling_off_y": 0.0,
    "scene_order": [
        {
            "name": "ads1"
        },
        {
            "name": "ads2"
        },
        {
            "name": "Canal"
        },
        {
            "name": "5min"
        },
        {
            "name": "introA"
        },
        {
            "name": "cam1A"
        },
        {
            "name": "cam2A"
        },
        {
            "name": "cam3A"
        },
        {
            "name": "Interview"
        }
    ],
    "sources": [
        {
            "balance": 0.5,
            "deinterlace_field_order": 0,
            "deinterlace_mode": 0,
            "enabled": true,
            "flags": 0,
            "hotkeys": {
                "libobs.mute": [],
                "libobs.push-to-mute": [],
                "libobs.push-to-talk": [],
                "libobs.unmute": []
            },
            "id": "browser_source",
            "mixers": 63,
            "monitoring_type": 1,
            "muted": false,
            "name": "Cam2A",
            "prev_ver": 436273153,
            "private_settings": {},
            "push-to-mute": false,
            "push-to-mute-delay": 0,
            "push-to-talk": false,
            "push-to-talk-delay": 0,
            "settings": {
                "css": "body { background-color: rgba(0, 0, 0, 0); margin: 0px auto; overflow: hidden; }",
                "fps": 30,
                "fps_custom": false,
                "height": 720,
                "reroute_audio": true,
                "restart_when_active": false,
                "shutdown": false,
                "url": "https://obs.ninja/?view=eGYcEXf_ihxKY&scene&room=qb&password=Abc",
                "width": 1280
            },
            "sync": 0,
            "versioned_id": "browser_source",
            "volume": 1.0
        },
        {
            "balance": 0.5,
            "deinterlace_field_order": 0,
            "deinterlace_mode": 0,
            "enabled": true,
            "filters": [
                {
                    "balance": 0.5,
                    "deinterlace_field_order": 0,
                    "deinterlace_mode": 0,
                    "enabled": true,
                    "flags": 0,
                    "hotkeys": {},
                    "id": "chroma_key_filter",
                    "mixers": 0,
                    "monitoring_type": 0,
                    "muted": false,
                    "name": "Chroma Key",
                    "prev_ver": 436273153,
                    "private_settings": {},
                    "push-to-mute": false,
                    "push-to-mute-delay": 0,
                    "push-to-talk": false,
                    "push-to-talk-delay": 0,
                    "settings": {
                        "brightness": 0,
                        "contrast": 0,
                        "gamma": 0,
                        "key_color": 65280,
                        "key_color_type": "green",
                        "opacity": 100,
                        "similarity": 400,
                        "smoothness": 80,
                        "spill": 100
                    },
                    "sync": 0,
                    "versioned_id": "chroma_key_filter",
                    "volume": 1.0
                }
            ],
            "flags": 0,
            "hotkeys": {
                "MediaSource.Pause": [],
                "MediaSource.Play": [],
                "MediaSource.Restart": [],
                "MediaSource.Stop": [],
                "libobs.mute": [],
                "libobs.push-to-mute": [],
                "libobs.push-to-talk": [],
                "libobs.unmute": []
            },
            "id": "ffmpeg_source",
            "mixers": 63,
            "monitoring_type": 0,
            "muted": false,
            "name": "Chroma.mp4",
            "prev_ver": 436273153,
            "private_settings": {
                "mixer_hidden": false
            },
            "push-to-mute": false,
            "push-to-mute-delay": 0,
            "push-to-talk": false,
            "push-to-talk-delay": 0,
            "settings": {
                "buffering_mb": 2,
                "caching": true,
                "clear_on_media_end": true,
                "is_local_file": true,
                "local_file": "C:\\Users\\ZL314VZ\\AppData\\Roaming\\slobs-client\\Overlays\\flisol\\Chroma.mp4",
                "looping": true,
                "reconnect_delay_sec": 10,
                "restart_on_activate": true,
                "speed_percent": 100
            },
            "sync": 0,
            "versioned_id": "ffmpeg_source",
            "volume": 1.0
        },
        {
            "balance": 0.5,
            "deinterlace_field_order": 0,
            "deinterlace_mode": 0,
            "enabled": true,
            "flags": 0,
            "hotkeys": {},
            "id": "image_source",
            "mixers": 0,
            "monitoring_type": 0,
            "muted": false,
            "name": "Portada-Canal-ZSH.png",
            "prev_ver": 436273153,
            "private_settings": {},
            "push-to-mute": false,
            "push-to-mute-delay": 0,
            "push-to-talk": false,
            "push-to-talk-delay": 0,
            "settings": {
                "file": "C:\\Users\\ZL314VZ\\AppData\\Roaming\\slobs-client\\Overlays\\flisol\\Portada-Canal-ZSH.png",
                "unload": false
            },
            "sync": 0,
            "versioned_id": "image_source",
            "volume": 1.0
        },
        {
            "balance": 0.5,
            "deinterlace_field_order": 0,
            "deinterlace_mode": 0,
            "enabled": true,
            "flags": 0,
            "hotkeys": {},
            "id": "image_source",
            "mixers": 0,
            "monitoring_type": 0,
            "muted": false,
            "name": "Portada-Canal-Bash.png",
            "prev_ver": 436273153,
            "private_settings": {},
            "push-to-mute": false,
            "push-to-mute-delay": 0,
            "push-to-talk": false,
            "push-to-talk-delay": 0,
            "settings": {
                "file": "C:\\Users\\ZL314VZ\\AppData\\Roaming\\slobs-client\\Overlays\\flisol\\Portada-Canal-Bash.png",
                "unload": false
            },
            "sync": 0,
            "versioned_id": "image_source",
            "volume": 1.0
        },
        {
            "balance": 0.5,
            "deinterlace_field_order": 0,
            "deinterlace_mode": 0,
            "enabled": true,
            "flags": 0,
            "hotkeys": {},
            "id": "image_source",
            "mixers": 0,
            "monitoring_type": 0,
            "muted": false,
            "name": "Portada-Canal-FISH.png",
            "prev_ver": 436273153,
            "private_settings": {},
            "push-to-mute": false,
            "push-to-mute-delay": 0,
            "push-to-talk": false,
            "push-to-talk-delay": 0,
            "settings": {
                "file": "C:\\Users\\ZL314VZ\\AppData\\Roaming\\slobs-client\\Overlays\\flisol\\Portada-Canal-FISH.png",
                "unload": false
            },
            "sync": 0,
            "versioned_id": "image_source",
            "volume": 1.0
        },
        {
            "balance": 0.5,
            "deinterlace_field_order": 0,
            "deinterlace_mode": 0,
            "enabled": true,
            "flags": 0,
            "hotkeys": {},
            "id": "image_source",
            "mixers": 0,
            "monitoring_type": 0,
            "muted": false,
            "name": "Transparencia-OnlyOffice-Su-Nueva-Suite-de-Oficina.png",
            "prev_ver": 436273153,
            "private_settings": {},
            "push-to-mute": false,
            "push-to-mute-delay": 0,
            "push-to-talk": false,
            "push-to-talk-delay": 0,
            "settings": {
                "file": "C:\\Users\\ZL314VZ\\AppData\\Roaming\\slobs-client\\Overlays\\flisol\\Canal ZSH\\Transparencia-OnlyOffice-Su-Nueva-Suite-de-Oficina.png",
                "unload": false
            },
            "sync": 0,
            "versioned_id": "image_source",
            "volume": 1.0
        },
        {
            "balance": 0.5,
            "deinterlace_field_order": 0,
            "deinterlace_mode": 0,
            "enabled": true,
            "flags": 0,
            "hotkeys": {
                "MediaSource.Pause": [],
                "MediaSource.Play": [],
                "MediaSource.Restart": [],
                "MediaSource.Stop": [],
                "libobs.mute": [],
                "libobs.push-to-mute": [],
                "libobs.push-to-talk": [],
                "libobs.unmute": []
            },
            "id": "ffmpeg_source",
            "mixers": 63,
            "monitoring_type": 0,
            "muted": false,
            "name": "proyecto.mp4",
            "prev_ver": 436273153,
            "private_settings": {
                "mixer_hidden": true
            },
            "push-to-mute": false,
            "push-to-mute-delay": 0,
            "push-to-talk": false,
            "push-to-talk-delay": 0,
            "settings": {
                "buffering_mb": 2,
                "caching": true,
                "clear_on_media_end": true,
                "is_local_file": true,
                "local_file": "C:\\Users\\ZL314VZ\\AppData\\Roaming\\slobs-client\\Overlays\\flisol\\proyecto.mp4",
                "looping": true,
                "reconnect_delay_sec": 10,
                "restart_on_activate": true,
                "speed_percent": 100
            },
            "sync": 0,
            "versioned_id": "ffmpeg_source",
            "volume": 1.0
        },
        {
            "balance": 0.5,
            "deinterlace_field_order": 0,
            "deinterlace_mode": 0,
            "enabled": true,
            "flags": 0,
            "hotkeys": {},
            "id": "image_source",
            "mixers": 0,
            "monitoring_type": 0,
            "muted": false,
            "name": "Fondo-Transmision.png",
            "prev_ver": 436273153,
            "private_settings": {},
            "push-to-mute": false,
            "push-to-mute-delay": 0,
            "push-to-talk": false,
            "push-to-talk-delay": 0,
            "settings": {
                "file": "C:\\Users\\ZL314VZ\\AppData\\Roaming\\slobs-client\\Overlays\\flisol\\Fondo-Transmision.png",
                "unload": false
            },
            "sync": 0,
            "versioned_id": "image_source",
            "volume": 1.0
        },
        {
            "balance": 0.5,
            "deinterlace_field_order": 0,
            "deinterlace_mode": 0,
            "enabled": true,
            "flags": 0,
            "hotkeys": {
                "MediaSource.Pause": [],
                "MediaSource.Play": [],
                "MediaSource.Restart": [],
                "MediaSource.Stop": [],
                "libobs.mute": [],
                "libobs.push-to-mute": [],
                "libobs.push-to-talk": [],
                "libobs.unmute": []
            },
            "id": "ffmpeg_source",
            "mixers": 63,
            "monitoring_type": 0,
            "muted": false,
            "name": "flisol opcion 1.mp4",
            "prev_ver": 436273153,
            "private_settings": {},
            "push-to-mute": false,
            "push-to-mute-delay": 0,
            "push-to-talk": false,
            "push-to-talk-delay": 0,
            "settings": {
                "buffering_mb": 2,
                "caching": true,
                "clear_on_media_end": true,
                "is_local_file": true,
                "local_file": "C:\\Users\\ZL314VZ\\AppData\\Roaming\\slobs-client\\Overlays\\flisol\\flisol opcion 1.mp4",
                "looping": true,
                "reconnect_delay_sec": 10,
                "restart_on_activate": true,
                "speed_percent": 100
            },
            "sync": 0,
            "versioned_id": "ffmpeg_source",
            "volume": 1.0
        },
        {
            "balance": 0.5,
            "deinterlace_field_order": 0,
            "deinterlace_mode": 0,
            "enabled": true,
            "flags": 0,
            "hotkeys": {
                "OBSBasic.SelectScene": [],
                "libobs.hide_scene_item.flisol opcion 1.mp4": [],
                "libobs.show_scene_item.flisol opcion 1.mp4": []
            },
            "id": "scene",
            "mixers": 0,
            "monitoring_type": 0,
            "muted": false,
            "name": "ads1",
            "prev_ver": 436273153,
            "private_settings": {},
            "push-to-mute": false,
            "push-to-mute-delay": 0,
            "push-to-talk": false,
            "push-to-talk-delay": 0,
            "settings": {
                "custom_size": false,
                "id_counter": 1,
                "items": [
                    {
                        "align": 5,
                        "bounds": {
                            "x": 0.0,
                            "y": 0.0
                        },
                        "bounds_align": 0,
                        "bounds_type": 0,
                        "crop_bottom": 0,
                        "crop_left": 0,
                        "crop_right": 0,
                        "crop_top": 0,
                        "group_item_backup": false,
                        "id": 0,
                        "locked": false,
                        "name": "flisol opcion 1.mp4",
                        "pos": {
                            "x": 0.0,
                            "y": 0.0
                        },
                        "private_settings": {},
                        "rot": 0.0,
                        "scale": {
                            "x": 1.5,
                            "y": 1.5
                        },
                        "scale_filter": "disable",
                        "visible": true
                    }
                ]
            },
            "sync": 0,
            "versioned_id": "scene",
            "volume": 1.0
        },
        {
            "balance": 0.5,
            "deinterlace_field_order": 0,
            "deinterlace_mode": 0,
            "enabled": true,
            "flags": 0,
            "hotkeys": {
                "OBSBasic.SelectScene": [],
                "libobs.hide_scene_item.Ads": [],
                "libobs.hide_scene_item.DESTACADO": [],
                "libobs.hide_scene_item.Fondo-Transmision.png": [],
                "libobs.hide_scene_item.Musica": [],
                "libobs.hide_scene_item.proyecto.mp4": [],
                "libobs.show_scene_item.Ads": [],
                "libobs.show_scene_item.DESTACADO": [],
                "libobs.show_scene_item.Fondo-Transmision.png": [],
                "libobs.show_scene_item.Musica": [],
                "libobs.show_scene_item.proyecto.mp4": []
            },
            "id": "scene",
            "mixers": 0,
            "monitoring_type": 0,
            "muted": false,
            "name": "ads2",
            "prev_ver": 436273153,
            "private_settings": {},
            "push-to-mute": false,
            "push-to-mute-delay": 0,
            "push-to-talk": false,
            "push-to-talk-delay": 0,
            "settings": {
                "custom_size": false,
                "id_counter": 5,
                "items": [
                    {
                        "align": 5,
                        "bounds": {
                            "x": 0.0,
                            "y": 0.0
                        },
                        "bounds_align": 0,
                        "bounds_type": 0,
                        "crop_bottom": 0,
                        "crop_left": 0,
                        "crop_right": 0,
                        "crop_top": 0,
                        "group_item_backup": false,
                        "id": 0,
                        "locked": false,
                        "name": "Fondo-Transmision.png",
                        "pos": {
                            "x": 0.0,
                            "y": 0.0
                        },
                        "private_settings": {},
                        "rot": 0.0,
                        "scale": {
                            "x": 0.75,
                            "y": 0.75
                        },
                        "scale_filter": "disable",
                        "visible": true
                    },
                    {
                        "align": 5,
                        "bounds": {
                            "x": 0.0,
                            "y": 0.0
                        },
                        "bounds_align": 0,
                        "bounds_type": 0,
                        "crop_bottom": 0,
                        "crop_left": 0,
                        "crop_right": 0,
                        "crop_top": 0,
                        "group_item_backup": false,
                        "id": 1,
                        "locked": false,
                        "name": "proyecto.mp4",
                        "pos": {
                            "x": 35.0,
                            "y": 246.0
                        },
                        "private_settings": {},
                        "rot": 0.0,
                        "scale": {
                            "x": 0.73796296119689941,
                            "y": 0.73796296119689941
                        },
                        "scale_filter": "disable",
                        "visible": true
                    },
                    {
                        "align": 5,
                        "bounds": {
                            "x": 0.0,
                            "y": 0.0
                        },
                        "bounds_align": 0,
                        "bounds_type": 0,
                        "crop_bottom": 0,
                        "crop_left": 0,
                        "crop_right": 0,
                        "crop_top": 0,
                        "group_item_backup": false,
                        "id": 3,
                        "locked": false,
                        "name": "Musica",
                        "pos": {
                            "x": 0.0,
                            "y": 0.0
                        },
                        "private_settings": {},
                        "rot": 0.0,
                        "scale": {
                            "x": 1.0,
                            "y": 1.0
                        },
                        "scale_filter": "disable",
                        "visible": true
                    },
                    {
                        "align": 5,
                        "bounds": {
                            "x": 0.0,
                            "y": 0.0
                        },
                        "bounds_align": 0,
                        "bounds_type": 0,
                        "crop_bottom": 0,
                        "crop_left": 0,
                        "crop_right": 0,
                        "crop_top": 0,
                        "group_item_backup": false,
                        "id": 4,
                        "locked": false,
                        "name": "Ads",
                        "pos": {
                            "x": 885.0,
                            "y": 51.0
                        },
                        "private_settings": {},
                        "rot": 0.0,
                        "scale": {
                            "x": 0.91203701496124268,
                            "y": 0.91203701496124268
                        },
                        "scale_filter": "disable",
                        "visible": true
                    },
                    {
                        "align": 5,
                        "bounds": {
                            "x": 0.0,
                            "y": 0.0
                        },
                        "bounds_align": 0,
                        "bounds_type": 0,
                        "crop_bottom": 0,
                        "crop_left": 0,
                        "crop_right": 0,
                        "crop_top": 0,
                        "group_item_backup": false,
                        "id": 5,
                        "locked": false,
                        "name": "DESTACADO",
                        "pos": {
                            "x": 256.0,
                            "y": 174.0
                        },
                        "private_settings": {},
                        "rot": 0.0,
                        "scale": {
                            "x": 1.0,
                            "y": 1.0
                        },
                        "scale_filter": "disable",
                        "visible": true
                    }
                ]
            },
            "sync": 0,
            "versioned_id": "scene",
            "volume": 1.0
        },
        {
            "balance": 0.5,
            "deinterlace_field_order": 0,
            "deinterlace_mode": 0,
            "enabled": true,
            "flags": 0,
            "hotkeys": {
                "OBSBasic.SelectScene": [],
                "libobs.hide_scene_item.Musica": [],
                "libobs.hide_scene_item.Portada-Canal-Bash.png": [],
                "libobs.hide_scene_item.Portada-Canal-FISH.png": [],
                "libobs.hide_scene_item.Portada-Canal-ZSH.png": [],
                "libobs.show_scene_item.Musica": [],
                "libobs.show_scene_item.Portada-Canal-Bash.png": [],
                "libobs.show_scene_item.Portada-Canal-FISH.png": [],
                "libobs.show_scene_item.Portada-Canal-ZSH.png": []
            },
            "id": "scene",
            "mixers": 0,
            "monitoring_type": 0,
            "muted": false,
            "name": "Canal",
            "prev_ver": 436273153,
            "private_settings": {},
            "push-to-mute": false,
            "push-to-mute-delay": 0,
            "push-to-talk": false,
            "push-to-talk-delay": 0,
            "settings": {
                "custom_size": false,
                "id_counter": 4,
                "items": [
                    {
                        "align": 5,
                        "bounds": {
                            "x": 0.0,
                            "y": 0.0
                        },
                        "bounds_align": 0,
                        "bounds_type": 0,
                        "crop_bottom": 0,
                        "crop_left": 0,
                        "crop_right": 0,
                        "crop_top": 0,
                        "group_item_backup": false,
                        "id": 0,
                        "locked": false,
                        "name": "Portada-Canal-FISH.png",
                        "pos": {
                            "x": 0.0,
                            "y": 0.0
                        },
                        "private_settings": {},
                        "rot": 0.0,
                        "scale": {
                            "x": 0.75,
                            "y": 0.75
                        },
                        "scale_filter": "disable",
                        "visible": true
                    },
                    {
                        "align": 5,
                        "bounds": {
                            "x": 0.0,
                            "y": 0.0
                        },
                        "bounds_align": 0,
                        "bounds_type": 0,
                        "crop_bottom": 0,
                        "crop_left": 0,
                        "crop_right": 0,
                        "crop_top": 0,
                        "group_item_backup": false,
                        "id": 1,
                        "locked": false,
                        "name": "Portada-Canal-Bash.png",
                        "pos": {
                            "x": 0.0,
                            "y": 0.0
                        },
                        "private_settings": {},
                        "rot": 0.0,
                        "scale": {
                            "x": 0.75,
                            "y": 0.75
                        },
                        "scale_filter": "disable",
                        "visible": false
                    },
                    {
                        "align": 5,
                        "bounds": {
                            "x": 0.0,
                            "y": 0.0
                        },
                        "bounds_align": 0,
                        "bounds_type": 0,
                        "crop_bottom": 0,
                        "crop_left": 0,
                        "crop_right": 0,
                        "crop_top": 0,
                        "group_item_backup": false,
                        "id": 2,
                        "locked": false,
                        "name": "Portada-Canal-ZSH.png",
                        "pos": {
                            "x": 0.0,
                            "y": 0.0
                        },
                        "private_settings": {},
                        "rot": 0.0,
                        "scale": {
                            "x": 0.75,
                            "y": 0.75
                        },
                        "scale_filter": "disable",
                        "visible": false
                    },
                    {
                        "align": 5,
                        "bounds": {
                            "x": 0.0,
                            "y": 0.0
                        },
                        "bounds_align": 0,
                        "bounds_type": 0,
                        "crop_bottom": 0,
                        "crop_left": 0,
                        "crop_right": 0,
                        "crop_top": 0,
                        "group_item_backup": false,
                        "id": 4,
                        "locked": false,
                        "name": "Musica",
                        "pos": {
                            "x": 0.0,
                            "y": 0.0
                        },
                        "private_settings": {},
                        "rot": 0.0,
                        "scale": {
                            "x": 1.0,
                            "y": 1.0
                        },
                        "scale_filter": "disable",
                        "visible": true
                    }
                ]
            },
            "sync": 0,
            "versioned_id": "scene",
            "volume": 1.0
        },
        {
            "balance": 0.5,
            "deinterlace_field_order": 0,
            "deinterlace_mode": 0,
            "enabled": true,
            "flags": 0,
            "hotkeys": {
                "OBSBasic.SelectScene": [],
                "libobs.hide_scene_item.Cam1A": [],
                "libobs.hide_scene_item.Musica": [],
                "libobs.hide_scene_item.Transparencia-OnlyOffice-Su-Nueva-Suite-de-Oficina.png": [],
                "libobs.show_scene_item.Cam1A": [],
                "libobs.show_scene_item.Musica": [],
                "libobs.show_scene_item.Transparencia-OnlyOffice-Su-Nueva-Suite-de-Oficina.png": []
            },
            "id": "scene",
            "mixers": 0,
            "monitoring_type": 0,
            "muted": false,
            "name": "introA",
            "prev_ver": 436273153,
            "private_settings": {},
            "push-to-mute": false,
            "push-to-mute-delay": 0,
            "push-to-talk": false,
            "push-to-talk-delay": 0,
            "settings": {
                "custom_size": false,
                "id_counter": 4,
                "items": [
                    {
                        "align": 5,
                        "bounds": {
                            "x": 0.0,
                            "y": 0.0
                        },
                        "bounds_align": 0,
                        "bounds_type": 0,
                        "crop_bottom": 0,
                        "crop_left": 0,
                        "crop_right": 0,
                        "crop_top": 0,
                        "group_item_backup": false,
                        "id": 4,
                        "locked": false,
                        "name": "Cam1A",
                        "pos": {
                            "x": -585.0,
                            "y": 0.0
                        },
                        "private_settings": {},
                        "rot": 0.0,
                        "scale": {
                            "x": 1.0,
                            "y": 1.0
                        },
                        "scale_filter": "disable",
                        "visible": true
                    },
                    {
                        "align": 5,
                        "bounds": {
                            "x": 0.0,
                            "y": 0.0
                        },
                        "bounds_align": 0,
                        "bounds_type": 0,
                        "crop_bottom": 0,
                        "crop_left": 0,
                        "crop_right": 0,
                        "crop_top": 0,
                        "group_item_backup": false,
                        "id": 1,
                        "locked": false,
                        "name": "Transparencia-OnlyOffice-Su-Nueva-Suite-de-Oficina.png",
                        "pos": {
                            "x": 0.0,
                            "y": 0.0
                        },
                        "private_settings": {},
                        "rot": 0.0,
                        "scale": {
                            "x": 1.0,
                            "y": 1.0
                        },
                        "scale_filter": "disable",
                        "visible": true
                    },
                    {
                        "align": 5,
                        "bounds": {
                            "x": 0.0,
                            "y": 0.0
                        },
                        "bounds_align": 0,
                        "bounds_type": 0,
                        "crop_bottom": 0,
                        "crop_left": 0,
                        "crop_right": 0,
                        "crop_top": 0,
                        "group_item_backup": false,
                        "id": 3,
                        "locked": false,
                        "name": "Musica",
                        "pos": {
                            "x": 0.0,
                            "y": 0.0
                        },
                        "private_settings": {},
                        "rot": 0.0,
                        "scale": {
                            "x": 1.0,
                            "y": 1.0
                        },
                        "scale_filter": "disable",
                        "visible": true
                    }
                ]
            },
            "sync": 0,
            "versioned_id": "scene",
            "volume": 1.0
        },
        {
            "balance": 0.5,
            "deinterlace_field_order": 0,
            "deinterlace_mode": 0,
            "enabled": true,
            "flags": 0,
            "hotkeys": {
                "OBSBasic.SelectScene": [],
                "libobs.hide_scene_item.Cam1A": [],
                "libobs.hide_scene_item.Chroma.mp4": [],
                "libobs.hide_scene_item.Fondo-Transmision.png": [],
                "libobs.show_scene_item.Cam1A": [],
                "libobs.show_scene_item.Chroma.mp4": [],
                "libobs.show_scene_item.Fondo-Transmision.png": []
            },
            "id": "scene",
            "mixers": 0,
            "monitoring_type": 0,
            "muted": false,
            "name": "cam1A",
            "prev_ver": 436273153,
            "private_settings": {},
            "push-to-mute": false,
            "push-to-mute-delay": 0,
            "push-to-talk": false,
            "push-to-talk-delay": 0,
            "settings": {
                "custom_size": false,
                "id_counter": 5,
                "items": [
                    {
                        "align": 5,
                        "bounds": {
                            "x": 0.0,
                            "y": 0.0
                        },
                        "bounds_align": 0,
                        "bounds_type": 0,
                        "crop_bottom": 0,
                        "crop_left": 0,
                        "crop_right": 0,
                        "crop_top": 0,
                        "group_item_backup": false,
                        "id": 5,
                        "locked": false,
                        "name": "Fondo-Transmision.png",
                        "pos": {
                            "x": 0.0,
                            "y": 0.0
                        },
                        "private_settings": {},
                        "rot": 0.0,
                        "scale": {
                            "x": 0.75,
                            "y": 0.75
                        },
                        "scale_filter": "disable",
                        "visible": true
                    },
                    {
                        "align": 5,
                        "bounds": {
                            "x": 0.0,
                            "y": 0.0
                        },
                        "bounds_align": 0,
                        "bounds_type": 0,
                        "crop_bottom": 0,
                        "crop_left": 0,
                        "crop_right": 0,
                        "crop_top": 0,
                        "group_item_backup": false,
                        "id": 3,
                        "locked": false,
                        "name": "Cam1A",
                        "pos": {
                            "x": 30.0,
                            "y": 17.0
                        },
                        "private_settings": {},
                        "rot": 0.0,
                        "scale": {
                            "x": 0.96770834922790527,
                            "y": 0.96759259700775146
                        },
                        "scale_filter": "disable",
                        "visible": true
                    },
                    {
                        "align": 5,
                        "bounds": {
                            "x": 0.0,
                            "y": 0.0
                        },
                        "bounds_align": 0,
                        "bounds_type": 0,
                        "crop_bottom": 15,
                        "crop_left": 0,
                        "crop_right": 0,
                        "crop_top": 15,
                        "group_item_backup": false,
                        "id": 1,
                        "locked": false,
                        "name": "Chroma.mp4",
                        "pos": {
                            "x": 1742.0,
                            "y": 112.14187622070313
                        },
                        "private_settings": {},
                        "rot": 0.0,
                        "scale": {
                            "x": 1.0,
                            "y": 1.0
                        },
                        "scale_filter": "disable",
                        "visible": true
                    }
                ]
            },
            "sync": 0,
            "versioned_id": "scene",
            "volume": 1.0
        },
        {
            "balance": 0.5,
            "deinterlace_field_order": 0,
            "deinterlace_mode": 0,
            "enabled": true,
            "flags": 0,
            "hotkeys": {
                "OBSBasic.SelectScene": [],
                "libobs.hide_scene_item.Cam1A": [],
                "libobs.hide_scene_item.Cam2A": [],
                "libobs.hide_scene_item.Chroma.mp4": [],
                "libobs.hide_scene_item.Fondo-Transmision.png": [],
                "libobs.show_scene_item.Cam1A": [],
                "libobs.show_scene_item.Cam2A": [],
                "libobs.show_scene_item.Chroma.mp4": [],
                "libobs.show_scene_item.Fondo-Transmision.png": []
            },
            "id": "scene",
            "mixers": 0,
            "monitoring_type": 0,
            "muted": false,
            "name": "cam2A",
            "prev_ver": 436273153,
            "private_settings": {},
            "push-to-mute": false,
            "push-to-mute-delay": 0,
            "push-to-talk": false,
            "push-to-talk-delay": 0,
            "settings": {
                "custom_size": false,
                "id_counter": 5,
                "items": [
                    {
                        "align": 5,
                        "bounds": {
                            "x": 0.0,
                            "y": 0.0
                        },
                        "bounds_align": 0,
                        "bounds_type": 0,
                        "crop_bottom": 0,
                        "crop_left": 0,
                        "crop_right": 0,
                        "crop_top": 0,
                        "group_item_backup": false,
                        "id": 0,
                        "locked": false,
                        "name": "Fondo-Transmision.png",
                        "pos": {
                            "x": 0.0,
                            "y": 0.0
                        },
                        "private_settings": {},
                        "rot": 0.0,
                        "scale": {
                            "x": 0.75,
                            "y": 0.75
                        },
                        "scale_filter": "disable",
                        "visible": true
                    },
                    {
                        "align": 5,
                        "bounds": {
                            "x": 0.0,
                            "y": 0.0
                        },
                        "bounds_align": 0,
                        "bounds_type": 0,
                        "crop_bottom": 0,
                        "crop_left": 0,
                        "crop_right": 0,
                        "crop_top": 0,
                        "group_item_backup": false,
                        "id": 2,
                        "locked": false,
                        "name": "Cam2A",
                        "pos": {
                            "x": 23.0,
                            "y": 24.0
                        },
                        "private_settings": {},
                        "rot": 0.0,
                        "scale": {
                            "x": 1.4359375238418579,
                            "y": 1.4361110925674438
                        },
                        "scale_filter": "disable",
                        "visible": true
                    },
                    {
                        "align": 5,
                        "bounds": {
                            "x": 0.0,
                            "y": 0.0
                        },
                        "bounds_align": 0,
                        "bounds_type": 0,
                        "crop_bottom": 15,
                        "crop_left": 0,
                        "crop_right": 0,
                        "crop_top": 15,
                        "group_item_backup": false,
                        "id": 1,
                        "locked": false,
                        "name": "Chroma.mp4",
                        "pos": {
                            "x": 1742.0,
                            "y": 121.14187622070313
                        },
                        "private_settings": {},
                        "rot": 0.0,
                        "scale": {
                            "x": 1.0,
                            "y": 1.0
                        },
                        "scale_filter": "disable",
                        "visible": true
                    },
                    {
                        "align": 5,
                        "bounds": {
                            "x": 0.0,
                            "y": 0.0
                        },
                        "bounds_align": 0,
                        "bounds_type": 0,
                        "crop_bottom": 0,
                        "crop_left": 0,
                        "crop_right": 0,
                        "crop_top": 0,
                        "group_item_backup": false,
                        "id": 5,
                        "locked": false,
                        "name": "Cam1A",
                        "pos": {
                            "x": 1580.0,
                            "y": 883.625
                        },
                        "private_settings": {},
                        "rot": 0.0,
                        "scale": {
                            "x": 0.15833333134651184,
                            "y": 0.15833333134651184
                        },
                        "scale_filter": "disable",
                        "visible": true
                    }
                ]
            },
            "sync": 0,
            "versioned_id": "scene",
            "volume": 1.0
        },
        {
            "balance": 0.5,
            "deinterlace_field_order": 0,
            "deinterlace_mode": 0,
            "enabled": true,
            "flags": 0,
            "hotkeys": {
                "OBSBasic.SelectScene": [],
                "libobs.hide_scene_item.Chroma.mp4": [],
                "libobs.hide_scene_item.Fondo-Transmision.png": [],
                "libobs.hide_scene_item.Salon": [],
                "libobs.show_scene_item.Chroma.mp4": [],
                "libobs.show_scene_item.Fondo-Transmision.png": [],
                "libobs.show_scene_item.Salon": []
            },
            "id": "scene",
            "mixers": 0,
            "monitoring_type": 0,
            "muted": false,
            "name": "Interview",
            "prev_ver": 436273153,
            "private_settings": {},
            "push-to-mute": false,
            "push-to-mute-delay": 0,
            "push-to-talk": false,
            "push-to-talk-delay": 0,
            "settings": {
                "custom_size": false,
                "id_counter": 5,
                "items": [
                    {
                        "align": 5,
                        "bounds": {
                            "x": 1920.0,
                            "y": 1080.0
                        },
                        "bounds_align": 0,
                        "bounds_type": 2,
                        "crop_bottom": 0,
                        "crop_left": 0,
                        "crop_right": 0,
                        "crop_top": 0,
                        "group_item_backup": false,
                        "id": 0,
                        "locked": false,
                        "name": "Fondo-Transmision.png",
                        "pos": {
                            "x": 0.0,
                            "y": 0.0
                        },
                        "private_settings": {},
                        "rot": 0.0,
                        "scale": {
                            "x": 1.0,
                            "y": 1.0
                        },
                        "scale_filter": "disable",
                        "visible": true
                    },
                    {
                        "align": 5,
                        "bounds": {
                            "x": 0.0,
                            "y": 0.0
                        },
                        "bounds_align": 0,
                        "bounds_type": 0,
                        "crop_bottom": 0,
                        "crop_left": 0,
                        "crop_right": 0,
                        "crop_top": 0,
                        "group_item_backup": false,
                        "id": 5,
                        "locked": false,
                        "name": "Salon",
                        "pos": {
                            "x": 47.0,
                            "y": 26.0
                        },
                        "private_settings": {},
                        "rot": 0.0,
                        "scale": {
                            "x": 0.94583332538604736,
                            "y": 0.94629627466201782
                        },
                        "scale_filter": "disable",
                        "visible": true
                    },
                    {
                        "align": 5,
                        "bounds": {
                            "x": 0.0,
                            "y": 0.0
                        },
                        "bounds_align": 0,
                        "bounds_type": 0,
                        "crop_bottom": 15,
                        "crop_left": 0,
                        "crop_right": 0,
                        "crop_top": 15,
                        "group_item_backup": false,
                        "id": 3,
                        "locked": false,
                        "name": "Chroma.mp4",
                        "pos": {
                            "x": 1742.0,
                            "y": 85.141876220703125
                        },
                        "private_settings": {},
                        "rot": 0.0,
                        "scale": {
                            "x": 1.0,
                            "y": 1.0
                        },
                        "scale_filter": "disable",
                        "visible": true
                    }
                ]
            },
            "sync": 0,
            "versioned_id": "scene",
            "volume": 1.0
        },
        {
            "balance": 0.5,
            "deinterlace_field_order": 0,
            "deinterlace_mode": 0,
            "enabled": true,
            "flags": 0,
            "hotkeys": {
                "libobs.mute": [],
                "libobs.push-to-mute": [],
                "libobs.push-to-talk": [],
                "libobs.unmute": []
            },
            "id": "browser_source",
            "mixers": 255,
            "monitoring_type": 0,
            "muted": false,
            "name": "Salon",
            "prev_ver": 436273153,
            "private_settings": {},
            "push-to-mute": false,
            "push-to-mute-delay": 0,
            "push-to-talk": false,
            "push-to-talk-delay": 0,
            "settings": {
                "height": 1080,
                "reroute_audio": true,
                "url": "https://obs.ninja/?scene=1&room=qb&password=Abc",
                "width": 1920
            },
            "sync": 0,
            "versioned_id": "browser_source",
            "volume": 0.21036271750926971
        },
        {
            "balance": 0.5,
            "deinterlace_field_order": 0,
            "deinterlace_mode": 0,
            "enabled": true,
            "flags": 0,
            "hotkeys": {
                "OBSBasic.SelectScene": [],
                "libobs.hide_scene_item.Ads": [],
                "libobs.hide_scene_item.BASH": [],
                "libobs.hide_scene_item.FISH": [],
                "libobs.hide_scene_item.Musica": [],
                "libobs.hide_scene_item.Regresiva-5-Min.mp4": [],
                "libobs.hide_scene_item.ZSH": [],
                "libobs.show_scene_item.Ads": [],
                "libobs.show_scene_item.BASH": [],
                "libobs.show_scene_item.FISH": [],
                "libobs.show_scene_item.Musica": [],
                "libobs.show_scene_item.Regresiva-5-Min.mp4": [],
                "libobs.show_scene_item.ZSH": []
            },
            "id": "scene",
            "mixers": 0,
            "monitoring_type": 0,
            "muted": false,
            "name": "5min",
            "prev_ver": 436273153,
            "private_settings": {},
            "push-to-mute": false,
            "push-to-mute-delay": 0,
            "push-to-talk": false,
            "push-to-talk-delay": 0,
            "settings": {
                "custom_size": false,
                "id_counter": 7,
                "items": [
                    {
                        "align": 5,
                        "bounds": {
                            "x": 0.0,
                            "y": 0.0
                        },
                        "bounds_align": 0,
                        "bounds_type": 0,
                        "crop_bottom": 0,
                        "crop_left": 0,
                        "crop_right": 0,
                        "crop_top": 0,
                        "group_item_backup": false,
                        "id": 1,
                        "locked": false,
                        "name": "Regresiva-5-Min.mp4",
                        "pos": {
                            "x": 0.0,
                            "y": 0.0
                        },
                        "private_settings": {},
                        "rot": 0.0,
                        "scale": {
                            "x": 1.0,
                            "y": 1.0
                        },
                        "scale_filter": "disable",
                        "visible": true
                    },
                    {
                        "align": 5,
                        "bounds": {
                            "x": 0.0,
                            "y": 0.0
                        },
                        "bounds_align": 0,
                        "bounds_type": 0,
                        "crop_bottom": 0,
                        "crop_left": 0,
                        "crop_right": 0,
                        "crop_top": 0,
                        "group_item_backup": false,
                        "id": 2,
                        "locked": false,
                        "name": "Musica",
                        "pos": {
                            "x": 0.0,
                            "y": 0.0
                        },
                        "private_settings": {},
                        "rot": 0.0,
                        "scale": {
                            "x": 1.0,
                            "y": 1.0
                        },
                        "scale_filter": "disable",
                        "visible": true
                    },
                    {
                        "align": 5,
                        "bounds": {
                            "x": 0.0,
                            "y": 0.0
                        },
                        "bounds_align": 0,
                        "bounds_type": 0,
                        "crop_bottom": 0,
                        "crop_left": 0,
                        "crop_right": 0,
                        "crop_top": 0,
                        "group_item_backup": false,
                        "id": 5,
                        "locked": false,
                        "name": "FISH",
                        "pos": {
                            "x": 1064.0,
                            "y": 196.0
                        },
                        "private_settings": {},
                        "rot": 0.0,
                        "scale": {
                            "x": 0.65462964773178101,
                            "y": 0.65462964773178101
                        },
                        "scale_filter": "disable",
                        "visible": false
                    },
                    {
                        "align": 5,
                        "bounds": {
                            "x": 0.0,
                            "y": 0.0
                        },
                        "bounds_align": 0,
                        "bounds_type": 0,
                        "crop_bottom": 0,
                        "crop_left": 0,
                        "crop_right": 0,
                        "crop_top": 0,
                        "group_item_backup": false,
                        "id": 4,
                        "locked": false,
                        "name": "BASH",
                        "pos": {
                            "x": 1063.0,
                            "y": 196.0
                        },
                        "private_settings": {},
                        "rot": 0.0,
                        "scale": {
                            "x": 0.65740740299224854,
                            "y": 0.65740740299224854
                        },
                        "scale_filter": "disable",
                        "visible": false
                    },
                    {
                        "align": 5,
                        "bounds": {
                            "x": 0.0,
                            "y": 0.0
                        },
                        "bounds_align": 0,
                        "bounds_type": 0,
                        "crop_bottom": 0,
                        "crop_left": 0,
                        "crop_right": 0,
                        "crop_top": 0,
                        "group_item_backup": false,
                        "id": 6,
                        "locked": false,
                        "name": "ZSH",
                        "pos": {
                            "x": 1062.0,
                            "y": 196.0
                        },
                        "private_settings": {},
                        "rot": 0.0,
                        "scale": {
                            "x": 0.65833336114883423,
                            "y": 0.65833336114883423
                        },
                        "scale_filter": "disable",
                        "visible": false
                    },
                    {
                        "align": 5,
                        "bounds": {
                            "x": 0.0,
                            "y": 0.0
                        },
                        "bounds_align": 0,
                        "bounds_type": 0,
                        "crop_bottom": 0,
                        "crop_left": 0,
                        "crop_right": 0,
                        "crop_top": 0,
                        "group_item_backup": false,
                        "id": 7,
                        "locked": false,
                        "name": "Ads",
                        "pos": {
                            "x": 1060.0,
                            "y": 196.0
                        },
                        "private_settings": {},
                        "rot": 0.0,
                        "scale": {
                            "x": 0.66388887166976929,
                            "y": 0.66388887166976929
                        },
                        "scale_filter": "disable",
                        "visible": true
                    }
                ]
            },
            "sync": 0,
            "versioned_id": "scene",
            "volume": 1.0
        },
        {
            "balance": 0.5,
            "deinterlace_field_order": 0,
            "deinterlace_mode": 0,
            "enabled": true,
            "flags": 0,
            "hotkeys": {
                "MediaSource.Pause": [],
                "MediaSource.Play": [],
                "MediaSource.Restart": [],
                "MediaSource.Stop": [],
                "libobs.mute": [],
                "libobs.push-to-mute": [],
                "libobs.push-to-talk": [],
                "libobs.unmute": []
            },
            "id": "ffmpeg_source",
            "mixers": 255,
            "monitoring_type": 0,
            "muted": false,
            "name": "Regresiva-5-Min.mp4",
            "prev_ver": 436273153,
            "private_settings": {},
            "push-to-mute": false,
            "push-to-mute-delay": 0,
            "push-to-talk": false,
            "push-to-talk-delay": 0,
            "settings": {
                "local_file": "C:/Users/ZL314VZ/AppData/Roaming/slobs-client/Overlays/flisol/Regresiva-5-Min.mp4"
            },
            "sync": 0,
            "versioned_id": "ffmpeg_source",
            "volume": 1.0
        },
        {
            "balance": 0.5,
            "deinterlace_field_order": 0,
            "deinterlace_mode": 0,
            "enabled": true,
            "flags": 0,
            "hotkeys": {
                "VLCSource.PlayPause": [],
                "VLCSource.PlaylistNext": [],
                "VLCSource.PlaylistPrev": [],
                "VLCSource.Restart": [],
                "VLCSource.Stop": [],
                "libobs.mute": [],
                "libobs.push-to-mute": [],
                "libobs.push-to-talk": [],
                "libobs.unmute": []
            },
            "id": "vlc_source",
            "mixers": 255,
            "monitoring_type": 0,
            "muted": false,
            "name": "Musica",
            "prev_ver": 436273153,
            "private_settings": {
                "volume_locked": false
            },
            "push-to-mute": false,
            "push-to-mute-delay": 0,
            "push-to-talk": false,
            "push-to-talk-delay": 0,
            "settings": {
                "playlist": [
                    {
                        "hidden": false,
                        "selected": true,
                        "value": "C:/Users/ZL314VZ/AppData/Roaming/slobs-client/Overlays/flisol/music"
                    }
                ],
                "shuffle": true,
                "subtitle_enable": false
            },
            "sync": 0,
            "versioned_id": "vlc_source",
            "volume": 0.15066421031951904
        },
        {
            "balance": 0.5,
            "deinterlace_field_order": 0,
            "deinterlace_mode": 0,
            "enabled": true,
            "flags": 0,
            "hotkeys": {
                "libobs.mute": [],
                "libobs.push-to-mute": [],
                "libobs.push-to-talk": [],
                "libobs.unmute": []
            },
            "id": "browser_source",
            "mixers": 255,
            "monitoring_type": 0,
            "muted": false,
            "name": "Cam1A",
            "prev_ver": 436273153,
            "private_settings": {},
            "push-to-mute": false,
            "push-to-mute-delay": 0,
            "push-to-talk": false,
            "push-to-talk-delay": 0,
            "settings": {
                "height": 1080,
                "reroute_audio": true,
                "url": "https://obs.ninja/?view=eGYcEXf&scene&room=qb&password=Abc",
                "width": 1920
            },
            "sync": 0,
            "versioned_id": "browser_source",
            "volume": 1.0
        },
        {
            "balance": 0.5,
            "deinterlace_field_order": 0,
            "deinterlace_mode": 0,
            "enabled": true,
            "flags": 0,
            "hotkeys": {
                "OBSBasic.SelectScene": [],
                "libobs.hide_scene_item.Cam1A": [],
                "libobs.hide_scene_item.Cam2A": [],
                "libobs.hide_scene_item.Cam3A": [],
                "libobs.hide_scene_item.Chroma.mp4": [],
                "libobs.hide_scene_item.Fondo-Transmision.png": [],
                "libobs.show_scene_item.Cam1A": [],
                "libobs.show_scene_item.Cam2A": [],
                "libobs.show_scene_item.Cam3A": [],
                "libobs.show_scene_item.Chroma.mp4": [],
                "libobs.show_scene_item.Fondo-Transmision.png": []
            },
            "id": "scene",
            "mixers": 0,
            "monitoring_type": 0,
            "muted": false,
            "name": "cam3A",
            "prev_ver": 436273153,
            "private_settings": {},
            "push-to-mute": false,
            "push-to-mute-delay": 0,
            "push-to-talk": false,
            "push-to-talk-delay": 0,
            "settings": {
                "custom_size": false,
                "id_counter": 5,
                "items": [
                    {
                        "align": 5,
                        "bounds": {
                            "x": 0.0,
                            "y": 0.0
                        },
                        "bounds_align": 0,
                        "bounds_type": 0,
                        "crop_bottom": 0,
                        "crop_left": 0,
                        "crop_right": 0,
                        "crop_top": 0,
                        "group_item_backup": false,
                        "id": 1,
                        "locked": false,
                        "name": "Fondo-Transmision.png",
                        "pos": {
                            "x": 0.0,
                            "y": 0.0
                        },
                        "private_settings": {},
                        "rot": 0.0,
                        "scale": {
                            "x": 0.75,
                            "y": 0.75
                        },
                        "scale_filter": "disable",
                        "visible": true
                    },
                    {
                        "align": 5,
                        "bounds": {
                            "x": 0.0,
                            "y": 0.0
                        },
                        "bounds_align": 0,
                        "bounds_type": 0,
                        "crop_bottom": 0,
                        "crop_left": 0,
                        "crop_right": 0,
                        "crop_top": 0,
                        "group_item_backup": false,
                        "id": 5,
                        "locked": false,
                        "name": "Cam3A",
                        "pos": {
                            "x": 491.0,
                            "y": 250.0
                        },
                        "private_settings": {},
                        "rot": 0.0,
                        "scale": {
                            "x": 0.73072916269302368,
                            "y": 0.73055553436279297
                        },
                        "scale_filter": "disable",
                        "visible": true
                    },
                    {
                        "align": 5,
                        "bounds": {
                            "x": 0.0,
                            "y": 0.0
                        },
                        "bounds_align": 0,
                        "bounds_type": 0,
                        "crop_bottom": 0,
                        "crop_left": 0,
                        "crop_right": 0,
                        "crop_top": 0,
                        "group_item_backup": false,
                        "id": 2,
                        "locked": false,
                        "name": "Cam2A",
                        "pos": {
                            "x": 16.0,
                            "y": 778.0
                        },
                        "private_settings": {},
                        "rot": 0.0,
                        "scale": {
                            "x": 0.36250001192092896,
                            "y": 0.36250001192092896
                        },
                        "scale_filter": "disable",
                        "visible": true
                    },
                    {
                        "align": 5,
                        "bounds": {
                            "x": 0.0,
                            "y": 0.0
                        },
                        "bounds_align": 0,
                        "bounds_type": 0,
                        "crop_bottom": 0,
                        "crop_left": 0,
                        "crop_right": 0,
                        "crop_top": 0,
                        "group_item_backup": false,
                        "id": 4,
                        "locked": false,
                        "name": "Cam1A",
                        "pos": {
                            "x": 18.0,
                            "y": 497.0
                        },
                        "private_settings": {},
                        "rot": 0.0,
                        "scale": {
                            "x": 0.2395833283662796,
                            "y": 0.23981481790542603
                        },
                        "scale_filter": "disable",
                        "visible": true
                    },
                    {
                        "align": 5,
                        "bounds": {
                            "x": 0.0,
                            "y": 0.0
                        },
                        "bounds_align": 0,
                        "bounds_type": 0,
                        "crop_bottom": 15,
                        "crop_left": 0,
                        "crop_right": 0,
                        "crop_top": 15,
                        "group_item_backup": false,
                        "id": 3,
                        "locked": false,
                        "name": "Chroma.mp4",
                        "pos": {
                            "x": 1742.0,
                            "y": 121.14187622070313
                        },
                        "private_settings": {},
                        "rot": 0.0,
                        "scale": {
                            "x": 1.0,
                            "y": 1.0
                        },
                        "scale_filter": "disable",
                        "visible": true
                    }
                ]
            },
            "sync": 0,
            "versioned_id": "scene",
            "volume": 1.0
        },
        {
            "balance": 0.5,
            "deinterlace_field_order": 0,
            "deinterlace_mode": 0,
            "enabled": true,
            "flags": 0,
            "hotkeys": {
                "libobs.mute": [],
                "libobs.push-to-mute": [],
                "libobs.push-to-talk": [],
                "libobs.unmute": []
            },
            "id": "browser_source",
            "mixers": 255,
            "monitoring_type": 0,
            "muted": false,
            "name": "Cam3A",
            "prev_ver": 436273153,
            "private_settings": {},
            "push-to-mute": false,
            "push-to-mute-delay": 0,
            "push-to-talk": false,
            "push-to-talk-delay": 0,
            "settings": {
                "height": 1080,
                "reroute_audio": true,
                "url": "https://obs.ninja/?view=hKntBfx&scene&room=qb",
                "width": 1920
            },
            "sync": 0,
            "versioned_id": "browser_source",
            "volume": 1.0
        },
        {
            "balance": 0.5,
            "deinterlace_field_order": 0,
            "deinterlace_mode": 0,
            "enabled": true,
            "flags": 0,
            "hotkeys": {
                "SlideShow.NextSlide": [],
                "SlideShow.PlayPause": [],
                "SlideShow.PreviousSlide": [],
                "SlideShow.Restart": [],
                "SlideShow.Stop": []
            },
            "id": "slideshow",
            "mixers": 0,
            "monitoring_type": 0,
            "muted": false,
            "name": "BASH",
            "prev_ver": 436273153,
            "private_settings": {},
            "push-to-mute": false,
            "push-to-mute-delay": 0,
            "push-to-talk": false,
            "push-to-talk-delay": 0,
            "settings": {
                "files": [
                    {
                        "hidden": false,
                        "selected": false,
                        "value": "C:/Users/ZL314VZ/AppData/Roaming/slobs-client/Overlays/flisol/propaganda/Canal BASH"
                    }
                ],
                "randomize": true
            },
            "sync": 0,
            "versioned_id": "slideshow",
            "volume": 1.0
        },
        {
            "balance": 0.5,
            "deinterlace_field_order": 0,
            "deinterlace_mode": 0,
            "enabled": true,
            "flags": 0,
            "hotkeys": {
                "SlideShow.NextSlide": [],
                "SlideShow.PlayPause": [],
                "SlideShow.PreviousSlide": [],
                "SlideShow.Restart": [],
                "SlideShow.Stop": []
            },
            "id": "slideshow",
            "mixers": 0,
            "monitoring_type": 0,
            "muted": false,
            "name": "FISH",
            "prev_ver": 436273153,
            "private_settings": {},
            "push-to-mute": false,
            "push-to-mute-delay": 0,
            "push-to-talk": false,
            "push-to-talk-delay": 0,
            "settings": {
                "files": [
                    {
                        "hidden": false,
                        "selected": false,
                        "value": "C:/Users/ZL314VZ/AppData/Roaming/slobs-client/Overlays/flisol/propaganda/Canal FISH"
                    }
                ],
                "randomize": true,
                "transition": "swipe"
            },
            "sync": 0,
            "versioned_id": "slideshow",
            "volume": 1.0
        },
        {
            "balance": 0.5,
            "deinterlace_field_order": 0,
            "deinterlace_mode": 0,
            "enabled": true,
            "flags": 0,
            "hotkeys": {
                "SlideShow.NextSlide": [],
                "SlideShow.PlayPause": [],
                "SlideShow.PreviousSlide": [],
                "SlideShow.Restart": [],
                "SlideShow.Stop": []
            },
            "id": "slideshow",
            "mixers": 0,
            "monitoring_type": 0,
            "muted": false,
            "name": "ZSH",
            "prev_ver": 436273153,
            "private_settings": {},
            "push-to-mute": false,
            "push-to-mute-delay": 0,
            "push-to-talk": false,
            "push-to-talk-delay": 0,
            "settings": {
                "files": [
                    {
                        "hidden": false,
                        "selected": false,
                        "value": "C:/Users/ZL314VZ/AppData/Roaming/slobs-client/Overlays/flisol/propaganda/Canal ZSH"
                    }
                ],
                "randomize": true,
                "transition": "slide"
            },
            "sync": 0,
            "versioned_id": "slideshow",
            "volume": 1.0
        },
        {
            "balance": 0.5,
            "deinterlace_field_order": 0,
            "deinterlace_mode": 0,
            "enabled": true,
            "flags": 0,
            "hotkeys": {
                "SlideShow.NextSlide": [],
                "SlideShow.PlayPause": [],
                "SlideShow.PreviousSlide": [],
                "SlideShow.Restart": [],
                "SlideShow.Stop": []
            },
            "id": "slideshow",
            "mixers": 0,
            "monitoring_type": 0,
            "muted": false,
            "name": "Ads",
            "prev_ver": 436273153,
            "private_settings": {},
            "push-to-mute": false,
            "push-to-mute-delay": 0,
            "push-to-talk": false,
            "push-to-talk-delay": 0,
            "settings": {
                "files": [
                    {
                        "hidden": false,
                        "selected": false,
                        "value": "C:/Users/ZL314VZ/AppData/Roaming/slobs-client/Overlays/flisol/propaganda/Canal BASH"
                    },
                    {
                        "hidden": false,
                        "selected": false,
                        "value": "C:/Users/ZL314VZ/AppData/Roaming/slobs-client/Overlays/flisol/propaganda/Canal FISH"
                    },
                    {
                        "hidden": false,
                        "selected": false,
                        "value": "C:/Users/ZL314VZ/AppData/Roaming/slobs-client/Overlays/flisol/propaganda/Canal ZSH"
                    }
                ],
                "randomize": true,
                "transition": "slide"
            },
            "sync": 0,
            "versioned_id": "slideshow",
            "volume": 1.0
        },
        {
            "balance": 0.5,
            "deinterlace_field_order": 0,
            "deinterlace_mode": 0,
            "enabled": true,
            "flags": 0,
            "hotkeys": {},
            "id": "text_gdiplus",
            "mixers": 0,
            "monitoring_type": 0,
            "muted": false,
            "name": "DESTACADO",
            "prev_ver": 436273153,
            "private_settings": {},
            "push-to-mute": false,
            "push-to-mute-delay": 0,
            "push-to-talk": false,
            "push-to-talk-delay": 0,
            "settings": {
                "align": "center",
                "antialiasing": true,
                "chatlog": false,
                "extents": false,
                "font": {
                    "face": "Ubuntu Mono",
                    "flags": 0,
                    "size": 72,
                    "style": "Regular"
                },
                "outline": true,
                "outline_opacity": 100,
                "read_from_file": false,
                "text": "DESTACADO",
                "vertical": false
            },
            "sync": 0,
            "versioned_id": "text_gdiplus_v2",
            "volume": 1.0
        }
    ],
    "transition_duration": 300,
    "transitions": [
        {
            "id": "obs_stinger_transition",
            "name": "Stinger",
            "settings": {}
        }
    ]
}

