module wrldguard-bot

go 1.17

require github.com/bwmarrin/discordgo v0.28.1

require (
	github.com/gorilla/websocket v1.5.2 // indirect
	golang.org/x/crypto v0.24.0 // indirect
	golang.org/x/net v0.26.0 // indirect
	golang.org/x/sys v0.21.0 // indirect
)
