{
  "/ms-infocad/*": {
    "target": "http://localhost:8080",
    "secure": false,
    "logLevel": "debug",
    "pathRewrite": {
      "^/ms-infocad": ""
    }
  },
  "/ms-authserver/*": {
    "target": "http://localhost:8081",
    "secure": false,
    "logLevel": "debug",
    "changeOrigin": true,
    "pathRewrite": {
      "^/ms-authserver": ""
    }
  }
}
