{
    {{ with .File }}"id": "{{ .BaseFileName }}",{{ end }}
    {{ with .Type }}"type": "{{ . }}",{{end}}
    "attributes": {
	{{ with .Title }}"title": "{{ . }}",{{end}}

	{{ with .File }}"slug": "{{ . }}",{{ end }}

	{{ with .Permalink }}"permalink": "{{ . }}",{{end}}

	{{ with .Summary }}"summary": {{ . | jsonify }},{{end}}
	{{ with .RawContent }}"rawContent": {{ . | jsonify }},{{end}}
	{{ with .Params.paypal}}"paypal": {{ .}},{{end}}
	"gallery": [
	    {{ with .Params.gallery }}
	    {{ range $index, $item := . }}
	    {{ if $index }},{{ end }}
	    {
		{{ with $item.image }}"image": "{{ . }}"{{ end }}
		{{ with $item.caption }},"caption": "{{ . }}"{{ end }}
	    }
	    {{ end }}
	    {{ end }}
	]
    }
}
