{
    "Titulo" : "Marcas",
    "ModalMensaje" : {
        "Titulo" : "Módulo - Marcas"
    },
    "ModalConfirmacion" : {
        "Titulo" : "Módulo - Marcas",
        "Agregar" : "Confirma crear la marca con los datos suministrados.",
        "Edicion" : "Confirma modificar la marca con los datos suministrados.",
        "Eliminacion" : "Confirma eliminar la marca con los datos suministrados."
    }
}