{
    "Titulo" : "Categoria",
    "ModalMensaje" : {
        "Titulo" : "Módulo - Categoria"
    },
    "ModalConfirmacion" : {
        "Titulo" : "Módulo - Categoria",
        "Agregar" : "Confirma crear la categoria con los datos suministrados",
        "Edicion" : "Confirma modificar la categoria con los datos suministrados.",
        "Eliminacion" : "Confirma eliminar la categoria con los datos suministrados."
    }
}