{
    "Titulo" : "Unidad de medida ",
    "ModalMensaje" : {
        "Titulo" : "Módulo - Unidad de medida"
    },
    "ModalConfirmacion" : {
        "Titulo" : "Módulo - Unidad de medida",
        "Agregar" : "Confirma crear la unidad de medida con los datos suministrados.",
        "Edicion" : "Confirma modificar la unidad de medida con los datos suministrados.",
        "Eliminacion" : "Confirma eliminar la unidad de medida."
    }
}