{
    "Titulo" : "Subcategoria",
    "ModalMensaje" : {
        "Titulo" : "Módulo - Subcategoria"
    },
    "ModalConfirmacion" : {
        "Titulo" : "Módulo - Subcategoria",
        "Agregar" : "Confirma crear la subcategoria con los datos suministrados",
        "Edicion" : "Confirma modificar la subcategoria con los datos suministrados.",
        "Eliminacion" : "Confirma eliminar la subcategoria con los datos suministrados."
    }
}