{
    "Titulo" : "Estado Civil",
    "ModalMensaje" : {
        "Titulo" : "Módulo - Estado Civil"
    },
    "ModalConfirmacion" : {
        "Titulo" : "Módulo - Estado Civil",
        "Agregar" : "Confirma crear el estado civil con los datos suministrados.",
        "Edicion" : "Confirma modificar el estado civil con los datos suministrados.",
        "Eliminacion" : "Confirma eliminar el estado civil."
    }
}