{
    "Titulo" : "Tipos de Ajuste ",
    "ModalMensaje" : {
        "Titulo" : "Módulo - Tipos de Ajuste"
    },
    "ModalConfirmacion" : {
        "Titulo" : "Módulo - Tipos de Ajuste",
        "Agregar" : "Confirma crear el tipo de ajuste con los datos suministrados.",
        "Edicion" : "Confirma modificar el tipo de ajuste con los datos suministrados.",
        "Eliminacion" : "Confirma eliminar el tipo de ajuste con los datos suministrados."
    }
}