{
    "Titulo" : "Cupones",
    "ModalMensaje" : {
        "Titulo" : "Módulo - Clasificación de artículos"
    },
    "ModalConfirmacion" : {
        "Titulo" : "Módulo - Clasificación de artículos",
        "Agregar" : "Confirma crear el cupon con los datos suministrados.",
        "Edicion" : "Confirma modificar el cupon con los datos suministrados.",
        "Eliminacion" : "Confirma eliminar el cupon con los datos suministrados."
    }
}