{
    "Titulo" : "Grupo",
    "ModalMensaje" : {
        "Titulo" : "Módulo - Grupo"
    },
    "ModalConfirmacion" : {
        "Titulo" : "Módulo - Grupo",
        "Agregar" : "Confirma crear el grupo con los datos suministrados",
        "Edicion" : "Confirma modificar el grupo con los datos suministrados.",
        "Eliminacion" : "Confirma eliminar el grupo con los datos suministrados."
    }
}