{
    "Titulo" : "Colecciones",
    "ModalMensaje" : {
        "Titulo" : "Módulo - Colecciones"
    },
    "ModalConfirmacion" : {
        "Titulo" : "Módulo - Colecciones",
        "Agregar" : "Confirma crear la colección con los datos suministrados.",
        "Edicion" : "Confirma modificar la colección con los datos suministrados.",
        "Eliminacion" : "Confirma eliminar la colección con los datos suministrados."
    }
}