-------------------------------------------------------------------------------
Test set: com.example.transaction.TransactionApplicationTests
-------------------------------------------------------------------------------
Tests run: 1, Failures: 0, Errors: 0, Skipped: 0, Time elapsed: 12.017 s - in com.example.transaction.TransactionApplicationTests
