ISO-10303-21;
HEADER;
FILE_DESCRIPTION(('FreeCAD Model'),'2;1');
FILE_NAME('/home/jat/Dropbox/Projekty/CAD/744825605/744825605.step',
  '2020-12-17T19:15:31',('kicad StepUp'),('ksu MCAD'),
  'Open CASCADE STEP processor 7.3','FreeCAD','Unknown');
FILE_SCHEMA(('AUTOMOTIVE_DESIGN { 1 0 10303 214 1 1 1 1 }'));
ENDSEC;
DATA;
#1 = APPLICATION_PROTOCOL_DEFINITION('international standard',
  'automotive_design',2000,#2);
#2 = APPLICATION_CONTEXT(
  'core data for automotive mechanical design processes');
#3 = SHAPE_DEFINITION_REPRESENTATION(#4,#10);
#4 = PRODUCT_DEFINITION_SHAPE('','',#5);
#5 = PRODUCT_DEFINITION('design','',#6,#9);
#6 = PRODUCT_DEFINITION_FORMATION('','',#7);
#7 = PRODUCT('744825605','744825605','',(#8));
#8 = PRODUCT_CONTEXT('',#2,'mechanical');
#9 = PRODUCT_DEFINITION_CONTEXT('part definition',#2,'design');
#10 = SHAPE_REPRESENTATION('',(#11,#15,#813),#1009);
#11 = AXIS2_PLACEMENT_3D('',#12,#13,#14);
#12 = CARTESIAN_POINT('',(0.,0.,0.));
#13 = DIRECTION('',(0.,0.,1.));
#14 = DIRECTION('',(1.,0.,-0.));
#15 = MANIFOLD_SOLID_BREP('',#16);
#16 = CLOSED_SHELL('',(#17,#57,#90,#123,#156,#189,#206,#223,#254,#329,
    #346,#377,#394,#425,#443,#461,#494,#512,#543,#568,#593,#618,#643,
    #661,#692,#721,#732,#743,#755,#766,#775,#784,#793,#802));
#17 = ADVANCED_FACE('',(#18),#52,.F.);
#18 = FACE_BOUND('',#19,.F.);
#19 = EDGE_LOOP('',(#20,#30,#38,#46));
#20 = ORIENTED_EDGE('',*,*,#21,.F.);
#21 = EDGE_CURVE('',#22,#24,#26,.T.);
#22 = VERTEX_POINT('',#23);
#23 = CARTESIAN_POINT('',(1.5,-3.,1.));
#24 = VERTEX_POINT('',#25);
#25 = CARTESIAN_POINT('',(1.5,-3.,6.));
#26 = LINE('',#27,#28);
#27 = CARTESIAN_POINT('',(1.5,-3.,0.));
#28 = VECTOR('',#29,1.);
#29 = DIRECTION('',(0.,0.,1.));
#30 = ORIENTED_EDGE('',*,*,#31,.T.);
#31 = EDGE_CURVE('',#22,#32,#34,.T.);
#32 = VERTEX_POINT('',#33);
#33 = CARTESIAN_POINT('',(-26.5,-3.,1.));
#34 = LINE('',#35,#36);
#35 = CARTESIAN_POINT('',(2.5,-3.,1.));
#36 = VECTOR('',#37,1.);
#37 = DIRECTION('',(-1.,2.22044604925E-16,0.));
#38 = ORIENTED_EDGE('',*,*,#39,.T.);
#39 = EDGE_CURVE('',#32,#40,#42,.T.);
#40 = VERTEX_POINT('',#41);
#41 = CARTESIAN_POINT('',(-26.5,-3.,6.));
#42 = LINE('',#43,#44);
#43 = CARTESIAN_POINT('',(-26.5,-3.,0.));
#44 = VECTOR('',#45,1.);
#45 = DIRECTION('',(0.,0.,1.));
#46 = ORIENTED_EDGE('',*,*,#47,.F.);
#47 = EDGE_CURVE('',#24,#40,#48,.T.);
#48 = LINE('',#49,#50);
#49 = CARTESIAN_POINT('',(2.5,-3.,6.));
#50 = VECTOR('',#51,1.);
#51 = DIRECTION('',(-1.,2.22044604925E-16,0.));
#52 = PLANE('',#53);
#53 = AXIS2_PLACEMENT_3D('',#54,#55,#56);
#54 = CARTESIAN_POINT('',(2.5,-3.,0.));
#55 = DIRECTION('',(2.22044604925E-16,1.,0.));
#56 = DIRECTION('',(0.,0.,1.));
#57 = ADVANCED_FACE('',(#58),#85,.T.);
#58 = FACE_BOUND('',#59,.T.);
#59 = EDGE_LOOP('',(#60,#61,#70,#78));
#60 = ORIENTED_EDGE('',*,*,#21,.F.);
#61 = ORIENTED_EDGE('',*,*,#62,.T.);
#62 = EDGE_CURVE('',#22,#63,#65,.T.);
#63 = VERTEX_POINT('',#64);
#64 = CARTESIAN_POINT('',(2.5,-2.,1.));
#65 = CIRCLE('',#66,1.);
#66 = AXIS2_PLACEMENT_3D('',#67,#68,#69);
#67 = CARTESIAN_POINT('',(1.5,-2.,1.));
#68 = DIRECTION('',(0.,0.,1.));
#69 = DIRECTION('',(-2.22044604925E-16,-1.,0.));
#70 = ORIENTED_EDGE('',*,*,#71,.T.);
#71 = EDGE_CURVE('',#63,#72,#74,.T.);
#72 = VERTEX_POINT('',#73);
#73 = CARTESIAN_POINT('',(2.5,-2.,6.));
#74 = LINE('',#75,#76);
#75 = CARTESIAN_POINT('',(2.5,-2.,0.));
#76 = VECTOR('',#77,1.);
#77 = DIRECTION('',(0.,0.,1.));
#78 = ORIENTED_EDGE('',*,*,#79,.F.);
#79 = EDGE_CURVE('',#24,#72,#80,.T.);
#80 = CIRCLE('',#81,1.);
#81 = AXIS2_PLACEMENT_3D('',#82,#83,#84);
#82 = CARTESIAN_POINT('',(1.5,-2.,6.));
#83 = DIRECTION('',(0.,0.,1.));
#84 = DIRECTION('',(-2.22044604925E-16,-1.,0.));
#85 = CYLINDRICAL_SURFACE('',#86,1.);
#86 = AXIS2_PLACEMENT_3D('',#87,#88,#89);
#87 = CARTESIAN_POINT('',(1.5,-2.,0.));
#88 = DIRECTION('',(0.,0.,1.));
#89 = DIRECTION('',(-2.22044604925E-16,-1.,0.));
#90 = ADVANCED_FACE('',(#91),#118,.T.);
#91 = FACE_BOUND('',#92,.F.);
#92 = EDGE_LOOP('',(#93,#102,#110,#117));
#93 = ORIENTED_EDGE('',*,*,#94,.F.);
#94 = EDGE_CURVE('',#95,#22,#97,.T.);
#95 = VERTEX_POINT('',#96);
#96 = CARTESIAN_POINT('',(1.5,-2.,0.));
#97 = CIRCLE('',#98,1.);
#98 = AXIS2_PLACEMENT_3D('',#99,#100,#101);
#99 = CARTESIAN_POINT('',(1.5,-2.,1.));
#100 = DIRECTION('',(-1.,2.22044604925E-16,0.));
#101 = DIRECTION('',(-2.22044604925E-16,-1.,0.));
#102 = ORIENTED_EDGE('',*,*,#103,.T.);
#103 = EDGE_CURVE('',#95,#104,#106,.T.);
#104 = VERTEX_POINT('',#105);
#105 = CARTESIAN_POINT('',(-26.5,-2.,0.));
#106 = LINE('',#107,#108);
#107 = CARTESIAN_POINT('',(2.5,-2.,-2.22044604925E-16));
#108 = VECTOR('',#109,1.);
#109 = DIRECTION('',(-1.,2.22044604925E-16,0.));
#110 = ORIENTED_EDGE('',*,*,#111,.T.);
#111 = EDGE_CURVE('',#104,#32,#112,.T.);
#112 = CIRCLE('',#113,1.);
#113 = AXIS2_PLACEMENT_3D('',#114,#115,#116);
#114 = CARTESIAN_POINT('',(-26.5,-2.,1.));
#115 = DIRECTION('',(-1.,2.22044604925E-16,0.));
#116 = DIRECTION('',(-2.22044604925E-16,-1.,0.));
#117 = ORIENTED_EDGE('',*,*,#31,.F.);
#118 = CYLINDRICAL_SURFACE('',#119,1.);
#119 = AXIS2_PLACEMENT_3D('',#120,#121,#122);
#120 = CARTESIAN_POINT('',(2.5,-2.,1.));
#121 = DIRECTION('',(-1.,2.22044604925E-16,0.));
#122 = DIRECTION('',(-2.22044604925E-16,-1.,0.));
#123 = ADVANCED_FACE('',(#124),#151,.T.);
#124 = FACE_BOUND('',#125,.T.);
#125 = EDGE_LOOP('',(#126,#135,#143,#150));
#126 = ORIENTED_EDGE('',*,*,#127,.F.);
#127 = EDGE_CURVE('',#128,#24,#130,.T.);
#128 = VERTEX_POINT('',#129);
#129 = CARTESIAN_POINT('',(1.5,-2.,7.));
#130 = CIRCLE('',#131,1.);
#131 = AXIS2_PLACEMENT_3D('',#132,#133,#134);
#132 = CARTESIAN_POINT('',(1.5,-2.,6.));
#133 = DIRECTION('',(1.,-2.22044604925E-16,0.));
#134 = DIRECTION('',(-2.22044604925E-16,-1.,0.));
#135 = ORIENTED_EDGE('',*,*,#136,.T.);
#136 = EDGE_CURVE('',#128,#137,#139,.T.);
#137 = VERTEX_POINT('',#138);
#138 = CARTESIAN_POINT('',(-26.5,-2.,7.));
#139 = LINE('',#140,#141);
#140 = CARTESIAN_POINT('',(2.5,-2.,7.));
#141 = VECTOR('',#142,1.);
#142 = DIRECTION('',(-1.,2.22044604925E-16,0.));
#143 = ORIENTED_EDGE('',*,*,#144,.F.);
#144 = EDGE_CURVE('',#40,#137,#145,.T.);
#145 = CIRCLE('',#146,1.);
#146 = AXIS2_PLACEMENT_3D('',#147,#148,#149);
#147 = CARTESIAN_POINT('',(-26.5,-2.,6.));
#148 = DIRECTION('',(-1.,2.22044604925E-16,0.));
#149 = DIRECTION('',(-2.22044604925E-16,-1.,0.));
#150 = ORIENTED_EDGE('',*,*,#47,.F.);
#151 = CYLINDRICAL_SURFACE('',#152,1.);
#152 = AXIS2_PLACEMENT_3D('',#153,#154,#155);
#153 = CARTESIAN_POINT('',(2.5,-2.,6.));
#154 = DIRECTION('',(-1.,2.22044604925E-16,0.));
#155 = DIRECTION('',(-2.22044604925E-16,-1.,0.));
#156 = ADVANCED_FACE('',(#157),#184,.T.);
#157 = FACE_BOUND('',#158,.F.);
#158 = EDGE_LOOP('',(#159,#160,#169,#177));
#159 = ORIENTED_EDGE('',*,*,#39,.F.);
#160 = ORIENTED_EDGE('',*,*,#161,.T.);
#161 = EDGE_CURVE('',#32,#162,#164,.T.);
#162 = VERTEX_POINT('',#163);
#163 = CARTESIAN_POINT('',(-27.5,-2.,1.));
#164 = CIRCLE('',#165,1.);
#165 = AXIS2_PLACEMENT_3D('',#166,#167,#168);
#166 = CARTESIAN_POINT('',(-26.5,-2.,1.));
#167 = DIRECTION('',(-0.,0.,-1.));
#168 = DIRECTION('',(-2.22044604925E-16,-1.,0.));
#169 = ORIENTED_EDGE('',*,*,#170,.T.);
#170 = EDGE_CURVE('',#162,#171,#173,.T.);
#171 = VERTEX_POINT('',#172);
#172 = CARTESIAN_POINT('',(-27.5,-2.,6.));
#173 = LINE('',#174,#175);
#174 = CARTESIAN_POINT('',(-27.5,-2.,0.));
#175 = VECTOR('',#176,1.);
#176 = DIRECTION('',(0.,0.,1.));
#177 = ORIENTED_EDGE('',*,*,#178,.T.);
#178 = EDGE_CURVE('',#171,#40,#179,.T.);
#179 = CIRCLE('',#180,1.);
#180 = AXIS2_PLACEMENT_3D('',#181,#182,#183);
#181 = CARTESIAN_POINT('',(-26.5,-2.,6.));
#182 = DIRECTION('',(0.,0.,1.));
#183 = DIRECTION('',(-2.22044604925E-16,-1.,0.));
#184 = CYLINDRICAL_SURFACE('',#185,1.);
#185 = AXIS2_PLACEMENT_3D('',#186,#187,#188);
#186 = CARTESIAN_POINT('',(-26.5,-2.,0.));
#187 = DIRECTION('',(0.,0.,1.));
#188 = DIRECTION('',(-2.22044604925E-16,-1.,0.));
#189 = ADVANCED_FACE('',(#190),#201,.T.);
#190 = FACE_BOUND('',#191,.T.);
#191 = EDGE_LOOP('',(#192,#193,#200));
#192 = ORIENTED_EDGE('',*,*,#94,.F.);
#193 = ORIENTED_EDGE('',*,*,#194,.T.);
#194 = EDGE_CURVE('',#95,#63,#195,.T.);
#195 = CIRCLE('',#196,1.);
#196 = AXIS2_PLACEMENT_3D('',#197,#198,#199);
#197 = CARTESIAN_POINT('',(1.5,-2.,1.));
#198 = DIRECTION('',(-2.832769448824E-16,-1.,0.));
#199 = DIRECTION('',(1.,-2.832769448824E-16,0.));
#200 = ORIENTED_EDGE('',*,*,#62,.F.);
#201 = SPHERICAL_SURFACE('',#202,1.);
#202 = AXIS2_PLACEMENT_3D('',#203,#204,#205);
#203 = CARTESIAN_POINT('',(1.5,-2.,1.));
#204 = DIRECTION('',(0.,0.,1.));
#205 = DIRECTION('',(-2.22044604925E-16,-1.,0.));
#206 = ADVANCED_FACE('',(#207),#218,.T.);
#207 = FACE_BOUND('',#208,.F.);
#208 = EDGE_LOOP('',(#209,#210,#217));
#209 = ORIENTED_EDGE('',*,*,#127,.F.);
#210 = ORIENTED_EDGE('',*,*,#211,.T.);
#211 = EDGE_CURVE('',#128,#72,#212,.T.);
#212 = CIRCLE('',#213,1.);
#213 = AXIS2_PLACEMENT_3D('',#214,#215,#216);
#214 = CARTESIAN_POINT('',(1.5,-2.,6.));
#215 = DIRECTION('',(2.832769448824E-16,1.,0.));
#216 = DIRECTION('',(1.,-2.832769448824E-16,0.));
#217 = ORIENTED_EDGE('',*,*,#79,.F.);
#218 = SPHERICAL_SURFACE('',#219,1.);
#219 = AXIS2_PLACEMENT_3D('',#220,#221,#222);
#220 = CARTESIAN_POINT('',(1.5,-2.,6.));
#221 = DIRECTION('',(0.,-0.,-1.));
#222 = DIRECTION('',(-2.22044604925E-16,-1.,0.));
#223 = ADVANCED_FACE('',(#224),#249,.F.);
#224 = FACE_BOUND('',#225,.F.);
#225 = EDGE_LOOP('',(#226,#227,#235,#243));
#226 = ORIENTED_EDGE('',*,*,#71,.T.);
#227 = ORIENTED_EDGE('',*,*,#228,.T.);
#228 = EDGE_CURVE('',#72,#229,#231,.T.);
#229 = VERTEX_POINT('',#230);
#230 = CARTESIAN_POINT('',(2.5,17.,6.));
#231 = LINE('',#232,#233);
#232 = CARTESIAN_POINT('',(2.5,-3.,6.));
#233 = VECTOR('',#234,1.);
#234 = DIRECTION('',(2.22044604925E-16,1.,0.));
#235 = ORIENTED_EDGE('',*,*,#236,.F.);
#236 = EDGE_CURVE('',#237,#229,#239,.T.);
#237 = VERTEX_POINT('',#238);
#238 = CARTESIAN_POINT('',(2.5,17.,1.));
#239 = LINE('',#240,#241);
#240 = CARTESIAN_POINT('',(2.5,17.,0.));
#241 = VECTOR('',#242,1.);
#242 = DIRECTION('',(0.,0.,1.));
#243 = ORIENTED_EDGE('',*,*,#244,.F.);
#244 = EDGE_CURVE('',#63,#237,#245,.T.);
#245 = LINE('',#246,#247);
#246 = CARTESIAN_POINT('',(2.5,-3.,1.));
#247 = VECTOR('',#248,1.);
#248 = DIRECTION('',(2.22044604925E-16,1.,0.));
#249 = PLANE('',#250);
#250 = AXIS2_PLACEMENT_3D('',#251,#252,#253);
#251 = CARTESIAN_POINT('',(2.5,-3.,0.));
#252 = DIRECTION('',(-1.,2.22044604925E-16,0.));
#253 = DIRECTION('',(0.,0.,1.));
#254 = ADVANCED_FACE('',(#255,#280,#291,#302,#313),#324,.F.);
#255 = FACE_BOUND('',#256,.F.);
#256 = EDGE_LOOP('',(#257,#258,#266,#274));
#257 = ORIENTED_EDGE('',*,*,#103,.F.);
#258 = ORIENTED_EDGE('',*,*,#259,.T.);
#259 = EDGE_CURVE('',#95,#260,#262,.T.);
#260 = VERTEX_POINT('',#261);
#261 = CARTESIAN_POINT('',(1.5,17.,0.));
#262 = LINE('',#263,#264);
#263 = CARTESIAN_POINT('',(1.5,-3.,-2.22044604925E-16));
#264 = VECTOR('',#265,1.);
#265 = DIRECTION('',(2.22044604925E-16,1.,0.));
#266 = ORIENTED_EDGE('',*,*,#267,.T.);
#267 = EDGE_CURVE('',#260,#268,#270,.T.);
#268 = VERTEX_POINT('',#269);
#269 = CARTESIAN_POINT('',(-26.5,17.,0.));
#270 = LINE('',#271,#272);
#271 = CARTESIAN_POINT('',(2.5,17.,-2.22044604925E-16));
#272 = VECTOR('',#273,1.);
#273 = DIRECTION('',(-1.,2.22044604925E-16,0.));
#274 = ORIENTED_EDGE('',*,*,#275,.F.);
#275 = EDGE_CURVE('',#104,#268,#276,.T.);
#276 = LINE('',#277,#278);
#277 = CARTESIAN_POINT('',(-26.5,-3.,-2.22044604925E-16));
#278 = VECTOR('',#279,1.);
#279 = DIRECTION('',(2.22044604925E-16,1.,0.));
#280 = FACE_BOUND('',#281,.F.);
#281 = EDGE_LOOP('',(#282));
#282 = ORIENTED_EDGE('',*,*,#283,.F.);
#283 = EDGE_CURVE('',#284,#284,#286,.T.);
#284 = VERTEX_POINT('',#285);
#285 = CARTESIAN_POINT('',(-25.,15.5,0.));
#286 = CIRCLE('',#287,0.5);
#287 = AXIS2_PLACEMENT_3D('',#288,#289,#290);
#288 = CARTESIAN_POINT('',(-25.,15.,0.));
#289 = DIRECTION('',(0.,-0.,1.));
#290 = DIRECTION('',(2.22044604925E-16,1.,0.));
#291 = FACE_BOUND('',#292,.F.);
#292 = EDGE_LOOP('',(#293));
#293 = ORIENTED_EDGE('',*,*,#294,.F.);
#294 = EDGE_CURVE('',#295,#295,#297,.T.);
#295 = VERTEX_POINT('',#296);
#296 = CARTESIAN_POINT('',(-25.,0.5,0.));
#297 = CIRCLE('',#298,0.5);
#298 = AXIS2_PLACEMENT_3D('',#299,#300,#301);
#299 = CARTESIAN_POINT('',(-25.,6.217248937901E-15,0.));
#300 = DIRECTION('',(0.,-0.,1.));
#301 = DIRECTION('',(2.22044604925E-16,1.,0.));
#302 = FACE_BOUND('',#303,.F.);
#303 = EDGE_LOOP('',(#304));
#304 = ORIENTED_EDGE('',*,*,#305,.F.);
#305 = EDGE_CURVE('',#306,#306,#308,.T.);
#306 = VERTEX_POINT('',#307);
#307 = CARTESIAN_POINT('',(0.,15.5,0.));
#308 = CIRCLE('',#309,0.5);
#309 = AXIS2_PLACEMENT_3D('',#310,#311,#312);
#310 = CARTESIAN_POINT('',(3.996802888651E-15,15.,0.));
#311 = DIRECTION('',(0.,-0.,1.));
#312 = DIRECTION('',(2.22044604925E-16,1.,0.));
#313 = FACE_BOUND('',#314,.F.);
#314 = EDGE_LOOP('',(#315));
#315 = ORIENTED_EDGE('',*,*,#316,.F.);
#316 = EDGE_CURVE('',#317,#317,#319,.T.);
#317 = VERTEX_POINT('',#318);
#318 = CARTESIAN_POINT('',(-3.552713678801E-15,0.5,0.));
#319 = CIRCLE('',#320,0.5);
#320 = AXIS2_PLACEMENT_3D('',#321,#322,#323);
#321 = CARTESIAN_POINT('',(8.881784197001E-16,4.440892098501E-16,0.));
#322 = DIRECTION('',(0.,-0.,1.));
#323 = DIRECTION('',(2.22044604925E-16,1.,0.));
#324 = PLANE('',#325);
#325 = AXIS2_PLACEMENT_3D('',#326,#327,#328);
#326 = CARTESIAN_POINT('',(2.5,-3.,0.));
#327 = DIRECTION('',(0.,0.,1.));
#328 = DIRECTION('',(2.22044604925E-16,1.,0.));
#329 = ADVANCED_FACE('',(#330),#341,.T.);
#330 = FACE_BOUND('',#331,.F.);
#331 = EDGE_LOOP('',(#332,#333,#340));
#332 = ORIENTED_EDGE('',*,*,#111,.F.);
#333 = ORIENTED_EDGE('',*,*,#334,.T.);
#334 = EDGE_CURVE('',#104,#162,#335,.T.);
#335 = CIRCLE('',#336,1.);
#336 = AXIS2_PLACEMENT_3D('',#337,#338,#339);
#337 = CARTESIAN_POINT('',(-26.5,-2.,1.));
#338 = DIRECTION('',(1.608122649677E-16,1.,-0.));
#339 = DIRECTION('',(-1.,1.608122649677E-16,0.));
#340 = ORIENTED_EDGE('',*,*,#161,.F.);
#341 = SPHERICAL_SURFACE('',#342,1.);
#342 = AXIS2_PLACEMENT_3D('',#343,#344,#345);
#343 = CARTESIAN_POINT('',(-26.5,-2.,1.));
#344 = DIRECTION('',(0.,0.,1.));
#345 = DIRECTION('',(-2.22044604925E-16,-1.,0.));
#346 = ADVANCED_FACE('',(#347),#372,.T.);
#347 = FACE_BOUND('',#348,.T.);
#348 = EDGE_LOOP('',(#349,#350,#358,#366));
#349 = ORIENTED_EDGE('',*,*,#136,.F.);
#350 = ORIENTED_EDGE('',*,*,#351,.T.);
#351 = EDGE_CURVE('',#128,#352,#354,.T.);
#352 = VERTEX_POINT('',#353);
#353 = CARTESIAN_POINT('',(1.5,17.,7.));
#354 = LINE('',#355,#356);
#355 = CARTESIAN_POINT('',(1.5,-3.,7.));
#356 = VECTOR('',#357,1.);
#357 = DIRECTION('',(2.22044604925E-16,1.,0.));
#358 = ORIENTED_EDGE('',*,*,#359,.T.);
#359 = EDGE_CURVE('',#352,#360,#362,.T.);
#360 = VERTEX_POINT('',#361);
#361 = CARTESIAN_POINT('',(-26.5,17.,7.));
#362 = LINE('',#363,#364);
#363 = CARTESIAN_POINT('',(2.5,17.,7.));
#364 = VECTOR('',#365,1.);
#365 = DIRECTION('',(-1.,2.22044604925E-16,0.));
#366 = ORIENTED_EDGE('',*,*,#367,.F.);
#367 = EDGE_CURVE('',#137,#360,#368,.T.);
#368 = LINE('',#369,#370);
#369 = CARTESIAN_POINT('',(-26.5,-3.,7.));
#370 = VECTOR('',#371,1.);
#371 = DIRECTION('',(2.22044604925E-16,1.,0.));
#372 = PLANE('',#373);
#373 = AXIS2_PLACEMENT_3D('',#374,#375,#376);
#374 = CARTESIAN_POINT('',(2.5,-3.,7.));
#375 = DIRECTION('',(0.,0.,1.));
#376 = DIRECTION('',(2.22044604925E-16,1.,0.));
#377 = ADVANCED_FACE('',(#378),#389,.T.);
#378 = FACE_BOUND('',#379,.F.);
#379 = EDGE_LOOP('',(#380,#381,#388));
#380 = ORIENTED_EDGE('',*,*,#178,.F.);
#381 = ORIENTED_EDGE('',*,*,#382,.T.);
#382 = EDGE_CURVE('',#171,#137,#383,.T.);
#383 = CIRCLE('',#384,1.);
#384 = AXIS2_PLACEMENT_3D('',#385,#386,#387);
#385 = CARTESIAN_POINT('',(-26.5,-2.,6.));
#386 = DIRECTION('',(2.22044604925E-16,1.,6.123233995737E-17));
#387 = DIRECTION('',(-1.359631073447E-32,-6.123233995737E-17,1.));
#388 = ORIENTED_EDGE('',*,*,#144,.F.);
#389 = SPHERICAL_SURFACE('',#390,1.);
#390 = AXIS2_PLACEMENT_3D('',#391,#392,#393);
#391 = CARTESIAN_POINT('',(-26.5,-2.,6.));
#392 = DIRECTION('',(1.,-2.22044604925E-16,-0.));
#393 = DIRECTION('',(-2.22044604925E-16,-1.,0.));
#394 = ADVANCED_FACE('',(#395),#420,.T.);
#395 = FACE_BOUND('',#396,.T.);
#396 = EDGE_LOOP('',(#397,#398,#406,#414));
#397 = ORIENTED_EDGE('',*,*,#170,.T.);
#398 = ORIENTED_EDGE('',*,*,#399,.T.);
#399 = EDGE_CURVE('',#171,#400,#402,.T.);
#400 = VERTEX_POINT('',#401);
#401 = CARTESIAN_POINT('',(-27.5,17.,6.));
#402 = LINE('',#403,#404);
#403 = CARTESIAN_POINT('',(-27.5,-3.,6.));
#404 = VECTOR('',#405,1.);
#405 = DIRECTION('',(2.22044604925E-16,1.,0.));
#406 = ORIENTED_EDGE('',*,*,#407,.F.);
#407 = EDGE_CURVE('',#408,#400,#410,.T.);
#408 = VERTEX_POINT('',#409);
#409 = CARTESIAN_POINT('',(-27.5,17.,1.));
#410 = LINE('',#411,#412);
#411 = CARTESIAN_POINT('',(-27.5,17.,0.));
#412 = VECTOR('',#413,1.);
#413 = DIRECTION('',(0.,0.,1.));
#414 = ORIENTED_EDGE('',*,*,#415,.F.);
#415 = EDGE_CURVE('',#162,#408,#416,.T.);
#416 = LINE('',#417,#418);
#417 = CARTESIAN_POINT('',(-27.5,-3.,1.));
#418 = VECTOR('',#419,1.);
#419 = DIRECTION('',(2.22044604925E-16,1.,0.));
#420 = PLANE('',#421);
#421 = AXIS2_PLACEMENT_3D('',#422,#423,#424);
#422 = CARTESIAN_POINT('',(-27.5,-3.,0.));
#423 = DIRECTION('',(-1.,2.22044604925E-16,0.));
#424 = DIRECTION('',(0.,0.,1.));
#425 = ADVANCED_FACE('',(#426),#438,.T.);
#426 = FACE_BOUND('',#427,.T.);
#427 = EDGE_LOOP('',(#428,#429,#430,#437));
#428 = ORIENTED_EDGE('',*,*,#194,.F.);
#429 = ORIENTED_EDGE('',*,*,#259,.T.);
#430 = ORIENTED_EDGE('',*,*,#431,.T.);
#431 = EDGE_CURVE('',#260,#237,#432,.T.);
#432 = CIRCLE('',#433,1.);
#433 = AXIS2_PLACEMENT_3D('',#434,#435,#436);
#434 = CARTESIAN_POINT('',(1.5,17.,1.));
#435 = DIRECTION('',(-1.608122649677E-16,-1.,0.));
#436 = DIRECTION('',(1.,-1.608122649677E-16,0.));
#437 = ORIENTED_EDGE('',*,*,#244,.F.);
#438 = CYLINDRICAL_SURFACE('',#439,1.);
#439 = AXIS2_PLACEMENT_3D('',#440,#441,#442);
#440 = CARTESIAN_POINT('',(1.5,-3.,1.));
#441 = DIRECTION('',(2.22044604925E-16,1.,0.));
#442 = DIRECTION('',(1.,-2.22044604925E-16,0.));
#443 = ADVANCED_FACE('',(#444),#456,.T.);
#444 = FACE_BOUND('',#445,.F.);
#445 = EDGE_LOOP('',(#446,#447,#448,#455));
#446 = ORIENTED_EDGE('',*,*,#211,.F.);
#447 = ORIENTED_EDGE('',*,*,#351,.T.);
#448 = ORIENTED_EDGE('',*,*,#449,.T.);
#449 = EDGE_CURVE('',#352,#229,#450,.T.);
#450 = CIRCLE('',#451,1.);
#451 = AXIS2_PLACEMENT_3D('',#452,#453,#454);
#452 = CARTESIAN_POINT('',(1.5,17.,6.));
#453 = DIRECTION('',(1.608122649677E-16,1.,0.));
#454 = DIRECTION('',(1.,-1.608122649677E-16,0.));
#455 = ORIENTED_EDGE('',*,*,#228,.F.);
#456 = CYLINDRICAL_SURFACE('',#457,1.);
#457 = AXIS2_PLACEMENT_3D('',#458,#459,#460);
#458 = CARTESIAN_POINT('',(1.5,-3.,6.));
#459 = DIRECTION('',(2.22044604925E-16,1.,0.));
#460 = DIRECTION('',(1.,-2.22044604925E-16,0.));
#461 = ADVANCED_FACE('',(#462),#489,.T.);
#462 = FACE_BOUND('',#463,.F.);
#463 = EDGE_LOOP('',(#464,#474,#481,#482));
#464 = ORIENTED_EDGE('',*,*,#465,.F.);
#465 = EDGE_CURVE('',#466,#468,#470,.T.);
#466 = VERTEX_POINT('',#467);
#467 = CARTESIAN_POINT('',(1.5,18.,1.));
#468 = VERTEX_POINT('',#469);
#469 = CARTESIAN_POINT('',(1.5,18.,6.));
#470 = LINE('',#471,#472);
#471 = CARTESIAN_POINT('',(1.5,18.,0.));
#472 = VECTOR('',#473,1.);
#473 = DIRECTION('',(0.,0.,1.));
#474 = ORIENTED_EDGE('',*,*,#475,.T.);
#475 = EDGE_CURVE('',#466,#237,#476,.T.);
#476 = CIRCLE('',#477,1.);
#477 = AXIS2_PLACEMENT_3D('',#478,#479,#480);
#478 = CARTESIAN_POINT('',(1.5,17.,1.));
#479 = DIRECTION('',(0.,0.,-1.));
#480 = DIRECTION('',(2.22044604925E-16,1.,0.));
#481 = ORIENTED_EDGE('',*,*,#236,.T.);
#482 = ORIENTED_EDGE('',*,*,#483,.F.);
#483 = EDGE_CURVE('',#468,#229,#484,.T.);
#484 = CIRCLE('',#485,1.);
#485 = AXIS2_PLACEMENT_3D('',#486,#487,#488);
#486 = CARTESIAN_POINT('',(1.5,17.,6.));
#487 = DIRECTION('',(0.,0.,-1.));
#488 = DIRECTION('',(2.22044604925E-16,1.,0.));
#489 = CYLINDRICAL_SURFACE('',#490,1.);
#490 = AXIS2_PLACEMENT_3D('',#491,#492,#493);
#491 = CARTESIAN_POINT('',(1.5,17.,0.));
#492 = DIRECTION('',(0.,0.,1.));
#493 = DIRECTION('',(2.22044604925E-16,1.,0.));
#494 = ADVANCED_FACE('',(#495),#507,.T.);
#495 = FACE_BOUND('',#496,.F.);
#496 = EDGE_LOOP('',(#497,#498,#499,#506));
#497 = ORIENTED_EDGE('',*,*,#334,.F.);
#498 = ORIENTED_EDGE('',*,*,#275,.T.);
#499 = ORIENTED_EDGE('',*,*,#500,.T.);
#500 = EDGE_CURVE('',#268,#408,#501,.T.);
#501 = CIRCLE('',#502,1.);
#502 = AXIS2_PLACEMENT_3D('',#503,#504,#505);
#503 = CARTESIAN_POINT('',(-26.5,17.,1.));
#504 = DIRECTION('',(2.832769448824E-16,1.,-0.));
#505 = DIRECTION('',(-1.,2.832769448824E-16,0.));
#506 = ORIENTED_EDGE('',*,*,#415,.F.);
#507 = CYLINDRICAL_SURFACE('',#508,1.);
#508 = AXIS2_PLACEMENT_3D('',#509,#510,#511);
#509 = CARTESIAN_POINT('',(-26.5,-3.,1.));
#510 = DIRECTION('',(2.22044604925E-16,1.,0.));
#511 = DIRECTION('',(-1.,2.22044604925E-16,0.));
#512 = ADVANCED_FACE('',(#513),#538,.T.);
#513 = FACE_BOUND('',#514,.T.);
#514 = EDGE_LOOP('',(#515,#522,#523,#532));
#515 = ORIENTED_EDGE('',*,*,#516,.F.);
#516 = EDGE_CURVE('',#260,#466,#517,.T.);
#517 = CIRCLE('',#518,1.);
#518 = AXIS2_PLACEMENT_3D('',#519,#520,#521);
#519 = CARTESIAN_POINT('',(1.5,17.,1.));
#520 = DIRECTION('',(1.,-2.22044604925E-16,0.));
#521 = DIRECTION('',(2.22044604925E-16,1.,0.));
#522 = ORIENTED_EDGE('',*,*,#267,.T.);
#523 = ORIENTED_EDGE('',*,*,#524,.T.);
#524 = EDGE_CURVE('',#268,#525,#527,.T.);
#525 = VERTEX_POINT('',#526);
#526 = CARTESIAN_POINT('',(-26.5,18.,1.));
#527 = CIRCLE('',#528,1.);
#528 = AXIS2_PLACEMENT_3D('',#529,#530,#531);
#529 = CARTESIAN_POINT('',(-26.5,17.,1.));
#530 = DIRECTION('',(1.,-2.22044604925E-16,0.));
#531 = DIRECTION('',(2.22044604925E-16,1.,0.));
#532 = ORIENTED_EDGE('',*,*,#533,.F.);
#533 = EDGE_CURVE('',#466,#525,#534,.T.);
#534 = LINE('',#535,#536);
#535 = CARTESIAN_POINT('',(2.5,18.,1.));
#536 = VECTOR('',#537,1.);
#537 = DIRECTION('',(-1.,2.22044604925E-16,0.));
#538 = CYLINDRICAL_SURFACE('',#539,1.);
#539 = AXIS2_PLACEMENT_3D('',#540,#541,#542);
#540 = CARTESIAN_POINT('',(2.5,17.,1.));
#541 = DIRECTION('',(-1.,2.22044604925E-16,0.));
#542 = DIRECTION('',(2.22044604925E-16,1.,0.));
#543 = ADVANCED_FACE('',(#544),#563,.T.);
#544 = FACE_BOUND('',#545,.T.);
#545 = EDGE_LOOP('',(#546,#547,#555,#562));
#546 = ORIENTED_EDGE('',*,*,#283,.F.);
#547 = ORIENTED_EDGE('',*,*,#548,.F.);
#548 = EDGE_CURVE('',#549,#284,#551,.T.);
#549 = VERTEX_POINT('',#550);
#550 = CARTESIAN_POINT('',(-25.,15.5,-5.));
#551 = LINE('',#552,#553);
#552 = CARTESIAN_POINT('',(-25.,15.5,-5.));
#553 = VECTOR('',#554,1.);
#554 = DIRECTION('',(0.,0.,1.));
#555 = ORIENTED_EDGE('',*,*,#556,.T.);
#556 = EDGE_CURVE('',#549,#549,#557,.T.);
#557 = CIRCLE('',#558,0.5);
#558 = AXIS2_PLACEMENT_3D('',#559,#560,#561);
#559 = CARTESIAN_POINT('',(-25.,15.,-5.));
#560 = DIRECTION('',(0.,-0.,1.));
#561 = DIRECTION('',(2.22044604925E-16,1.,0.));
#562 = ORIENTED_EDGE('',*,*,#548,.T.);
#563 = CYLINDRICAL_SURFACE('',#564,0.5);
#564 = AXIS2_PLACEMENT_3D('',#565,#566,#567);
#565 = CARTESIAN_POINT('',(-25.,15.,-5.));
#566 = DIRECTION('',(0.,0.,1.));
#567 = DIRECTION('',(2.22044604925E-16,1.,0.));
#568 = ADVANCED_FACE('',(#569),#588,.T.);
#569 = FACE_BOUND('',#570,.T.);
#570 = EDGE_LOOP('',(#571,#572,#580,#587));
#571 = ORIENTED_EDGE('',*,*,#294,.F.);
#572 = ORIENTED_EDGE('',*,*,#573,.F.);
#573 = EDGE_CURVE('',#574,#295,#576,.T.);
#574 = VERTEX_POINT('',#575);
#575 = CARTESIAN_POINT('',(-25.,0.5,-5.));
#576 = LINE('',#577,#578);
#577 = CARTESIAN_POINT('',(-25.,0.5,-5.));
#578 = VECTOR('',#579,1.);
#579 = DIRECTION('',(0.,0.,1.));
#580 = ORIENTED_EDGE('',*,*,#581,.T.);
#581 = EDGE_CURVE('',#574,#574,#582,.T.);
#582 = CIRCLE('',#583,0.5);
#583 = AXIS2_PLACEMENT_3D('',#584,#585,#586);
#584 = CARTESIAN_POINT('',(-25.,6.217248937901E-15,-5.));
#585 = DIRECTION('',(0.,-0.,1.));
#586 = DIRECTION('',(2.22044604925E-16,1.,0.));
#587 = ORIENTED_EDGE('',*,*,#573,.T.);
#588 = CYLINDRICAL_SURFACE('',#589,0.5);
#589 = AXIS2_PLACEMENT_3D('',#590,#591,#592);
#590 = CARTESIAN_POINT('',(-25.,6.217248937901E-15,-5.));
#591 = DIRECTION('',(0.,0.,1.));
#592 = DIRECTION('',(2.22044604925E-16,1.,0.));
#593 = ADVANCED_FACE('',(#594),#613,.T.);
#594 = FACE_BOUND('',#595,.T.);
#595 = EDGE_LOOP('',(#596,#597,#605,#612));
#596 = ORIENTED_EDGE('',*,*,#305,.F.);
#597 = ORIENTED_EDGE('',*,*,#598,.F.);
#598 = EDGE_CURVE('',#599,#306,#601,.T.);
#599 = VERTEX_POINT('',#600);
#600 = CARTESIAN_POINT('',(0.,15.5,-5.));
#601 = LINE('',#602,#603);
#602 = CARTESIAN_POINT('',(4.227825191113E-15,15.5,-5.));
#603 = VECTOR('',#604,1.);
#604 = DIRECTION('',(0.,0.,1.));
#605 = ORIENTED_EDGE('',*,*,#606,.T.);
#606 = EDGE_CURVE('',#599,#599,#607,.T.);
#607 = CIRCLE('',#608,0.5);
#608 = AXIS2_PLACEMENT_3D('',#609,#610,#611);
#609 = CARTESIAN_POINT('',(3.996802888651E-15,15.,-5.));
#610 = DIRECTION('',(0.,-0.,1.));
#611 = DIRECTION('',(2.22044604925E-16,1.,0.));
#612 = ORIENTED_EDGE('',*,*,#598,.T.);
#613 = CYLINDRICAL_SURFACE('',#614,0.5);
#614 = AXIS2_PLACEMENT_3D('',#615,#616,#617);
#615 = CARTESIAN_POINT('',(3.996802888651E-15,15.,-5.));
#616 = DIRECTION('',(0.,0.,1.));
#617 = DIRECTION('',(2.22044604925E-16,1.,0.));
#618 = ADVANCED_FACE('',(#619),#638,.T.);
#619 = FACE_BOUND('',#620,.T.);
#620 = EDGE_LOOP('',(#621,#622,#630,#637));
#621 = ORIENTED_EDGE('',*,*,#316,.F.);
#622 = ORIENTED_EDGE('',*,*,#623,.F.);
#623 = EDGE_CURVE('',#624,#317,#626,.T.);
#624 = VERTEX_POINT('',#625);
#625 = CARTESIAN_POINT('',(-3.552713678801E-15,0.5,-5.));
#626 = LINE('',#627,#628);
#627 = CARTESIAN_POINT('',(1.121665402077E-15,0.5,-5.));
#628 = VECTOR('',#629,1.);
#629 = DIRECTION('',(0.,0.,1.));
#630 = ORIENTED_EDGE('',*,*,#631,.T.);
#631 = EDGE_CURVE('',#624,#624,#632,.T.);
#632 = CIRCLE('',#633,0.5);
#633 = AXIS2_PLACEMENT_3D('',#634,#635,#636);
#634 = CARTESIAN_POINT('',(8.881784197001E-16,4.440892098501E-16,-5.));
#635 = DIRECTION('',(0.,-0.,1.));
#636 = DIRECTION('',(2.22044604925E-16,1.,0.));
#637 = ORIENTED_EDGE('',*,*,#623,.T.);
#638 = CYLINDRICAL_SURFACE('',#639,0.5);
#639 = AXIS2_PLACEMENT_3D('',#640,#641,#642);
#640 = CARTESIAN_POINT('',(8.881784197001E-16,4.440892098501E-16,-5.));
#641 = DIRECTION('',(0.,0.,1.));
#642 = DIRECTION('',(2.22044604925E-16,1.,0.));
#643 = ADVANCED_FACE('',(#644),#656,.T.);
#644 = FACE_BOUND('',#645,.T.);
#645 = EDGE_LOOP('',(#646,#647,#648,#655));
#646 = ORIENTED_EDGE('',*,*,#382,.T.);
#647 = ORIENTED_EDGE('',*,*,#367,.T.);
#648 = ORIENTED_EDGE('',*,*,#649,.F.);
#649 = EDGE_CURVE('',#400,#360,#650,.T.);
#650 = CIRCLE('',#651,1.);
#651 = AXIS2_PLACEMENT_3D('',#652,#653,#654);
#652 = CARTESIAN_POINT('',(-26.5,17.,6.));
#653 = DIRECTION('',(2.22044604925E-16,1.,-6.123233995737E-17));
#654 = DIRECTION('',(1.359631073447E-32,6.123233995737E-17,1.));
#655 = ORIENTED_EDGE('',*,*,#399,.F.);
#656 = CYLINDRICAL_SURFACE('',#657,1.);
#657 = AXIS2_PLACEMENT_3D('',#658,#659,#660);
#658 = CARTESIAN_POINT('',(-26.5,-3.,6.));
#659 = DIRECTION('',(2.22044604925E-16,1.,0.));
#660 = DIRECTION('',(-1.,2.22044604925E-16,0.));
#661 = ADVANCED_FACE('',(#662),#687,.T.);
#662 = FACE_BOUND('',#663,.F.);
#663 = EDGE_LOOP('',(#664,#671,#672,#681));
#664 = ORIENTED_EDGE('',*,*,#665,.F.);
#665 = EDGE_CURVE('',#352,#468,#666,.T.);
#666 = CIRCLE('',#667,1.);
#667 = AXIS2_PLACEMENT_3D('',#668,#669,#670);
#668 = CARTESIAN_POINT('',(1.5,17.,6.));
#669 = DIRECTION('',(-1.,2.22044604925E-16,0.));
#670 = DIRECTION('',(2.22044604925E-16,1.,0.));
#671 = ORIENTED_EDGE('',*,*,#359,.T.);
#672 = ORIENTED_EDGE('',*,*,#673,.F.);
#673 = EDGE_CURVE('',#674,#360,#676,.T.);
#674 = VERTEX_POINT('',#675);
#675 = CARTESIAN_POINT('',(-26.5,18.,6.));
#676 = CIRCLE('',#677,1.);
#677 = AXIS2_PLACEMENT_3D('',#678,#679,#680);
#678 = CARTESIAN_POINT('',(-26.5,17.,6.));
#679 = DIRECTION('',(1.,-2.22044604925E-16,0.));
#680 = DIRECTION('',(2.22044604925E-16,1.,0.));
#681 = ORIENTED_EDGE('',*,*,#682,.F.);
#682 = EDGE_CURVE('',#468,#674,#683,.T.);
#683 = LINE('',#684,#685);
#684 = CARTESIAN_POINT('',(2.5,18.,6.));
#685 = VECTOR('',#686,1.);
#686 = DIRECTION('',(-1.,2.22044604925E-16,0.));
#687 = CYLINDRICAL_SURFACE('',#688,1.);
#688 = AXIS2_PLACEMENT_3D('',#689,#690,#691);
#689 = CARTESIAN_POINT('',(2.5,17.,6.));
#690 = DIRECTION('',(-1.,2.22044604925E-16,0.));
#691 = DIRECTION('',(2.22044604925E-16,1.,0.));
#692 = ADVANCED_FACE('',(#693),#716,.T.);
#693 = FACE_BOUND('',#694,.T.);
#694 = EDGE_LOOP('',(#695,#701,#708,#709));
#695 = ORIENTED_EDGE('',*,*,#696,.F.);
#696 = EDGE_CURVE('',#525,#674,#697,.T.);
#697 = LINE('',#698,#699);
#698 = CARTESIAN_POINT('',(-26.5,18.,0.));
#699 = VECTOR('',#700,1.);
#700 = DIRECTION('',(0.,0.,1.));
#701 = ORIENTED_EDGE('',*,*,#702,.T.);
#702 = EDGE_CURVE('',#525,#408,#703,.T.);
#703 = CIRCLE('',#704,1.);
#704 = AXIS2_PLACEMENT_3D('',#705,#706,#707);
#705 = CARTESIAN_POINT('',(-26.5,17.,1.));
#706 = DIRECTION('',(0.,-0.,1.));
#707 = DIRECTION('',(2.22044604925E-16,1.,0.));
#708 = ORIENTED_EDGE('',*,*,#407,.T.);
#709 = ORIENTED_EDGE('',*,*,#710,.T.);
#710 = EDGE_CURVE('',#400,#674,#711,.T.);
#711 = CIRCLE('',#712,1.);
#712 = AXIS2_PLACEMENT_3D('',#713,#714,#715);
#713 = CARTESIAN_POINT('',(-26.5,17.,6.));
#714 = DIRECTION('',(0.,0.,-1.));
#715 = DIRECTION('',(2.22044604925E-16,1.,0.));
#716 = CYLINDRICAL_SURFACE('',#717,1.);
#717 = AXIS2_PLACEMENT_3D('',#718,#719,#720);
#718 = CARTESIAN_POINT('',(-26.5,17.,0.));
#719 = DIRECTION('',(0.,0.,1.));
#720 = DIRECTION('',(2.22044604925E-16,1.,0.));
#721 = ADVANCED_FACE('',(#722),#727,.T.);
#722 = FACE_BOUND('',#723,.F.);
#723 = EDGE_LOOP('',(#724,#725,#726));
#724 = ORIENTED_EDGE('',*,*,#516,.F.);
#725 = ORIENTED_EDGE('',*,*,#431,.T.);
#726 = ORIENTED_EDGE('',*,*,#475,.F.);
#727 = SPHERICAL_SURFACE('',#728,1.);
#728 = AXIS2_PLACEMENT_3D('',#729,#730,#731);
#729 = CARTESIAN_POINT('',(1.5,17.,1.));
#730 = DIRECTION('',(0.,0.,1.));
#731 = DIRECTION('',(2.22044604925E-16,1.,0.));
#732 = ADVANCED_FACE('',(#733),#738,.T.);
#733 = FACE_BOUND('',#734,.T.);
#734 = EDGE_LOOP('',(#735,#736,#737));
#735 = ORIENTED_EDGE('',*,*,#665,.F.);
#736 = ORIENTED_EDGE('',*,*,#449,.T.);
#737 = ORIENTED_EDGE('',*,*,#483,.F.);
#738 = SPHERICAL_SURFACE('',#739,1.);
#739 = AXIS2_PLACEMENT_3D('',#740,#741,#742);
#740 = CARTESIAN_POINT('',(1.5,17.,6.));
#741 = DIRECTION('',(0.,-0.,-1.));
#742 = DIRECTION('',(2.22044604925E-16,1.,0.));
#743 = ADVANCED_FACE('',(#744),#750,.T.);
#744 = FACE_BOUND('',#745,.T.);
#745 = EDGE_LOOP('',(#746,#747,#748,#749));
#746 = ORIENTED_EDGE('',*,*,#465,.F.);
#747 = ORIENTED_EDGE('',*,*,#533,.T.);
#748 = ORIENTED_EDGE('',*,*,#696,.T.);
#749 = ORIENTED_EDGE('',*,*,#682,.F.);
#750 = PLANE('',#751);
#751 = AXIS2_PLACEMENT_3D('',#752,#753,#754);
#752 = CARTESIAN_POINT('',(2.5,18.,0.));
#753 = DIRECTION('',(2.22044604925E-16,1.,0.));
#754 = DIRECTION('',(0.,0.,1.));
#755 = ADVANCED_FACE('',(#756),#761,.T.);
#756 = FACE_BOUND('',#757,.T.);
#757 = EDGE_LOOP('',(#758,#759,#760));
#758 = ORIENTED_EDGE('',*,*,#524,.F.);
#759 = ORIENTED_EDGE('',*,*,#500,.T.);
#760 = ORIENTED_EDGE('',*,*,#702,.F.);
#761 = SPHERICAL_SURFACE('',#762,1.);
#762 = AXIS2_PLACEMENT_3D('',#763,#764,#765);
#763 = CARTESIAN_POINT('',(-26.5,17.,1.));
#764 = DIRECTION('',(0.,0.,1.));
#765 = DIRECTION('',(2.22044604925E-16,1.,0.));
#766 = ADVANCED_FACE('',(#767),#770,.F.);
#767 = FACE_BOUND('',#768,.T.);
#768 = EDGE_LOOP('',(#769));
#769 = ORIENTED_EDGE('',*,*,#556,.F.);
#770 = PLANE('',#771);
#771 = AXIS2_PLACEMENT_3D('',#772,#773,#774);
#772 = CARTESIAN_POINT('',(-25.,15.,-5.));
#773 = DIRECTION('',(0.,0.,1.));
#774 = DIRECTION('',(2.22044604925E-16,1.,0.));
#775 = ADVANCED_FACE('',(#776),#779,.F.);
#776 = FACE_BOUND('',#777,.T.);
#777 = EDGE_LOOP('',(#778));
#778 = ORIENTED_EDGE('',*,*,#581,.F.);
#779 = PLANE('',#780);
#780 = AXIS2_PLACEMENT_3D('',#781,#782,#783);
#781 = CARTESIAN_POINT('',(-25.,6.217248937901E-15,-5.));
#782 = DIRECTION('',(0.,0.,1.));
#783 = DIRECTION('',(2.22044604925E-16,1.,0.));
#784 = ADVANCED_FACE('',(#785),#788,.F.);
#785 = FACE_BOUND('',#786,.T.);
#786 = EDGE_LOOP('',(#787));
#787 = ORIENTED_EDGE('',*,*,#606,.F.);
#788 = PLANE('',#789);
#789 = AXIS2_PLACEMENT_3D('',#790,#791,#792);
#790 = CARTESIAN_POINT('',(3.996802888651E-15,15.,-5.));
#791 = DIRECTION('',(0.,0.,1.));
#792 = DIRECTION('',(2.22044604925E-16,1.,0.));
#793 = ADVANCED_FACE('',(#794),#797,.F.);
#794 = FACE_BOUND('',#795,.T.);
#795 = EDGE_LOOP('',(#796));
#796 = ORIENTED_EDGE('',*,*,#631,.F.);
#797 = PLANE('',#798);
#798 = AXIS2_PLACEMENT_3D('',#799,#800,#801);
#799 = CARTESIAN_POINT('',(8.881784197001E-16,4.440892098501E-16,-5.));
#800 = DIRECTION('',(0.,0.,1.));
#801 = DIRECTION('',(2.22044604925E-16,1.,0.));
#802 = ADVANCED_FACE('',(#803),#808,.T.);
#803 = FACE_BOUND('',#804,.T.);
#804 = EDGE_LOOP('',(#805,#806,#807));
#805 = ORIENTED_EDGE('',*,*,#710,.F.);
#806 = ORIENTED_EDGE('',*,*,#649,.T.);
#807 = ORIENTED_EDGE('',*,*,#673,.F.);
#808 = SPHERICAL_SURFACE('',#809,1.);
#809 = AXIS2_PLACEMENT_3D('',#810,#811,#812);
#810 = CARTESIAN_POINT('',(-26.5,17.,6.));
#811 = DIRECTION('',(1.,-2.22044604925E-16,-0.));
#812 = DIRECTION('',(2.22044604925E-16,1.,0.));
#813 = MANIFOLD_SOLID_BREP('',#814);
#814 = CLOSED_SHELL('',(#815,#848,#874,#900,#920,#940,#966,#992));
#815 = ADVANCED_FACE('',(#816),#843,.T.);
#816 = FACE_BOUND('',#817,.T.);
#817 = EDGE_LOOP('',(#818,#828,#835,#836));
#818 = ORIENTED_EDGE('',*,*,#819,.T.);
#819 = EDGE_CURVE('',#820,#822,#824,.T.);
#820 = VERTEX_POINT('',#821);
#821 = CARTESIAN_POINT('',(-12.5,1.998401444325E-15,7.));
#822 = VERTEX_POINT('',#823);
#823 = CARTESIAN_POINT('',(-12.5,15.,7.));
#824 = LINE('',#825,#826);
#825 = CARTESIAN_POINT('',(-12.5,-2.,7.));
#826 = VECTOR('',#827,1.);
#827 = DIRECTION('',(2.22044604925E-16,1.,2.22044604925E-16));
#828 = ORIENTED_EDGE('',*,*,#829,.F.);
#829 = EDGE_CURVE('',#822,#822,#830,.T.);
#830 = CIRCLE('',#831,14.);
#831 = AXIS2_PLACEMENT_3D('',#832,#833,#834);
#832 = CARTESIAN_POINT('',(-12.5,15.,21.));
#833 = DIRECTION('',(2.22044604925E-16,1.,2.22044604925E-16));
#834 = DIRECTION('',(4.930380657631E-32,2.22044604925E-16,-1.));
#835 = ORIENTED_EDGE('',*,*,#819,.F.);
#836 = ORIENTED_EDGE('',*,*,#837,.T.);
#837 = EDGE_CURVE('',#820,#820,#838,.T.);
#838 = CIRCLE('',#839,14.);
#839 = AXIS2_PLACEMENT_3D('',#840,#841,#842);
#840 = CARTESIAN_POINT('',(-12.5,-8.881784197001E-16,21.));
#841 = DIRECTION('',(2.22044604925E-16,1.,2.22044604925E-16));
#842 = DIRECTION('',(4.930380657631E-32,2.22044604925E-16,-1.));
#843 = CYLINDRICAL_SURFACE('',#844,14.);
#844 = AXIS2_PLACEMENT_3D('',#845,#846,#847);
#845 = CARTESIAN_POINT('',(-12.5,-2.,21.));
#846 = DIRECTION('',(2.22044604925E-16,1.,2.22044604925E-16));
#847 = DIRECTION('',(4.930380657631E-32,2.22044604925E-16,-1.));
#848 = ADVANCED_FACE('',(#849),#869,.T.);
#849 = FACE_BOUND('',#850,.F.);
#850 = EDGE_LOOP('',(#851,#860,#861,#862));
#851 = ORIENTED_EDGE('',*,*,#852,.F.);
#852 = EDGE_CURVE('',#820,#853,#855,.T.);
#853 = VERTEX_POINT('',#854);
#854 = CARTESIAN_POINT('',(-12.5,-2.,9.));
#855 = CIRCLE('',#856,2.);
#856 = AXIS2_PLACEMENT_3D('',#857,#858,#859);
#857 = CARTESIAN_POINT('',(-12.5,1.7763568394E-15,9.));
#858 = DIRECTION('',(-1.,2.22044604925E-16,0.));
#859 = DIRECTION('',(4.930380657631E-32,2.22044604925E-16,-1.));
#860 = ORIENTED_EDGE('',*,*,#837,.T.);
#861 = ORIENTED_EDGE('',*,*,#852,.T.);
#862 = ORIENTED_EDGE('',*,*,#863,.F.);
#863 = EDGE_CURVE('',#853,#853,#864,.T.);
#864 = CIRCLE('',#865,12.);
#865 = AXIS2_PLACEMENT_3D('',#866,#867,#868);
#866 = CARTESIAN_POINT('',(-12.5,-2.,21.));
#867 = DIRECTION('',(2.22044604925E-16,1.,2.22044604925E-16));
#868 = DIRECTION('',(4.930380657631E-32,2.22044604925E-16,-1.));
#869 = TOROIDAL_SURFACE('',#870,12.,2.);
#870 = AXIS2_PLACEMENT_3D('',#871,#872,#873);
#871 = CARTESIAN_POINT('',(-12.5,-8.881784197001E-16,21.));
#872 = DIRECTION('',(-2.22044604925E-16,-1.,-2.22044604925E-16));
#873 = DIRECTION('',(4.930380657631E-32,2.22044604925E-16,-1.));
#874 = ADVANCED_FACE('',(#875),#895,.T.);
#875 = FACE_BOUND('',#876,.T.);
#876 = EDGE_LOOP('',(#877,#886,#887,#888));
#877 = ORIENTED_EDGE('',*,*,#878,.F.);
#878 = EDGE_CURVE('',#822,#879,#881,.T.);
#879 = VERTEX_POINT('',#880);
#880 = CARTESIAN_POINT('',(-12.5,17.,9.));
#881 = CIRCLE('',#882,2.);
#882 = AXIS2_PLACEMENT_3D('',#883,#884,#885);
#883 = CARTESIAN_POINT('',(-12.5,15.,9.));
#884 = DIRECTION('',(1.,-2.22044604925E-16,0.));
#885 = DIRECTION('',(4.930380657631E-32,2.22044604925E-16,-1.));
#886 = ORIENTED_EDGE('',*,*,#829,.T.);
#887 = ORIENTED_EDGE('',*,*,#878,.T.);
#888 = ORIENTED_EDGE('',*,*,#889,.F.);
#889 = EDGE_CURVE('',#879,#879,#890,.T.);
#890 = CIRCLE('',#891,12.);
#891 = AXIS2_PLACEMENT_3D('',#892,#893,#894);
#892 = CARTESIAN_POINT('',(-12.5,17.,21.));
#893 = DIRECTION('',(2.22044604925E-16,1.,2.22044604925E-16));
#894 = DIRECTION('',(4.930380657631E-32,2.22044604925E-16,-1.));
#895 = TOROIDAL_SURFACE('',#896,12.,2.);
#896 = AXIS2_PLACEMENT_3D('',#897,#898,#899);
#897 = CARTESIAN_POINT('',(-12.5,15.,21.));
#898 = DIRECTION('',(2.22044604925E-16,1.,2.22044604925E-16));
#899 = DIRECTION('',(4.930380657631E-32,2.22044604925E-16,-1.));
#900 = ADVANCED_FACE('',(#901,#904),#915,.F.);
#901 = FACE_BOUND('',#902,.F.);
#902 = EDGE_LOOP('',(#903));
#903 = ORIENTED_EDGE('',*,*,#863,.T.);
#904 = FACE_BOUND('',#905,.F.);
#905 = EDGE_LOOP('',(#906));
#906 = ORIENTED_EDGE('',*,*,#907,.F.);
#907 = EDGE_CURVE('',#908,#908,#910,.T.);
#908 = VERTEX_POINT('',#909);
#909 = CARTESIAN_POINT('',(-12.5,-2.,12.));
#910 = CIRCLE('',#911,9.);
#911 = AXIS2_PLACEMENT_3D('',#912,#913,#914);
#912 = CARTESIAN_POINT('',(-12.5,-2.,21.));
#913 = DIRECTION('',(2.22044604925E-16,1.,2.22044604925E-16));
#914 = DIRECTION('',(4.930380657631E-32,2.22044604925E-16,-1.));
#915 = PLANE('',#916);
#916 = AXIS2_PLACEMENT_3D('',#917,#918,#919);
#917 = CARTESIAN_POINT('',(-12.5,-2.,21.));
#918 = DIRECTION('',(2.22044604925E-16,1.,2.22044604925E-16));
#919 = DIRECTION('',(4.930380657631E-32,2.22044604925E-16,-1.));
#920 = ADVANCED_FACE('',(#921,#924),#935,.T.);
#921 = FACE_BOUND('',#922,.T.);
#922 = EDGE_LOOP('',(#923));
#923 = ORIENTED_EDGE('',*,*,#889,.T.);
#924 = FACE_BOUND('',#925,.T.);
#925 = EDGE_LOOP('',(#926));
#926 = ORIENTED_EDGE('',*,*,#927,.F.);
#927 = EDGE_CURVE('',#928,#928,#930,.T.);
#928 = VERTEX_POINT('',#929);
#929 = CARTESIAN_POINT('',(-12.5,17.,12.));
#930 = CIRCLE('',#931,9.);
#931 = AXIS2_PLACEMENT_3D('',#932,#933,#934);
#932 = CARTESIAN_POINT('',(-12.5,17.,21.));
#933 = DIRECTION('',(2.22044604925E-16,1.,2.22044604925E-16));
#934 = DIRECTION('',(4.930380657631E-32,2.22044604925E-16,-1.));
#935 = PLANE('',#936);
#936 = AXIS2_PLACEMENT_3D('',#937,#938,#939);
#937 = CARTESIAN_POINT('',(-12.5,17.,21.));
#938 = DIRECTION('',(2.22044604925E-16,1.,2.22044604925E-16));
#939 = DIRECTION('',(4.930380657631E-32,2.22044604925E-16,-1.));
#940 = ADVANCED_FACE('',(#941),#961,.T.);
#941 = FACE_BOUND('',#942,.F.);
#942 = EDGE_LOOP('',(#943,#952,#953,#954));
#943 = ORIENTED_EDGE('',*,*,#944,.F.);
#944 = EDGE_CURVE('',#908,#945,#947,.T.);
#945 = VERTEX_POINT('',#946);
#946 = CARTESIAN_POINT('',(-12.5,2.22044604925E-16,14.));
#947 = CIRCLE('',#948,2.);
#948 = AXIS2_PLACEMENT_3D('',#949,#950,#951);
#949 = CARTESIAN_POINT('',(-12.5,8.881784197001E-16,12.));
#950 = DIRECTION('',(-1.,2.22044604925E-16,0.));
#951 = DIRECTION('',(4.930380657631E-32,2.22044604925E-16,-1.));
#952 = ORIENTED_EDGE('',*,*,#907,.T.);
#953 = ORIENTED_EDGE('',*,*,#944,.T.);
#954 = ORIENTED_EDGE('',*,*,#955,.F.);
#955 = EDGE_CURVE('',#945,#945,#956,.T.);
#956 = CIRCLE('',#957,7.);
#957 = AXIS2_PLACEMENT_3D('',#958,#959,#960);
#958 = CARTESIAN_POINT('',(-12.5,-8.881784197001E-16,21.));
#959 = DIRECTION('',(2.22044604925E-16,1.,2.22044604925E-16));
#960 = DIRECTION('',(4.930380657631E-32,2.22044604925E-16,-1.));
#961 = TOROIDAL_SURFACE('',#962,9.,2.);
#962 = AXIS2_PLACEMENT_3D('',#963,#964,#965);
#963 = CARTESIAN_POINT('',(-12.5,-8.881784197001E-16,21.));
#964 = DIRECTION('',(-2.22044604925E-16,-1.,-2.22044604925E-16));
#965 = DIRECTION('',(4.930380657631E-32,2.22044604925E-16,-1.));
#966 = ADVANCED_FACE('',(#967),#987,.T.);
#967 = FACE_BOUND('',#968,.T.);
#968 = EDGE_LOOP('',(#969,#978,#979,#980));
#969 = ORIENTED_EDGE('',*,*,#970,.F.);
#970 = EDGE_CURVE('',#928,#971,#973,.T.);
#971 = VERTEX_POINT('',#972);
#972 = CARTESIAN_POINT('',(-12.5,15.,14.));
#973 = CIRCLE('',#974,2.);
#974 = AXIS2_PLACEMENT_3D('',#975,#976,#977);
#975 = CARTESIAN_POINT('',(-12.5,15.,12.));
#976 = DIRECTION('',(1.,-2.22044604925E-16,0.));
#977 = DIRECTION('',(4.930380657631E-32,2.22044604925E-16,-1.));
#978 = ORIENTED_EDGE('',*,*,#927,.T.);
#979 = ORIENTED_EDGE('',*,*,#970,.T.);
#980 = ORIENTED_EDGE('',*,*,#981,.F.);
#981 = EDGE_CURVE('',#971,#971,#982,.T.);
#982 = CIRCLE('',#983,7.);
#983 = AXIS2_PLACEMENT_3D('',#984,#985,#986);
#984 = CARTESIAN_POINT('',(-12.5,15.,21.));
#985 = DIRECTION('',(2.22044604925E-16,1.,2.22044604925E-16));
#986 = DIRECTION('',(4.930380657631E-32,2.22044604925E-16,-1.));
#987 = TOROIDAL_SURFACE('',#988,9.,2.);
#988 = AXIS2_PLACEMENT_3D('',#989,#990,#991);
#989 = CARTESIAN_POINT('',(-12.5,15.,21.));
#990 = DIRECTION('',(2.22044604925E-16,1.,2.22044604925E-16));
#991 = DIRECTION('',(4.930380657631E-32,2.22044604925E-16,-1.));
#992 = ADVANCED_FACE('',(#993),#1004,.F.);
#993 = FACE_BOUND('',#994,.F.);
#994 = EDGE_LOOP('',(#995,#1001,#1002,#1003));
#995 = ORIENTED_EDGE('',*,*,#996,.T.);
#996 = EDGE_CURVE('',#945,#971,#997,.T.);
#997 = LINE('',#998,#999);
#998 = CARTESIAN_POINT('',(-12.5,-13.,14.));
#999 = VECTOR('',#1000,1.);
#1000 = DIRECTION('',(2.22044604925E-16,1.,2.22044604925E-16));
#1001 = ORIENTED_EDGE('',*,*,#981,.F.);
#1002 = ORIENTED_EDGE('',*,*,#996,.F.);
#1003 = ORIENTED_EDGE('',*,*,#955,.T.);
#1004 = CYLINDRICAL_SURFACE('',#1005,7.);
#1005 = AXIS2_PLACEMENT_3D('',#1006,#1007,#1008);
#1006 = CARTESIAN_POINT('',(-12.5,-13.,21.));
#1007 = DIRECTION('',(2.22044604925E-16,1.,2.22044604925E-16));
#1008 = DIRECTION('',(4.930380657631E-32,2.22044604925E-16,-1.));
#1009 = ( GEOMETRIC_REPRESENTATION_CONTEXT(3) 
GLOBAL_UNCERTAINTY_ASSIGNED_CONTEXT((#1013)) 
GLOBAL_UNIT_ASSIGNED_CONTEXT((#1010,#1011,#1012)) REPRESENTATION_CONTEXT
('Context #1','3D Context with UNIT and UNCERTAINTY') );
#1010 = ( LENGTH_UNIT() NAMED_UNIT(*) SI_UNIT(.MILLI.,.METRE.) );
#1011 = ( NAMED_UNIT(*) PLANE_ANGLE_UNIT() SI_UNIT($,.RADIAN.) );
#1012 = ( NAMED_UNIT(*) SI_UNIT($,.STERADIAN.) SOLID_ANGLE_UNIT() );
#1013 = UNCERTAINTY_MEASURE_WITH_UNIT(LENGTH_MEASURE(1.E-07),#1010,
  'distance_accuracy_value','confusion accuracy');
#1014 = PRODUCT_RELATED_PRODUCT_CATEGORY('part',$,(#7));
#1015 = MECHANICAL_DESIGN_GEOMETRIC_PRESENTATION_REPRESENTATION('',(
    #1016,#1024,#1031,#1038,#1045,#1052,#1059,#1066,#1073,#1080,#1087,
    #1094,#1101,#1108,#1115,#1122,#1129,#1136,#1143,#1151,#1158,#1165,
    #1172,#1179,#1186,#1193,#1200,#1207,#1214,#1221,#1228,#1235,#1242,
    #1249,#1256,#1264,#1271,#1278,#1285,#1292,#1299,#1306),#1009);
#1016 = STYLED_ITEM('color',(#1017),#17);
#1017 = PRESENTATION_STYLE_ASSIGNMENT((#1018));
#1018 = SURFACE_STYLE_USAGE(.BOTH.,#1019);
#1019 = SURFACE_SIDE_STYLE('',(#1020));
#1020 = SURFACE_STYLE_FILL_AREA(#1021);
#1021 = FILL_AREA_STYLE('',(#1022));
#1022 = FILL_AREA_STYLE_COLOUR('',#1023);
#1023 = COLOUR_RGB('',0.227450981736,0.227450981736,0.227450981736);
#1024 = STYLED_ITEM('color',(#1025),#57);
#1025 = PRESENTATION_STYLE_ASSIGNMENT((#1026));
#1026 = SURFACE_STYLE_USAGE(.BOTH.,#1027);
#1027 = SURFACE_SIDE_STYLE('',(#1028));
#1028 = SURFACE_STYLE_FILL_AREA(#1029);
#1029 = FILL_AREA_STYLE('',(#1030));
#1030 = FILL_AREA_STYLE_COLOUR('',#1023);
#1031 = STYLED_ITEM('color',(#1032),#90);
#1032 = PRESENTATION_STYLE_ASSIGNMENT((#1033));
#1033 = SURFACE_STYLE_USAGE(.BOTH.,#1034);
#1034 = SURFACE_SIDE_STYLE('',(#1035));
#1035 = SURFACE_STYLE_FILL_AREA(#1036);
#1036 = FILL_AREA_STYLE('',(#1037));
#1037 = FILL_AREA_STYLE_COLOUR('',#1023);
#1038 = STYLED_ITEM('color',(#1039),#123);
#1039 = PRESENTATION_STYLE_ASSIGNMENT((#1040));
#1040 = SURFACE_STYLE_USAGE(.BOTH.,#1041);
#1041 = SURFACE_SIDE_STYLE('',(#1042));
#1042 = SURFACE_STYLE_FILL_AREA(#1043);
#1043 = FILL_AREA_STYLE('',(#1044));
#1044 = FILL_AREA_STYLE_COLOUR('',#1023);
#1045 = STYLED_ITEM('color',(#1046),#156);
#1046 = PRESENTATION_STYLE_ASSIGNMENT((#1047));
#1047 = SURFACE_STYLE_USAGE(.BOTH.,#1048);
#1048 = SURFACE_SIDE_STYLE('',(#1049));
#1049 = SURFACE_STYLE_FILL_AREA(#1050);
#1050 = FILL_AREA_STYLE('',(#1051));
#1051 = FILL_AREA_STYLE_COLOUR('',#1023);
#1052 = STYLED_ITEM('color',(#1053),#189);
#1053 = PRESENTATION_STYLE_ASSIGNMENT((#1054));
#1054 = SURFACE_STYLE_USAGE(.BOTH.,#1055);
#1055 = SURFACE_SIDE_STYLE('',(#1056));
#1056 = SURFACE_STYLE_FILL_AREA(#1057);
#1057 = FILL_AREA_STYLE('',(#1058));
#1058 = FILL_AREA_STYLE_COLOUR('',#1023);
#1059 = STYLED_ITEM('color',(#1060),#206);
#1060 = PRESENTATION_STYLE_ASSIGNMENT((#1061));
#1061 = SURFACE_STYLE_USAGE(.BOTH.,#1062);
#1062 = SURFACE_SIDE_STYLE('',(#1063));
#1063 = SURFACE_STYLE_FILL_AREA(#1064);
#1064 = FILL_AREA_STYLE('',(#1065));
#1065 = FILL_AREA_STYLE_COLOUR('',#1023);
#1066 = STYLED_ITEM('color',(#1067),#223);
#1067 = PRESENTATION_STYLE_ASSIGNMENT((#1068));
#1068 = SURFACE_STYLE_USAGE(.BOTH.,#1069);
#1069 = SURFACE_SIDE_STYLE('',(#1070));
#1070 = SURFACE_STYLE_FILL_AREA(#1071);
#1071 = FILL_AREA_STYLE('',(#1072));
#1072 = FILL_AREA_STYLE_COLOUR('',#1023);
#1073 = STYLED_ITEM('color',(#1074),#254);
#1074 = PRESENTATION_STYLE_ASSIGNMENT((#1075));
#1075 = SURFACE_STYLE_USAGE(.BOTH.,#1076);
#1076 = SURFACE_SIDE_STYLE('',(#1077));
#1077 = SURFACE_STYLE_FILL_AREA(#1078);
#1078 = FILL_AREA_STYLE('',(#1079));
#1079 = FILL_AREA_STYLE_COLOUR('',#1023);
#1080 = STYLED_ITEM('color',(#1081),#329);
#1081 = PRESENTATION_STYLE_ASSIGNMENT((#1082));
#1082 = SURFACE_STYLE_USAGE(.BOTH.,#1083);
#1083 = SURFACE_SIDE_STYLE('',(#1084));
#1084 = SURFACE_STYLE_FILL_AREA(#1085);
#1085 = FILL_AREA_STYLE('',(#1086));
#1086 = FILL_AREA_STYLE_COLOUR('',#1023);
#1087 = STYLED_ITEM('color',(#1088),#346);
#1088 = PRESENTATION_STYLE_ASSIGNMENT((#1089));
#1089 = SURFACE_STYLE_USAGE(.BOTH.,#1090);
#1090 = SURFACE_SIDE_STYLE('',(#1091));
#1091 = SURFACE_STYLE_FILL_AREA(#1092);
#1092 = FILL_AREA_STYLE('',(#1093));
#1093 = FILL_AREA_STYLE_COLOUR('',#1023);
#1094 = STYLED_ITEM('color',(#1095),#377);
#1095 = PRESENTATION_STYLE_ASSIGNMENT((#1096));
#1096 = SURFACE_STYLE_USAGE(.BOTH.,#1097);
#1097 = SURFACE_SIDE_STYLE('',(#1098));
#1098 = SURFACE_STYLE_FILL_AREA(#1099);
#1099 = FILL_AREA_STYLE('',(#1100));
#1100 = FILL_AREA_STYLE_COLOUR('',#1023);
#1101 = STYLED_ITEM('color',(#1102),#394);
#1102 = PRESENTATION_STYLE_ASSIGNMENT((#1103));
#1103 = SURFACE_STYLE_USAGE(.BOTH.,#1104);
#1104 = SURFACE_SIDE_STYLE('',(#1105));
#1105 = SURFACE_STYLE_FILL_AREA(#1106);
#1106 = FILL_AREA_STYLE('',(#1107));
#1107 = FILL_AREA_STYLE_COLOUR('',#1023);
#1108 = STYLED_ITEM('color',(#1109),#425);
#1109 = PRESENTATION_STYLE_ASSIGNMENT((#1110));
#1110 = SURFACE_STYLE_USAGE(.BOTH.,#1111);
#1111 = SURFACE_SIDE_STYLE('',(#1112));
#1112 = SURFACE_STYLE_FILL_AREA(#1113);
#1113 = FILL_AREA_STYLE('',(#1114));
#1114 = FILL_AREA_STYLE_COLOUR('',#1023);
#1115 = STYLED_ITEM('color',(#1116),#443);
#1116 = PRESENTATION_STYLE_ASSIGNMENT((#1117));
#1117 = SURFACE_STYLE_USAGE(.BOTH.,#1118);
#1118 = SURFACE_SIDE_STYLE('',(#1119));
#1119 = SURFACE_STYLE_FILL_AREA(#1120);
#1120 = FILL_AREA_STYLE('',(#1121));
#1121 = FILL_AREA_STYLE_COLOUR('',#1023);
#1122 = STYLED_ITEM('color',(#1123),#461);
#1123 = PRESENTATION_STYLE_ASSIGNMENT((#1124));
#1124 = SURFACE_STYLE_USAGE(.BOTH.,#1125);
#1125 = SURFACE_SIDE_STYLE('',(#1126));
#1126 = SURFACE_STYLE_FILL_AREA(#1127);
#1127 = FILL_AREA_STYLE('',(#1128));
#1128 = FILL_AREA_STYLE_COLOUR('',#1023);
#1129 = STYLED_ITEM('color',(#1130),#494);
#1130 = PRESENTATION_STYLE_ASSIGNMENT((#1131));
#1131 = SURFACE_STYLE_USAGE(.BOTH.,#1132);
#1132 = SURFACE_SIDE_STYLE('',(#1133));
#1133 = SURFACE_STYLE_FILL_AREA(#1134);
#1134 = FILL_AREA_STYLE('',(#1135));
#1135 = FILL_AREA_STYLE_COLOUR('',#1023);
#1136 = STYLED_ITEM('color',(#1137),#512);
#1137 = PRESENTATION_STYLE_ASSIGNMENT((#1138));
#1138 = SURFACE_STYLE_USAGE(.BOTH.,#1139);
#1139 = SURFACE_SIDE_STYLE('',(#1140));
#1140 = SURFACE_STYLE_FILL_AREA(#1141);
#1141 = FILL_AREA_STYLE('',(#1142));
#1142 = FILL_AREA_STYLE_COLOUR('',#1023);
#1143 = STYLED_ITEM('color',(#1144),#543);
#1144 = PRESENTATION_STYLE_ASSIGNMENT((#1145));
#1145 = SURFACE_STYLE_USAGE(.BOTH.,#1146);
#1146 = SURFACE_SIDE_STYLE('',(#1147));
#1147 = SURFACE_STYLE_FILL_AREA(#1148);
#1148 = FILL_AREA_STYLE('',(#1149));
#1149 = FILL_AREA_STYLE_COLOUR('',#1150);
#1150 = COLOUR_RGB('',0.800000011921,0.800000011921,0.800000011921);
#1151 = STYLED_ITEM('color',(#1152),#568);
#1152 = PRESENTATION_STYLE_ASSIGNMENT((#1153));
#1153 = SURFACE_STYLE_USAGE(.BOTH.,#1154);
#1154 = SURFACE_SIDE_STYLE('',(#1155));
#1155 = SURFACE_STYLE_FILL_AREA(#1156);
#1156 = FILL_AREA_STYLE('',(#1157));
#1157 = FILL_AREA_STYLE_COLOUR('',#1150);
#1158 = STYLED_ITEM('color',(#1159),#593);
#1159 = PRESENTATION_STYLE_ASSIGNMENT((#1160));
#1160 = SURFACE_STYLE_USAGE(.BOTH.,#1161);
#1161 = SURFACE_SIDE_STYLE('',(#1162));
#1162 = SURFACE_STYLE_FILL_AREA(#1163);
#1163 = FILL_AREA_STYLE('',(#1164));
#1164 = FILL_AREA_STYLE_COLOUR('',#1150);
#1165 = STYLED_ITEM('color',(#1166),#618);
#1166 = PRESENTATION_STYLE_ASSIGNMENT((#1167));
#1167 = SURFACE_STYLE_USAGE(.BOTH.,#1168);
#1168 = SURFACE_SIDE_STYLE('',(#1169));
#1169 = SURFACE_STYLE_FILL_AREA(#1170);
#1170 = FILL_AREA_STYLE('',(#1171));
#1171 = FILL_AREA_STYLE_COLOUR('',#1150);
#1172 = STYLED_ITEM('color',(#1173),#643);
#1173 = PRESENTATION_STYLE_ASSIGNMENT((#1174));
#1174 = SURFACE_STYLE_USAGE(.BOTH.,#1175);
#1175 = SURFACE_SIDE_STYLE('',(#1176));
#1176 = SURFACE_STYLE_FILL_AREA(#1177);
#1177 = FILL_AREA_STYLE('',(#1178));
#1178 = FILL_AREA_STYLE_COLOUR('',#1023);
#1179 = STYLED_ITEM('color',(#1180),#661);
#1180 = PRESENTATION_STYLE_ASSIGNMENT((#1181));
#1181 = SURFACE_STYLE_USAGE(.BOTH.,#1182);
#1182 = SURFACE_SIDE_STYLE('',(#1183));
#1183 = SURFACE_STYLE_FILL_AREA(#1184);
#1184 = FILL_AREA_STYLE('',(#1185));
#1185 = FILL_AREA_STYLE_COLOUR('',#1023);
#1186 = STYLED_ITEM('color',(#1187),#692);
#1187 = PRESENTATION_STYLE_ASSIGNMENT((#1188));
#1188 = SURFACE_STYLE_USAGE(.BOTH.,#1189);
#1189 = SURFACE_SIDE_STYLE('',(#1190));
#1190 = SURFACE_STYLE_FILL_AREA(#1191);
#1191 = FILL_AREA_STYLE('',(#1192));
#1192 = FILL_AREA_STYLE_COLOUR('',#1023);
#1193 = STYLED_ITEM('color',(#1194),#721);
#1194 = PRESENTATION_STYLE_ASSIGNMENT((#1195));
#1195 = SURFACE_STYLE_USAGE(.BOTH.,#1196);
#1196 = SURFACE_SIDE_STYLE('',(#1197));
#1197 = SURFACE_STYLE_FILL_AREA(#1198);
#1198 = FILL_AREA_STYLE('',(#1199));
#1199 = FILL_AREA_STYLE_COLOUR('',#1023);
#1200 = STYLED_ITEM('color',(#1201),#732);
#1201 = PRESENTATION_STYLE_ASSIGNMENT((#1202));
#1202 = SURFACE_STYLE_USAGE(.BOTH.,#1203);
#1203 = SURFACE_SIDE_STYLE('',(#1204));
#1204 = SURFACE_STYLE_FILL_AREA(#1205);
#1205 = FILL_AREA_STYLE('',(#1206));
#1206 = FILL_AREA_STYLE_COLOUR('',#1023);
#1207 = STYLED_ITEM('color',(#1208),#743);
#1208 = PRESENTATION_STYLE_ASSIGNMENT((#1209));
#1209 = SURFACE_STYLE_USAGE(.BOTH.,#1210);
#1210 = SURFACE_SIDE_STYLE('',(#1211));
#1211 = SURFACE_STYLE_FILL_AREA(#1212);
#1212 = FILL_AREA_STYLE('',(#1213));
#1213 = FILL_AREA_STYLE_COLOUR('',#1023);
#1214 = STYLED_ITEM('color',(#1215),#755);
#1215 = PRESENTATION_STYLE_ASSIGNMENT((#1216));
#1216 = SURFACE_STYLE_USAGE(.BOTH.,#1217);
#1217 = SURFACE_SIDE_STYLE('',(#1218));
#1218 = SURFACE_STYLE_FILL_AREA(#1219);
#1219 = FILL_AREA_STYLE('',(#1220));
#1220 = FILL_AREA_STYLE_COLOUR('',#1023);
#1221 = STYLED_ITEM('color',(#1222),#766);
#1222 = PRESENTATION_STYLE_ASSIGNMENT((#1223));
#1223 = SURFACE_STYLE_USAGE(.BOTH.,#1224);
#1224 = SURFACE_SIDE_STYLE('',(#1225));
#1225 = SURFACE_STYLE_FILL_AREA(#1226);
#1226 = FILL_AREA_STYLE('',(#1227));
#1227 = FILL_AREA_STYLE_COLOUR('',#1150);
#1228 = STYLED_ITEM('color',(#1229),#775);
#1229 = PRESENTATION_STYLE_ASSIGNMENT((#1230));
#1230 = SURFACE_STYLE_USAGE(.BOTH.,#1231);
#1231 = SURFACE_SIDE_STYLE('',(#1232));
#1232 = SURFACE_STYLE_FILL_AREA(#1233);
#1233 = FILL_AREA_STYLE('',(#1234));
#1234 = FILL_AREA_STYLE_COLOUR('',#1150);
#1235 = STYLED_ITEM('color',(#1236),#784);
#1236 = PRESENTATION_STYLE_ASSIGNMENT((#1237));
#1237 = SURFACE_STYLE_USAGE(.BOTH.,#1238);
#1238 = SURFACE_SIDE_STYLE('',(#1239));
#1239 = SURFACE_STYLE_FILL_AREA(#1240);
#1240 = FILL_AREA_STYLE('',(#1241));
#1241 = FILL_AREA_STYLE_COLOUR('',#1150);
#1242 = STYLED_ITEM('color',(#1243),#793);
#1243 = PRESENTATION_STYLE_ASSIGNMENT((#1244));
#1244 = SURFACE_STYLE_USAGE(.BOTH.,#1245);
#1245 = SURFACE_SIDE_STYLE('',(#1246));
#1246 = SURFACE_STYLE_FILL_AREA(#1247);
#1247 = FILL_AREA_STYLE('',(#1248));
#1248 = FILL_AREA_STYLE_COLOUR('',#1150);
#1249 = STYLED_ITEM('color',(#1250),#802);
#1250 = PRESENTATION_STYLE_ASSIGNMENT((#1251));
#1251 = SURFACE_STYLE_USAGE(.BOTH.,#1252);
#1252 = SURFACE_SIDE_STYLE('',(#1253));
#1253 = SURFACE_STYLE_FILL_AREA(#1254);
#1254 = FILL_AREA_STYLE('',(#1255));
#1255 = FILL_AREA_STYLE_COLOUR('',#1023);
#1256 = STYLED_ITEM('color',(#1257),#815);
#1257 = PRESENTATION_STYLE_ASSIGNMENT((#1258));
#1258 = SURFACE_STYLE_USAGE(.BOTH.,#1259);
#1259 = SURFACE_SIDE_STYLE('',(#1260));
#1260 = SURFACE_STYLE_FILL_AREA(#1261);
#1261 = FILL_AREA_STYLE('',(#1262));
#1262 = FILL_AREA_STYLE_COLOUR('',#1263);
#1263 = COLOUR_RGB('',0.666666686535,0.,0.);
#1264 = STYLED_ITEM('color',(#1265),#848);
#1265 = PRESENTATION_STYLE_ASSIGNMENT((#1266));
#1266 = SURFACE_STYLE_USAGE(.BOTH.,#1267);
#1267 = SURFACE_SIDE_STYLE('',(#1268));
#1268 = SURFACE_STYLE_FILL_AREA(#1269);
#1269 = FILL_AREA_STYLE('',(#1270));
#1270 = FILL_AREA_STYLE_COLOUR('',#1263);
#1271 = STYLED_ITEM('color',(#1272),#874);
#1272 = PRESENTATION_STYLE_ASSIGNMENT((#1273));
#1273 = SURFACE_STYLE_USAGE(.BOTH.,#1274);
#1274 = SURFACE_SIDE_STYLE('',(#1275));
#1275 = SURFACE_STYLE_FILL_AREA(#1276);
#1276 = FILL_AREA_STYLE('',(#1277));
#1277 = FILL_AREA_STYLE_COLOUR('',#1263);
#1278 = STYLED_ITEM('color',(#1279),#900);
#1279 = PRESENTATION_STYLE_ASSIGNMENT((#1280));
#1280 = SURFACE_STYLE_USAGE(.BOTH.,#1281);
#1281 = SURFACE_SIDE_STYLE('',(#1282));
#1282 = SURFACE_STYLE_FILL_AREA(#1283);
#1283 = FILL_AREA_STYLE('',(#1284));
#1284 = FILL_AREA_STYLE_COLOUR('',#1263);
#1285 = STYLED_ITEM('color',(#1286),#920);
#1286 = PRESENTATION_STYLE_ASSIGNMENT((#1287));
#1287 = SURFACE_STYLE_USAGE(.BOTH.,#1288);
#1288 = SURFACE_SIDE_STYLE('',(#1289));
#1289 = SURFACE_STYLE_FILL_AREA(#1290);
#1290 = FILL_AREA_STYLE('',(#1291));
#1291 = FILL_AREA_STYLE_COLOUR('',#1263);
#1292 = STYLED_ITEM('color',(#1293),#940);
#1293 = PRESENTATION_STYLE_ASSIGNMENT((#1294));
#1294 = SURFACE_STYLE_USAGE(.BOTH.,#1295);
#1295 = SURFACE_SIDE_STYLE('',(#1296));
#1296 = SURFACE_STYLE_FILL_AREA(#1297);
#1297 = FILL_AREA_STYLE('',(#1298));
#1298 = FILL_AREA_STYLE_COLOUR('',#1263);
#1299 = STYLED_ITEM('color',(#1300),#966);
#1300 = PRESENTATION_STYLE_ASSIGNMENT((#1301));
#1301 = SURFACE_STYLE_USAGE(.BOTH.,#1302);
#1302 = SURFACE_SIDE_STYLE('',(#1303));
#1303 = SURFACE_STYLE_FILL_AREA(#1304);
#1304 = FILL_AREA_STYLE('',(#1305));
#1305 = FILL_AREA_STYLE_COLOUR('',#1263);
#1306 = STYLED_ITEM('color',(#1307),#992);
#1307 = PRESENTATION_STYLE_ASSIGNMENT((#1308));
#1308 = SURFACE_STYLE_USAGE(.BOTH.,#1309);
#1309 = SURFACE_SIDE_STYLE('',(#1310));
#1310 = SURFACE_STYLE_FILL_AREA(#1311);
#1311 = FILL_AREA_STYLE('',(#1312));
#1312 = FILL_AREA_STYLE_COLOUR('',#1263);
ENDSEC;
END-ISO-10303-21;
