ISO-10303-21;
HEADER;
FILE_DESCRIPTION(('FreeCAD Model'),'2;1');
FILE_NAME(
'/home/jat/Dropbox/Projekty/Elektrika/Elektronika/_KiCAD_
Library/3D/Coil toroid 16_8x9_2x7_1.step','2019-01-26T19:05:04',(
    'kicad StepUp'),('ksu MCAD'),'Open CASCADE STEP processor 7.3',
  'FreeCAD','Unknown');
FILE_SCHEMA(('AUTOMOTIVE_DESIGN { 1 0 10303 214 1 1 1 1 }'));
ENDSEC;
DATA;
#1 = APPLICATION_PROTOCOL_DEFINITION('international standard',
  'automotive_design',2000,#2);
#2 = APPLICATION_CONTEXT(
  'core data for automotive mechanical design processes');
#3 = SHAPE_DEFINITION_REPRESENTATION(#4,#10);
#4 = PRODUCT_DEFINITION_SHAPE('','',#5);
#5 = PRODUCT_DEFINITION('design','',#6,#9);
#6 = PRODUCT_DEFINITION_FORMATION('','',#7);
#7 = PRODUCT('Coil_toroid_16_8x9_2x7_1','Coil_toroid_16_8x9_2x7_1','',(
    #8));
#8 = PRODUCT_CONTEXT('',#2,'mechanical');
#9 = PRODUCT_DEFINITION_CONTEXT('part definition',#2,'design');
#10 = ADVANCED_BREP_SHAPE_REPRESENTATION('',(#11,#15),#473);
#11 = AXIS2_PLACEMENT_3D('',#12,#13,#14);
#12 = CARTESIAN_POINT('',(0.,0.,0.));
#13 = DIRECTION('',(0.,0.,1.));
#14 = DIRECTION('',(1.,0.,-0.));
#15 = MANIFOLD_SOLID_BREP('',#16);
#16 = CLOSED_SHELL('',(#17,#127,#169,#257,#266,#286,#348,#375,#401,#421,
    #430,#455));
#17 = ADVANCED_FACE('',(#18),#122,.T.);
#18 = FACE_BOUND('',#19,.T.);
#19 = EDGE_LOOP('',(#20,#71,#79,#86,#87));
#20 = ORIENTED_EDGE('',*,*,#21,.T.);
#21 = EDGE_CURVE('',#22,#24,#26,.T.);
#22 = VERTEX_POINT('',#23);
#23 = CARTESIAN_POINT('',(-0.5,-1.859623566247E-15,0.614894156899));
#24 = VERTEX_POINT('',#25);
#25 = CARTESIAN_POINT('',(0.5,-9.71445146547E-16,0.614894156899));
#26 = B_SPLINE_CURVE_WITH_KNOTS('',7,(#27,#28,#29,#30,#31,#32,#33,#34,
    #35,#36,#37,#38,#39,#40,#41,#42,#43,#44,#45,#46,#47,#48,#49,#50,#51,
    #52,#53,#54,#55,#56,#57,#58,#59,#60,#61,#62,#63,#64,#65,#66,#67,#68,
    #69,#70),.UNSPECIFIED.,.F.,.F.,(8,6,6,6,6,6,6,8),(0.,0.151438780178,
    0.361542028138,0.410777728848,0.506723374753,0.638265577213,
    0.848477972491,1.),.UNSPECIFIED.);
#27 = CARTESIAN_POINT('',(-0.5,-1.887379141863E-15,0.614894156899));
#28 = CARTESIAN_POINT('',(-0.499999996719,3.281390707024E-02,
    0.614894159991));
#29 = CARTESIAN_POINT('',(-0.497487609656,6.562893184164E-02,
    0.616002801079));
#30 = CARTESIAN_POINT('',(-0.492462427329,9.822506089433E-02,0.618220146
    ));
#31 = CARTESIAN_POINT('',(-0.484945680635,0.130386104113,0.62151157979)
  );
#32 = CARTESIAN_POINT('',(-0.474977491409,0.161900822588,0.625808601469)
  );
#33 = CARTESIAN_POINT('',(-0.462614120986,0.192564056511,0.631009618834)
  );
#34 = CARTESIAN_POINT('',(-0.427546118615,0.263263464286,0.645264966301)
  );
#35 = CARTESIAN_POINT('',(-0.402699835804,0.302310410928,0.655027734388)
  );
#36 = CARTESIAN_POINT('',(-0.373561206141,0.338829244094,0.665916746368)
  );
#37 = CARTESIAN_POINT('',(-0.340345016188,0.372309527537,0.677461019351)
  );
#38 = CARTESIAN_POINT('',(-0.303331899866,0.402229653786,0.689063186872)
  );
#39 = CARTESIAN_POINT('',(-0.262876987432,0.428052762457,0.699984489066)
  );
#40 = CARTESIAN_POINT('',(-0.209302101699,0.454225466334,0.711732025493)
  );
#41 = CARTESIAN_POINT('',(-0.198970967,0.458939784175,0.713884851006));
#42 = CARTESIAN_POINT('',(-0.188487135217,0.463392449202,0.715950588066)
  );
#43 = CARTESIAN_POINT('',(-0.177858585147,0.467576643046,0.717919910552)
  );
#44 = CARTESIAN_POINT('',(-0.167094070404,0.471485791471,0.719783801284)
  );
#45 = CARTESIAN_POINT('',(-0.156203119424,0.475113564382,0.721533552017)
  );
#46 = CARTESIAN_POINT('',(-0.123746522915,0.484963143152,0.726331711548)
  );
#47 = CARTESIAN_POINT('',(-0.101853772668,0.49038173108,0.729038171813)
  );
#48 = CARTESIAN_POINT('',(-7.959801805842E-02,0.494664164632,
    0.731218439328));
#49 = CARTESIAN_POINT('',(-5.706875932536E-02,0.497773431584,
    0.732821609734));
#50 = CARTESIAN_POINT('',(-3.436354213452E-02,0.499683676393,
    0.73381180871));
#51 = CARTESIAN_POINT('',(-1.158673610527E-02,0.500382894131,
    0.734172421452));
#52 = CARTESIAN_POINT('',(4.232623536864E-02,0.499180153818,
    0.73355098203));
#53 = CARTESIAN_POINT('',(7.343687390708E-02,0.496216771754,
    0.732020881368));
#54 = CARTESIAN_POINT('',(0.104197265096,0.490995296751,0.729333161326)
  );
#55 = CARTESIAN_POINT('',(0.134352323415,0.483585230317,0.725581524564)
  );
#56 = CARTESIAN_POINT('',(0.163684921417,0.474093844978,0.72091574729));
#57 = CARTESIAN_POINT('',(0.192016304031,0.462649456991,0.715515374827)
  );
#58 = CARTESIAN_POINT('',(0.262641737816,0.428200283721,0.700047109509)
  );
#59 = CARTESIAN_POINT('',(0.303133934985,0.402384259608,0.689123861202)
  );
#60 = CARTESIAN_POINT('',(0.340182311502,0.372464843101,0.677516083826)
  );
#61 = CARTESIAN_POINT('',(0.373430871401,0.338979835209,0.665964092956)
  );
#62 = CARTESIAN_POINT('',(0.402598392925,0.302451701392,0.655066498349)
  );
#63 = CARTESIAN_POINT('',(0.427469707136,0.263391664942,0.645295237838)
  );
#64 = CARTESIAN_POINT('',(0.462574041623,0.192663431394,0.631026479041)
  );
#65 = CARTESIAN_POINT('',(0.474950562149,0.161985935193,0.625820209765)
  );
#66 = CARTESIAN_POINT('',(0.48492943499,0.130455591908,0.621518693327));
#67 = CARTESIAN_POINT('',(0.492454281762,9.827788304011E-02,
    0.618223740209));
#68 = CARTESIAN_POINT('',(0.497484894798,6.566438345951E-02,
    0.616003999125));
#69 = CARTESIAN_POINT('',(0.499999996717,3.283163165759E-02,
    0.614894159993));
#70 = CARTESIAN_POINT('',(0.5,-1.887379141863E-15,0.614894156899));
#71 = ORIENTED_EDGE('',*,*,#72,.F.);
#72 = EDGE_CURVE('',#73,#24,#75,.T.);
#73 = VERTEX_POINT('',#74);
#74 = CARTESIAN_POINT('',(0.5,-3.053113317719E-16,-3.));
#75 = LINE('',#76,#77);
#76 = CARTESIAN_POINT('',(0.5,-2.334869823773E-16,-3.));
#77 = VECTOR('',#78,1.);
#78 = DIRECTION('',(0.,0.,1.));
#79 = ORIENTED_EDGE('',*,*,#80,.T.);
#80 = EDGE_CURVE('',#73,#73,#81,.T.);
#81 = CIRCLE('',#82,0.5);
#82 = AXIS2_PLACEMENT_3D('',#83,#84,#85);
#83 = CARTESIAN_POINT('',(0.,-1.110223024625E-16,-3.));
#84 = DIRECTION('',(0.,0.,1.));
#85 = DIRECTION('',(1.,0.,0.));
#86 = ORIENTED_EDGE('',*,*,#72,.T.);
#87 = ORIENTED_EDGE('',*,*,#88,.F.);
#88 = EDGE_CURVE('',#22,#24,#89,.T.);
#89 = B_SPLINE_CURVE_WITH_KNOTS('',6,(#90,#91,#92,#93,#94,#95,#96,#97,
    #98,#99,#100,#101,#102,#103,#104,#105,#106,#107,#108,#109,#110,#111,
    #112,#113,#114,#115,#116,#117,#118,#119,#120,#121),.UNSPECIFIED.,.F.
  ,.F.,(7,5,5,5,5,5,7),(0.,0.240663603492,0.334998368472,0.50001077611,
    0.645357378544,0.726031715354,1.),.UNSPECIFIED.);
#90 = CARTESIAN_POINT('',(-0.5,5.999999976858E-07,0.614894156899));
#91 = CARTESIAN_POINT('',(-0.500000072304,-6.02532683396E-02,
    0.614894161211));
#92 = CARTESIAN_POINT('',(-0.491286961936,-0.120577087352,0.614374601773
    ));
#93 = CARTESIAN_POINT('',(-0.473822118843,-0.179589222766,0.61333318453)
  );
#94 = CARTESIAN_POINT('',(-0.447763103864,-0.235887480117,0.611847431407
    ));
#95 = CARTESIAN_POINT('',(-0.413463773511,-0.288056699856,0.610076819312
    ));
#96 = CARTESIAN_POINT('',(-0.355070006729,-0.352886611338,0.607491661572
    ));
#97 = CARTESIAN_POINT('',(-0.337459366253,-0.370273498777,0.606750760713
    ));
#98 = CARTESIAN_POINT('',(-0.31873363158,-0.386688902751,0.606009525199)
  );
#99 = CARTESIAN_POINT('',(-0.298955462183,-0.402036148019,0.605281433456
    ));
#100 = CARTESIAN_POINT('',(-0.278197096037,-0.416224745316,
    0.604580065578));
#101 = CARTESIAN_POINT('',(-0.218654920433,-0.451816413613,
    0.602760775751));
#102 = CARTESIAN_POINT('',(-0.177977139852,-0.470684761834,
    0.601722966068));
#103 = CARTESIAN_POINT('',(-0.13506711959,-0.485228316842,0.600879825622
    ));
#104 = CARTESIAN_POINT('',(-9.060421519676E-02,-0.495068170425,
    0.60029322384));
#105 = CARTESIAN_POINT('',(-4.53312794531E-02,-0.5,0.6));
#106 = CARTESIAN_POINT('',(3.992880018414E-02,-0.5,0.6));
#107 = CARTESIAN_POINT('',(7.982526813619E-02,-0.496173828892,
    0.600227582334));
#108 = CARTESIAN_POINT('',(0.119170577879,-0.48853229877,0.6006828865));
#109 = CARTESIAN_POINT('',(0.157446473409,-0.477200447523,0.601343923351
    ));
#110 = CARTESIAN_POINT('',(0.194169446481,-0.462413823998,0.602172479359
    ));
#111 = CARTESIAN_POINT('',(0.24821586637,-0.434579941315,0.603645951896)
  );
#112 = CARTESIAN_POINT('',(0.266907766414,-0.423682575832,0.604208850083
    ));
#113 = CARTESIAN_POINT('',(0.284942663902,-0.411872658296,0.604800723127
    ));
#114 = CARTESIAN_POINT('',(0.302267906957,-0.399204768413,0.605413359105
    ));
#115 = CARTESIAN_POINT('',(0.318836142465,-0.385738084017,0.606038326494
    ));
#116 = CARTESIAN_POINT('',(0.388157084996,-0.323307708237,0.608801847948
    ));
#117 = CARTESIAN_POINT('',(0.432336489497,-0.266744598294,0.610973735323
    ));
#118 = CARTESIAN_POINT('',(0.466069651524,-0.204025133729,0.612870865256
    ));
#119 = CARTESIAN_POINT('',(0.488719418871,-0.137259005303,0.614221511219
    ));
#120 = CARTESIAN_POINT('',(0.499999993144,-6.855903970122E-02,
    0.614894156491));
#121 = CARTESIAN_POINT('',(0.5,-1.110223024625E-16,0.614894156899));
#122 = CYLINDRICAL_SURFACE('',#123,0.5);
#123 = AXIS2_PLACEMENT_3D('',#124,#125,#126);
#124 = CARTESIAN_POINT('',(0.,-1.110223024625E-16,-3.));
#125 = DIRECTION('',(0.,0.,1.));
#126 = DIRECTION('',(1.,0.,0.));
#127 = ADVANCED_FACE('',(#128),#164,.T.);
#128 = FACE_BOUND('',#129,.F.);
#129 = EDGE_LOOP('',(#130,#139,#148,#155,#156,#163));
#130 = ORIENTED_EDGE('',*,*,#131,.T.);
#131 = EDGE_CURVE('',#24,#132,#134,.T.);
#132 = VERTEX_POINT('',#133);
#133 = CARTESIAN_POINT('',(8.4,-8.326672684689E-17,9.));
#134 = CIRCLE('',#135,8.4);
#135 = AXIS2_PLACEMENT_3D('',#136,#137,#138);
#136 = CARTESIAN_POINT('',(0.,-1.110223024625E-16,9.));
#137 = DIRECTION('',(0.,-1.,2.22044604925E-16));
#138 = DIRECTION('',(1.,0.,0.));
#139 = ORIENTED_EDGE('',*,*,#140,.T.);
#140 = EDGE_CURVE('',#132,#141,#143,.T.);
#141 = VERTEX_POINT('',#142);
#142 = CARTESIAN_POINT('',(7.4,1.,9.));
#143 = CIRCLE('',#144,1.);
#144 = AXIS2_PLACEMENT_3D('',#145,#146,#147);
#145 = CARTESIAN_POINT('',(7.4,-1.110223024625E-16,9.));
#146 = DIRECTION('',(-0.,2.22044604925E-16,1.));
#147 = DIRECTION('',(1.,0.,0.));
#148 = ORIENTED_EDGE('',*,*,#149,.F.);
#149 = EDGE_CURVE('',#141,#141,#150,.T.);
#150 = CIRCLE('',#151,7.4);
#151 = AXIS2_PLACEMENT_3D('',#152,#153,#154);
#152 = CARTESIAN_POINT('',(0.,1.,9.));
#153 = DIRECTION('',(0.,-1.,2.22044604925E-16));
#154 = DIRECTION('',(1.,0.,0.));
#155 = ORIENTED_EDGE('',*,*,#140,.F.);
#156 = ORIENTED_EDGE('',*,*,#157,.T.);
#157 = EDGE_CURVE('',#132,#22,#158,.T.);
#158 = CIRCLE('',#159,8.4);
#159 = AXIS2_PLACEMENT_3D('',#160,#161,#162);
#160 = CARTESIAN_POINT('',(0.,-1.110223024625E-16,9.));
#161 = DIRECTION('',(0.,-1.,2.22044604925E-16));
#162 = DIRECTION('',(1.,0.,0.));
#163 = ORIENTED_EDGE('',*,*,#21,.T.);
#164 = TOROIDAL_SURFACE('',#165,7.4,1.);
#165 = AXIS2_PLACEMENT_3D('',#166,#167,#168);
#166 = CARTESIAN_POINT('',(0.,-1.110223024625E-16,9.));
#167 = DIRECTION('',(-0.,1.,-2.22044604925E-16));
#168 = DIRECTION('',(1.,0.,0.));
#169 = ADVANCED_FACE('',(#170),#252,.T.);
#170 = FACE_BOUND('',#171,.T.);
#171 = EDGE_LOOP('',(#172,#173,#181,#190,#200,#242,#249,#250,#251));
#172 = ORIENTED_EDGE('',*,*,#131,.T.);
#173 = ORIENTED_EDGE('',*,*,#174,.T.);
#174 = EDGE_CURVE('',#132,#175,#177,.T.);
#175 = VERTEX_POINT('',#176);
#176 = CARTESIAN_POINT('',(8.4,-7.2,9.));
#177 = LINE('',#178,#179);
#178 = CARTESIAN_POINT('',(8.4,1.,9.));
#179 = VECTOR('',#180,1.);
#180 = DIRECTION('',(0.,-1.,2.22044604925E-16));
#181 = ORIENTED_EDGE('',*,*,#182,.F.);
#182 = EDGE_CURVE('',#183,#175,#185,.T.);
#183 = VERTEX_POINT('',#184);
#184 = CARTESIAN_POINT('',(0.489897948557,-7.2,0.614297882705));
#185 = CIRCLE('',#186,8.4);
#186 = AXIS2_PLACEMENT_3D('',#187,#188,#189);
#187 = CARTESIAN_POINT('',(0.,-7.2,9.));
#188 = DIRECTION('',(0.,-1.,2.22044604925E-16));
#189 = DIRECTION('',(1.,0.,0.));
#190 = ORIENTED_EDGE('',*,*,#191,.T.);
#191 = EDGE_CURVE('',#183,#192,#194,.T.);
#192 = VERTEX_POINT('',#193);
#193 = CARTESIAN_POINT('',(0.5,-7.1,0.614894156899));
#194 = B_SPLINE_CURVE_WITH_KNOTS('',4,(#195,#196,#197,#198,#199),
  .UNSPECIFIED.,.F.,.F.,(5,5),(0.,1.),.PIECEWISE_BEZIER_KNOTS.);
#195 = CARTESIAN_POINT('',(0.489897826082,-7.2000006,0.61429787555));
#196 = CARTESIAN_POINT('',(0.494942817724,-7.175285443909,0.614592607035
    ));
#197 = CARTESIAN_POINT('',(0.498314336423,-7.150284583747,0.614793638323
    ));
#198 = CARTESIAN_POINT('',(0.499999997486,-7.12514235556,0.614894156749)
  );
#199 = CARTESIAN_POINT('',(0.5,-7.1,0.614894156899));
#200 = ORIENTED_EDGE('',*,*,#201,.T.);
#201 = EDGE_CURVE('',#192,#202,#204,.T.);
#202 = VERTEX_POINT('',#203);
#203 = CARTESIAN_POINT('',(-0.489897948557,-7.2,0.614297882705));
#204 = B_SPLINE_CURVE_WITH_KNOTS('',6,(#205,#206,#207,#208,#209,#210,
    #211,#212,#213,#214,#215,#216,#217,#218,#219,#220,#221,#222,#223,
    #224,#225,#226,#227,#228,#229,#230,#231,#232,#233,#234,#235,#236,
    #237,#238,#239,#240,#241),.UNSPECIFIED.,.F.,.F.,(7,5,5,5,5,5,5,7),(
    0.,0.256659104483,0.330303722402,0.468616379652,0.604309528081,
    0.679720788495,0.937456274054,1.),.UNSPECIFIED.);
#205 = CARTESIAN_POINT('',(0.5,-7.1,0.614894156899));
#206 = CARTESIAN_POINT('',(0.499999993147,-7.031472871242,0.614894156491
    ));
#207 = CARTESIAN_POINT('',(0.488729917177,-6.962805074902,0.614222137171
    ));
#208 = CARTESIAN_POINT('',(0.46610135075,-6.896068367409,0.612872755714)
  );
#209 = CARTESIAN_POINT('',(0.432399471561,-6.833372498134,0.610977277749
    ));
#210 = CARTESIAN_POINT('',(0.388260116084,-6.776824169572,0.608806911719
    ));
#211 = CARTESIAN_POINT('',(0.319402345343,-6.7147606922,0.606060625815)
  );
#212 = CARTESIAN_POINT('',(0.303291750408,-6.701620050692,0.6054517675)
  );
#213 = CARTESIAN_POINT('',(0.286461819046,-6.689235244874,0.604854338397
    ));
#214 = CARTESIAN_POINT('',(0.268956026677,-6.677660976653,0.60427612752)
  );
#215 = CARTESIAN_POINT('',(0.250822615039,-6.666947864341,0.603724738115
    ));
#216 = CARTESIAN_POINT('',(0.196978876563,-6.638726786952,0.602236322445
    ));
#217 = CARTESIAN_POINT('',(0.159789978236,-6.623498965279,0.60138471974)
  );
#218 = CARTESIAN_POINT('',(0.120978189455,-6.611821607862,0.600703977887
    ));
#219 = CARTESIAN_POINT('',(8.104793024961E-02,-6.603944397141,
    0.600234607244));
#220 = CARTESIAN_POINT('',(4.054102849807E-02,-6.6,0.6));
#221 = CARTESIAN_POINT('',(-3.977322037456E-02,-6.6,0.6));
#222 = CARTESIAN_POINT('',(-7.951512174213E-02,-6.603796417329,
    0.600225816863));
#223 = CARTESIAN_POINT('',(-0.118712501536,-6.611378821476,
    0.600677589954));
#224 = CARTESIAN_POINT('',(-0.156852694533,-6.622624093169,0.60133368201
    ));
#225 = CARTESIAN_POINT('',(-0.193457168642,-6.637300057293,
    0.602156444418));
#226 = CARTESIAN_POINT('',(-0.247376224705,-6.664944242981,
    0.603621240834));
#227 = CARTESIAN_POINT('',(-0.266043182431,-6.67577831576,0.604181491592
    ));
#228 = CARTESIAN_POINT('',(-0.284058307808,-6.687521837104,
    0.604770818033));
#229 = CARTESIAN_POINT('',(-0.301369159841,-6.700120725898,
    0.605381078725));
#230 = CARTESIAN_POINT('',(-0.317928542598,-6.71351631695,0.606003907538
    ));
#231 = CARTESIAN_POINT('',(-0.387578341737,-6.775934648364,0.60877296898
    ));
#232 = CARTESIAN_POINT('',(-0.432033444369,-6.832646302293,
    0.610956118184));
#233 = CARTESIAN_POINT('',(-0.465968972679,-6.895577514616,0.61286454561
    ));
#234 = CARTESIAN_POINT('',(-0.488738229185,-6.96259459927,0.614222633933
    ));
#235 = CARTESIAN_POINT('',(-0.50005147064,-7.03156007284,0.614897226069)
  );
#236 = CARTESIAN_POINT('',(-0.499987335058,-7.117074066738,
    0.614893401695));
#237 = CARTESIAN_POINT('',(-0.499305563506,-7.133772662646,
    0.614852746728));
#238 = CARTESIAN_POINT('',(-0.497954516771,-7.150442854356,
    0.614772189877));
#239 = CARTESIAN_POINT('',(-0.495934992244,-7.167056503657,
    0.614652184399));
#240 = CARTESIAN_POINT('',(-0.493248612658,-7.183585267901,
    0.614493630543));
#241 = CARTESIAN_POINT('',(-0.489897826082,-7.2000006,0.61429787555));
#242 = ORIENTED_EDGE('',*,*,#243,.F.);
#243 = EDGE_CURVE('',#175,#202,#244,.T.);
#244 = CIRCLE('',#245,8.4);
#245 = AXIS2_PLACEMENT_3D('',#246,#247,#248);
#246 = CARTESIAN_POINT('',(0.,-7.2,9.));
#247 = DIRECTION('',(0.,-1.,2.22044604925E-16));
#248 = DIRECTION('',(1.,0.,0.));
#249 = ORIENTED_EDGE('',*,*,#174,.F.);
#250 = ORIENTED_EDGE('',*,*,#157,.T.);
#251 = ORIENTED_EDGE('',*,*,#88,.T.);
#252 = CYLINDRICAL_SURFACE('',#253,8.4);
#253 = AXIS2_PLACEMENT_3D('',#254,#255,#256);
#254 = CARTESIAN_POINT('',(0.,1.,9.));
#255 = DIRECTION('',(0.,-1.,2.22044604925E-16));
#256 = DIRECTION('',(1.,0.,0.));
#257 = ADVANCED_FACE('',(#258),#261,.F.);
#258 = FACE_BOUND('',#259,.T.);
#259 = EDGE_LOOP('',(#260));
#260 = ORIENTED_EDGE('',*,*,#80,.F.);
#261 = PLANE('',#262);
#262 = AXIS2_PLACEMENT_3D('',#263,#264,#265);
#263 = CARTESIAN_POINT('',(0.,-1.110223024625E-16,-3.));
#264 = DIRECTION('',(0.,0.,1.));
#265 = DIRECTION('',(1.,0.,0.));
#266 = ADVANCED_FACE('',(#267,#270),#281,.F.);
#267 = FACE_BOUND('',#268,.F.);
#268 = EDGE_LOOP('',(#269));
#269 = ORIENTED_EDGE('',*,*,#149,.T.);
#270 = FACE_BOUND('',#271,.F.);
#271 = EDGE_LOOP('',(#272));
#272 = ORIENTED_EDGE('',*,*,#273,.F.);
#273 = EDGE_CURVE('',#274,#274,#276,.T.);
#274 = VERTEX_POINT('',#275);
#275 = CARTESIAN_POINT('',(5.,1.,9.));
#276 = CIRCLE('',#277,5.);
#277 = AXIS2_PLACEMENT_3D('',#278,#279,#280);
#278 = CARTESIAN_POINT('',(0.,1.,9.));
#279 = DIRECTION('',(0.,-1.,2.22044604925E-16));
#280 = DIRECTION('',(1.,0.,0.));
#281 = PLANE('',#282);
#282 = AXIS2_PLACEMENT_3D('',#283,#284,#285);
#283 = CARTESIAN_POINT('',(0.,1.,9.));
#284 = DIRECTION('',(0.,-1.,2.22044604925E-16));
#285 = DIRECTION('',(1.,0.,0.));
#286 = ADVANCED_FACE('',(#287),#343,.T.);
#287 = FACE_BOUND('',#288,.T.);
#288 = EDGE_LOOP('',(#289,#290,#299,#306,#307,#308));
#289 = ORIENTED_EDGE('',*,*,#182,.T.);
#290 = ORIENTED_EDGE('',*,*,#291,.T.);
#291 = EDGE_CURVE('',#175,#292,#294,.T.);
#292 = VERTEX_POINT('',#293);
#293 = CARTESIAN_POINT('',(7.4,-8.2,9.));
#294 = CIRCLE('',#295,1.);
#295 = AXIS2_PLACEMENT_3D('',#296,#297,#298);
#296 = CARTESIAN_POINT('',(7.4,-7.2,9.));
#297 = DIRECTION('',(0.,-2.22044604925E-16,-1.));
#298 = DIRECTION('',(1.,0.,0.));
#299 = ORIENTED_EDGE('',*,*,#300,.F.);
#300 = EDGE_CURVE('',#292,#292,#301,.T.);
#301 = CIRCLE('',#302,7.4);
#302 = AXIS2_PLACEMENT_3D('',#303,#304,#305);
#303 = CARTESIAN_POINT('',(0.,-8.2,9.));
#304 = DIRECTION('',(0.,-1.,2.22044604925E-16));
#305 = DIRECTION('',(1.,0.,0.));
#306 = ORIENTED_EDGE('',*,*,#291,.F.);
#307 = ORIENTED_EDGE('',*,*,#243,.T.);
#308 = ORIENTED_EDGE('',*,*,#309,.T.);
#309 = EDGE_CURVE('',#202,#183,#310,.T.);
#310 = B_SPLINE_CURVE_WITH_KNOTS('',7,(#311,#312,#313,#314,#315,#316,
    #317,#318,#319,#320,#321,#322,#323,#324,#325,#326,#327,#328,#329,
    #330,#331,#332,#333,#334,#335,#336,#337,#338,#339,#340,#341,#342),
  .UNSPECIFIED.,.F.,.F.,(8,6,6,6,6,8),(0.,0.33243385784,0.392776520533,
    0.502119910645,0.665691572832,1.),.UNSPECIFIED.);
#311 = CARTESIAN_POINT('',(-0.489897948557,-7.2,0.614297882705));
#312 = CARTESIAN_POINT('',(-0.4774298238,-7.26108105561,0.613569493225)
  );
#313 = CARTESIAN_POINT('',(-0.456023092131,-7.320610785896,0.6167004558)
  );
#314 = CARTESIAN_POINT('',(-0.425828379996,-7.377155102224,
    0.623357415372));
#315 = CARTESIAN_POINT('',(-0.387219176527,-7.429246467021,
    0.632785927512));
#316 = CARTESIAN_POINT('',(-0.340840620588,-7.475449988927,
    0.643842006801));
#317 = CARTESIAN_POINT('',(-0.287570855725,-7.514348272551,
    0.654892373621));
#318 = CARTESIAN_POINT('',(-0.218024246973,-7.550121974712,0.666122206)
  );
#319 = CARTESIAN_POINT('',(-0.207158364285,-7.555332484101,
    0.667796153282));
#320 = CARTESIAN_POINT('',(-0.196119982471,-7.560249341626,
    0.669409285731));
#321 = CARTESIAN_POINT('',(-0.184918778667,-7.564864699634,
    0.670952461533));
#322 = CARTESIAN_POINT('',(-0.173565240948,-7.569171073243,
    0.672416908419));
#323 = CARTESIAN_POINT('',(-0.162070668331,-7.573161340342,
    0.673794223672));
#324 = CARTESIAN_POINT('',(-0.129384914446,-7.583474223705,
    0.677399683536));
#325 = CARTESIAN_POINT('',(-0.107897868333,-7.589060270254,
    0.679411080375));
#326 = CARTESIAN_POINT('',(-8.606063467097E-02,-7.593546542859,
    0.681063378227));
#327 = CARTESIAN_POINT('',(-6.395503385736E-02,-7.596900254389,
    0.682317591174));
#328 = CARTESIAN_POINT('',(-4.166905488546E-02,-7.599098034208,
    0.683145621943));
#329 = CARTESIAN_POINT('',(-1.929580579528E-02,-7.600127793423,
    0.683532950058));
#330 = CARTESIAN_POINT('',(3.65218577715E-02,-7.599785341607,
    0.683404084272));
#331 = CARTESIAN_POINT('',(6.995953293475E-02,-7.59696861234,
    0.682344453904));
#332 = CARTESIAN_POINT('',(0.103049000121,-7.591542558607,0.680304564053
    ));
#333 = CARTESIAN_POINT('',(0.135487130895,-7.583578656264,0.677367213906
    ));
#334 = CARTESIAN_POINT('',(0.167008469287,-7.573195655372,0.673676472362
    ));
#335 = CARTESIAN_POINT('',(0.197387859282,-7.560542689331,0.669412744966
    ));
#336 = CARTESIAN_POINT('',(0.285806108544,-7.515630901437,0.6552577081)
  );
#337 = CARTESIAN_POINT('',(0.339560370026,-7.476721483394,0.644147223057
    ));
#338 = CARTESIAN_POINT('',(0.386367064852,-7.430393525061,0.632994091874
    ));
#339 = CARTESIAN_POINT('',(0.425328792083,-7.378088974174,0.62346771026)
  );
#340 = CARTESIAN_POINT('',(0.45578688993,-7.321266443874,0.616735110286)
  );
#341 = CARTESIAN_POINT('',(0.477361065519,-7.261417900846,0.613565476357
    ));
#342 = CARTESIAN_POINT('',(0.489897948557,-7.2,0.614297882705));
#343 = TOROIDAL_SURFACE('',#344,7.4,1.);
#344 = AXIS2_PLACEMENT_3D('',#345,#346,#347);
#345 = CARTESIAN_POINT('',(0.,-7.2,9.));
#346 = DIRECTION('',(0.,-1.,2.22044604925E-16));
#347 = DIRECTION('',(1.,0.,0.));
#348 = ADVANCED_FACE('',(#349),#370,.T.);
#349 = FACE_BOUND('',#350,.T.);
#350 = EDGE_LOOP('',(#351,#352,#360,#367,#368,#369));
#351 = ORIENTED_EDGE('',*,*,#201,.F.);
#352 = ORIENTED_EDGE('',*,*,#353,.F.);
#353 = EDGE_CURVE('',#354,#192,#356,.T.);
#354 = VERTEX_POINT('',#355);
#355 = CARTESIAN_POINT('',(0.5,-7.1,-3.));
#356 = LINE('',#357,#358);
#357 = CARTESIAN_POINT('',(0.5,-7.1,-3.));
#358 = VECTOR('',#359,1.);
#359 = DIRECTION('',(0.,0.,1.));
#360 = ORIENTED_EDGE('',*,*,#361,.T.);
#361 = EDGE_CURVE('',#354,#354,#362,.T.);
#362 = CIRCLE('',#363,0.5);
#363 = AXIS2_PLACEMENT_3D('',#364,#365,#366);
#364 = CARTESIAN_POINT('',(0.,-7.1,-3.));
#365 = DIRECTION('',(0.,0.,1.));
#366 = DIRECTION('',(1.,0.,0.));
#367 = ORIENTED_EDGE('',*,*,#353,.T.);
#368 = ORIENTED_EDGE('',*,*,#191,.F.);
#369 = ORIENTED_EDGE('',*,*,#309,.F.);
#370 = CYLINDRICAL_SURFACE('',#371,0.5);
#371 = AXIS2_PLACEMENT_3D('',#372,#373,#374);
#372 = CARTESIAN_POINT('',(0.,-7.1,-3.));
#373 = DIRECTION('',(0.,0.,1.));
#374 = DIRECTION('',(1.,0.,0.));
#375 = ADVANCED_FACE('',(#376),#396,.T.);
#376 = FACE_BOUND('',#377,.F.);
#377 = EDGE_LOOP('',(#378,#387,#388,#389));
#378 = ORIENTED_EDGE('',*,*,#379,.F.);
#379 = EDGE_CURVE('',#274,#380,#382,.T.);
#380 = VERTEX_POINT('',#381);
#381 = CARTESIAN_POINT('',(4.,-8.326672684689E-17,9.));
#382 = CIRCLE('',#383,1.);
#383 = AXIS2_PLACEMENT_3D('',#384,#385,#386);
#384 = CARTESIAN_POINT('',(5.,-1.110223024625E-16,9.));
#385 = DIRECTION('',(-0.,2.22044604925E-16,1.));
#386 = DIRECTION('',(1.,0.,0.));
#387 = ORIENTED_EDGE('',*,*,#273,.T.);
#388 = ORIENTED_EDGE('',*,*,#379,.T.);
#389 = ORIENTED_EDGE('',*,*,#390,.F.);
#390 = EDGE_CURVE('',#380,#380,#391,.T.);
#391 = CIRCLE('',#392,4.);
#392 = AXIS2_PLACEMENT_3D('',#393,#394,#395);
#393 = CARTESIAN_POINT('',(0.,-1.110223024625E-16,9.));
#394 = DIRECTION('',(0.,-1.,2.22044604925E-16));
#395 = DIRECTION('',(1.,0.,0.));
#396 = TOROIDAL_SURFACE('',#397,5.,1.);
#397 = AXIS2_PLACEMENT_3D('',#398,#399,#400);
#398 = CARTESIAN_POINT('',(0.,-1.110223024625E-16,9.));
#399 = DIRECTION('',(-0.,1.,-2.22044604925E-16));
#400 = DIRECTION('',(1.,0.,0.));
#401 = ADVANCED_FACE('',(#402,#405),#416,.T.);
#402 = FACE_BOUND('',#403,.T.);
#403 = EDGE_LOOP('',(#404));
#404 = ORIENTED_EDGE('',*,*,#300,.T.);
#405 = FACE_BOUND('',#406,.T.);
#406 = EDGE_LOOP('',(#407));
#407 = ORIENTED_EDGE('',*,*,#408,.F.);
#408 = EDGE_CURVE('',#409,#409,#411,.T.);
#409 = VERTEX_POINT('',#410);
#410 = CARTESIAN_POINT('',(5.,-8.2,9.));
#411 = CIRCLE('',#412,5.);
#412 = AXIS2_PLACEMENT_3D('',#413,#414,#415);
#413 = CARTESIAN_POINT('',(0.,-8.2,9.));
#414 = DIRECTION('',(0.,-1.,2.22044604925E-16));
#415 = DIRECTION('',(1.,0.,0.));
#416 = PLANE('',#417);
#417 = AXIS2_PLACEMENT_3D('',#418,#419,#420);
#418 = CARTESIAN_POINT('',(0.,-8.2,9.));
#419 = DIRECTION('',(0.,-1.,2.22044604925E-16));
#420 = DIRECTION('',(1.,0.,0.));
#421 = ADVANCED_FACE('',(#422),#425,.F.);
#422 = FACE_BOUND('',#423,.T.);
#423 = EDGE_LOOP('',(#424));
#424 = ORIENTED_EDGE('',*,*,#361,.F.);
#425 = PLANE('',#426);
#426 = AXIS2_PLACEMENT_3D('',#427,#428,#429);
#427 = CARTESIAN_POINT('',(0.,-7.1,-3.));
#428 = DIRECTION('',(0.,0.,1.));
#429 = DIRECTION('',(1.,0.,0.));
#430 = ADVANCED_FACE('',(#431),#450,.F.);
#431 = FACE_BOUND('',#432,.F.);
#432 = EDGE_LOOP('',(#433,#441,#448,#449));
#433 = ORIENTED_EDGE('',*,*,#434,.T.);
#434 = EDGE_CURVE('',#380,#435,#437,.T.);
#435 = VERTEX_POINT('',#436);
#436 = CARTESIAN_POINT('',(4.,-7.2,9.));
#437 = LINE('',#438,#439);
#438 = CARTESIAN_POINT('',(4.,1.,9.));
#439 = VECTOR('',#440,1.);
#440 = DIRECTION('',(0.,-1.,2.22044604925E-16));
#441 = ORIENTED_EDGE('',*,*,#442,.F.);
#442 = EDGE_CURVE('',#435,#435,#443,.T.);
#443 = CIRCLE('',#444,4.);
#444 = AXIS2_PLACEMENT_3D('',#445,#446,#447);
#445 = CARTESIAN_POINT('',(0.,-7.2,9.));
#446 = DIRECTION('',(0.,-1.,2.22044604925E-16));
#447 = DIRECTION('',(1.,0.,0.));
#448 = ORIENTED_EDGE('',*,*,#434,.F.);
#449 = ORIENTED_EDGE('',*,*,#390,.T.);
#450 = CYLINDRICAL_SURFACE('',#451,4.);
#451 = AXIS2_PLACEMENT_3D('',#452,#453,#454);
#452 = CARTESIAN_POINT('',(0.,1.,9.));
#453 = DIRECTION('',(0.,-1.,2.22044604925E-16));
#454 = DIRECTION('',(1.,0.,0.));
#455 = ADVANCED_FACE('',(#456),#468,.T.);
#456 = FACE_BOUND('',#457,.T.);
#457 = EDGE_LOOP('',(#458,#465,#466,#467));
#458 = ORIENTED_EDGE('',*,*,#459,.F.);
#459 = EDGE_CURVE('',#409,#435,#460,.T.);
#460 = CIRCLE('',#461,1.);
#461 = AXIS2_PLACEMENT_3D('',#462,#463,#464);
#462 = CARTESIAN_POINT('',(5.,-7.2,9.));
#463 = DIRECTION('',(0.,-2.22044604925E-16,-1.));
#464 = DIRECTION('',(1.,0.,0.));
#465 = ORIENTED_EDGE('',*,*,#408,.T.);
#466 = ORIENTED_EDGE('',*,*,#459,.T.);
#467 = ORIENTED_EDGE('',*,*,#442,.F.);
#468 = TOROIDAL_SURFACE('',#469,5.,1.);
#469 = AXIS2_PLACEMENT_3D('',#470,#471,#472);
#470 = CARTESIAN_POINT('',(0.,-7.2,9.));
#471 = DIRECTION('',(0.,-1.,2.22044604925E-16));
#472 = DIRECTION('',(1.,0.,0.));
#473 = ( GEOMETRIC_REPRESENTATION_CONTEXT(3) 
GLOBAL_UNCERTAINTY_ASSIGNED_CONTEXT((#477)) GLOBAL_UNIT_ASSIGNED_CONTEXT
((#474,#475,#476)) REPRESENTATION_CONTEXT('Context #1',
  '3D Context with UNIT and UNCERTAINTY') );
#474 = ( LENGTH_UNIT() NAMED_UNIT(*) SI_UNIT(.MILLI.,.METRE.) );
#475 = ( NAMED_UNIT(*) PLANE_ANGLE_UNIT() SI_UNIT($,.RADIAN.) );
#476 = ( NAMED_UNIT(*) SI_UNIT($,.STERADIAN.) SOLID_ANGLE_UNIT() );
#477 = UNCERTAINTY_MEASURE_WITH_UNIT(LENGTH_MEASURE(1.E-07),#474,
  'distance_accuracy_value','confusion accuracy');
#478 = PRODUCT_RELATED_PRODUCT_CATEGORY('part',$,(#7));
#479 = MECHANICAL_DESIGN_GEOMETRIC_PRESENTATION_REPRESENTATION('',(#480,
    #488,#496,#503,#510,#517,#524,#531,#538,#545,#552,#559),#473);
#480 = STYLED_ITEM('color',(#481),#17);
#481 = PRESENTATION_STYLE_ASSIGNMENT((#482));
#482 = SURFACE_STYLE_USAGE(.BOTH.,#483);
#483 = SURFACE_SIDE_STYLE('',(#484));
#484 = SURFACE_STYLE_FILL_AREA(#485);
#485 = FILL_AREA_STYLE('',(#486));
#486 = FILL_AREA_STYLE_COLOUR('',#487);
#487 = COLOUR_RGB('',0.800000011921,0.800000011921,0.800000011921);
#488 = STYLED_ITEM('color',(#489),#127);
#489 = PRESENTATION_STYLE_ASSIGNMENT((#490));
#490 = SURFACE_STYLE_USAGE(.BOTH.,#491);
#491 = SURFACE_SIDE_STYLE('',(#492));
#492 = SURFACE_STYLE_FILL_AREA(#493);
#493 = FILL_AREA_STYLE('',(#494));
#494 = FILL_AREA_STYLE_COLOUR('',#495);
#495 = COLOUR_RGB('',0.560784339905,0.349019616842,7.843137718737E-03);
#496 = STYLED_ITEM('color',(#497),#169);
#497 = PRESENTATION_STYLE_ASSIGNMENT((#498));
#498 = SURFACE_STYLE_USAGE(.BOTH.,#499);
#499 = SURFACE_SIDE_STYLE('',(#500));
#500 = SURFACE_STYLE_FILL_AREA(#501);
#501 = FILL_AREA_STYLE('',(#502));
#502 = FILL_AREA_STYLE_COLOUR('',#495);
#503 = STYLED_ITEM('color',(#504),#257);
#504 = PRESENTATION_STYLE_ASSIGNMENT((#505));
#505 = SURFACE_STYLE_USAGE(.BOTH.,#506);
#506 = SURFACE_SIDE_STYLE('',(#507));
#507 = SURFACE_STYLE_FILL_AREA(#508);
#508 = FILL_AREA_STYLE('',(#509));
#509 = FILL_AREA_STYLE_COLOUR('',#487);
#510 = STYLED_ITEM('color',(#511),#266);
#511 = PRESENTATION_STYLE_ASSIGNMENT((#512));
#512 = SURFACE_STYLE_USAGE(.BOTH.,#513);
#513 = SURFACE_SIDE_STYLE('',(#514));
#514 = SURFACE_STYLE_FILL_AREA(#515);
#515 = FILL_AREA_STYLE('',(#516));
#516 = FILL_AREA_STYLE_COLOUR('',#495);
#517 = STYLED_ITEM('color',(#518),#286);
#518 = PRESENTATION_STYLE_ASSIGNMENT((#519));
#519 = SURFACE_STYLE_USAGE(.BOTH.,#520);
#520 = SURFACE_SIDE_STYLE('',(#521));
#521 = SURFACE_STYLE_FILL_AREA(#522);
#522 = FILL_AREA_STYLE('',(#523));
#523 = FILL_AREA_STYLE_COLOUR('',#495);
#524 = STYLED_ITEM('color',(#525),#348);
#525 = PRESENTATION_STYLE_ASSIGNMENT((#526));
#526 = SURFACE_STYLE_USAGE(.BOTH.,#527);
#527 = SURFACE_SIDE_STYLE('',(#528));
#528 = SURFACE_STYLE_FILL_AREA(#529);
#529 = FILL_AREA_STYLE('',(#530));
#530 = FILL_AREA_STYLE_COLOUR('',#487);
#531 = STYLED_ITEM('color',(#532),#375);
#532 = PRESENTATION_STYLE_ASSIGNMENT((#533));
#533 = SURFACE_STYLE_USAGE(.BOTH.,#534);
#534 = SURFACE_SIDE_STYLE('',(#535));
#535 = SURFACE_STYLE_FILL_AREA(#536);
#536 = FILL_AREA_STYLE('',(#537));
#537 = FILL_AREA_STYLE_COLOUR('',#495);
#538 = STYLED_ITEM('color',(#539),#401);
#539 = PRESENTATION_STYLE_ASSIGNMENT((#540));
#540 = SURFACE_STYLE_USAGE(.BOTH.,#541);
#541 = SURFACE_SIDE_STYLE('',(#542));
#542 = SURFACE_STYLE_FILL_AREA(#543);
#543 = FILL_AREA_STYLE('',(#544));
#544 = FILL_AREA_STYLE_COLOUR('',#495);
#545 = STYLED_ITEM('color',(#546),#421);
#546 = PRESENTATION_STYLE_ASSIGNMENT((#547));
#547 = SURFACE_STYLE_USAGE(.BOTH.,#548);
#548 = SURFACE_SIDE_STYLE('',(#549));
#549 = SURFACE_STYLE_FILL_AREA(#550);
#550 = FILL_AREA_STYLE('',(#551));
#551 = FILL_AREA_STYLE_COLOUR('',#487);
#552 = STYLED_ITEM('color',(#553),#430);
#553 = PRESENTATION_STYLE_ASSIGNMENT((#554));
#554 = SURFACE_STYLE_USAGE(.BOTH.,#555);
#555 = SURFACE_SIDE_STYLE('',(#556));
#556 = SURFACE_STYLE_FILL_AREA(#557);
#557 = FILL_AREA_STYLE('',(#558));
#558 = FILL_AREA_STYLE_COLOUR('',#495);
#559 = STYLED_ITEM('color',(#560),#455);
#560 = PRESENTATION_STYLE_ASSIGNMENT((#561));
#561 = SURFACE_STYLE_USAGE(.BOTH.,#562);
#562 = SURFACE_SIDE_STYLE('',(#563));
#563 = SURFACE_STYLE_FILL_AREA(#564);
#564 = FILL_AREA_STYLE('',(#565));
#565 = FILL_AREA_STYLE_COLOUR('',#495);
ENDSEC;
END-ISO-10303-21;
