(module Elko_vert_11.2x6.3mm_RM2.5_CopperClear (layer F.Cu) (tedit 5FD9478E)
  (descr "Electrolytic Capacitor, vertical, diameter 6,3mm, RM 2,5mm, CopperClear, radial,")
  (tags "Electrolytic Capacitor, vertical, diameter 6,3mm, RM 2,5mm, Elko, Electrolytkondensator, Kondensator gepolt, Durchmesser 6,3mm, CopperClear, radial,")
  (fp_text reference REF** (at 1.27 -5.08) (layer F.SilkS)
    (effects (font (size 1 1) (thickness 0.15)))
  )
  (fp_text value Elko_vert_11.2x6.3mm_RM2.5_CopperClear (at 1.27 5.08) (layer F.Fab)
    (effects (font (size 1 1) (thickness 0.15)))
  )
  (fp_circle (center 1.27 0) (end 4.4196 0) (layer F.SilkS) (width 0.15))
  (fp_line (start 0.26924 -1.30048) (end 0.26924 -1.19888) (layer F.SilkS) (width 0.15))
  (fp_line (start 0.26924 -1.69926) (end 0.26924 -1.30048) (layer F.SilkS) (width 0.15))
  (fp_line (start -0.23114 -1.69926) (end 0.26924 -1.69926) (layer F.SilkS) (width 0.15))
  (fp_line (start 0.26924 -1.69926) (end 0.26924 -2.19964) (layer F.SilkS) (width 0.15))
  (fp_line (start 0.26924 -1.69926) (end 0.76962 -1.69926) (layer F.SilkS) (width 0.15))
  (pad 2 thru_hole oval (at 2.54 0) (size 1.5 2) (drill 0.8001) (layers *.Cu *.Mask))
  (pad 1 thru_hole rect (at 0 0) (size 1.5 2) (drill 0.8001) (layers *.Cu *.Mask))
  (model Capacitors_Elko_ThroughHole.3dshapes/Elko_vert_11.2x6.3mm_RM2.5_CopperClear.wrl
    (at (xyz 0 0 0))
    (scale (xyz 1 1 1))
    (rotate (xyz 0 0 0))
  )
)
