(footprint "Pin_1x10_D1.1mm_P5.00" (version 20221018) (generator pcbnew)
  (layer "F.Cu")
  (descr "Pin_1x10_D1.1mm_P5.00")
  (tags "solder Pin")
  (attr through_hole)
  (fp_text reference "REF**" (at 0 2.1) (layer "F.SilkS")
      (effects (font (size 1 1) (thickness 0.15)))
    (tstamp 245dd7d8-567f-4171-b794-8e7eef0f45d4)
  )
  (fp_text value "Pin_1x10_D1.1mm_P5.00" (at 7.75 -2.5) (layer "F.Fab")
      (effects (font (size 1 1) (thickness 0.15)))
    (tstamp f4c08e87-af81-4031-a307-849587b41d24)
  )
  (fp_text user "${REFERENCE}" (at 8.75 2.25) (layer "F.Fab")
      (effects (font (size 1 1) (thickness 0.15)))
    (tstamp 591badc1-778b-4064-be00-4c7c2eda0ccb)
  )
  (fp_text user "${REFERENCE}" (at 8.75 2.25) (layer "F.Fab")
      (effects (font (size 1 1) (thickness 0.15)))
    (tstamp b556da42-fdbd-49f7-ab1e-47ac8d8b824a)
  )
  (fp_line (start -1.75 -1.3) (end -1.75 1.3)
    (stroke (width 0.12) (type default)) (layer "F.SilkS") (tstamp 9ebf6b7e-6993-4317-85c9-9e97b85e3c18))
  (fp_line (start -1.75 -1.3) (end 46.75 -1.3)
    (stroke (width 0.12) (type solid)) (layer "F.SilkS") (tstamp 5485102a-ab20-436d-884c-843bbc811d38))
  (fp_line (start -1.75 1.3) (end 46.75 1.3)
    (stroke (width 0.12) (type solid)) (layer "F.SilkS") (tstamp f8d4ef1b-43f2-4512-86e9-a0fd9c4c1130))
  (fp_line (start 46.75 -1.3) (end 46.75 1.3)
    (stroke (width 0.12) (type default)) (layer "F.SilkS") (tstamp 1742c7aa-694a-492e-b65a-ab24c5f30b1b))
  (fp_line (start -2 -1.6) (end -2 1.6)
    (stroke (width 0.05) (type default)) (layer "F.CrtYd") (tstamp b9ab2b1c-ed14-42f5-b985-e6cc4a32a6fa))
  (fp_line (start -2 -1.6) (end 47 -1.6)
    (stroke (width 0.05) (type solid)) (layer "F.CrtYd") (tstamp 9159ea0a-8c55-4e81-b746-52eba2dedfa2))
  (fp_line (start 47 -1.6) (end 47 1.6)
    (stroke (width 0.05) (type default)) (layer "F.CrtYd") (tstamp d407bb33-5047-4268-8071-4d1a43486a22))
  (fp_line (start 47 1.6) (end -2 1.6)
    (stroke (width 0.05) (type solid)) (layer "F.CrtYd") (tstamp 9a5dbad1-d92d-45ae-aa2b-f37437516afa))
  (fp_circle (center 0 0) (end 0.5 0)
    (stroke (width 0.1) (type default)) (fill none) (layer "F.Fab") (tstamp d4b7f761-229a-410f-8057-1c2c586bfccb))
  (fp_circle (center 5 0) (end 5.5 0)
    (stroke (width 0.1) (type default)) (fill none) (layer "F.Fab") (tstamp a4563c6c-b297-4342-9c90-ea52e6ad3695))
  (fp_circle (center 10 0) (end 10.5 0)
    (stroke (width 0.1) (type default)) (fill none) (layer "F.Fab") (tstamp 987ab20e-1b4b-4f61-87eb-c82cf1ce9c2b))
  (fp_circle (center 15 0) (end 15.5 0)
    (stroke (width 0.1) (type default)) (fill none) (layer "F.Fab") (tstamp 8eb97235-d230-4da0-ab1d-55ad7a159e2a))
  (fp_circle (center 20 0) (end 20.5 0)
    (stroke (width 0.1) (type default)) (fill none) (layer "F.Fab") (tstamp b7bc3e4f-8f10-4bde-b0ea-6cc146980bbd))
  (fp_circle (center 25 0) (end 25.5 0)
    (stroke (width 0.1) (type default)) (fill none) (layer "F.Fab") (tstamp 301404e4-33eb-48b4-a871-2293279a01b5))
  (fp_circle (center 30 0) (end 30.5 0)
    (stroke (width 0.1) (type default)) (fill none) (layer "F.Fab") (tstamp 1a228ea5-2309-4869-9757-d90207f0a784))
  (fp_circle (center 35 0) (end 35.5 0)
    (stroke (width 0.1) (type default)) (fill none) (layer "F.Fab") (tstamp e5f2fd96-b226-4238-8e17-ce2621974061))
  (fp_circle (center 40 0) (end 40.5 0)
    (stroke (width 0.1) (type default)) (fill none) (layer "F.Fab") (tstamp f7e86f97-61ed-4715-8e6c-6ff65db2ef1f))
  (fp_circle (center 45 0) (end 45.5 0)
    (stroke (width 0.1) (type default)) (fill none) (layer "F.Fab") (tstamp 46e2286c-5544-48c8-9f24-2865aa2c68d3))
  (pad "1" thru_hole circle (at 0 0) (size 2.2 2.2) (drill 1.1) (layers "*.Cu" "*.Mask") (tstamp 3d42d0ea-a676-4951-8ca8-54d8c4f21b4d))
  (pad "2" thru_hole circle (at 5 0) (size 2.2 2.2) (drill 1.1) (layers "*.Cu" "*.Mask") (tstamp 1c5175d8-6825-48e6-8d4c-3690179c0165))
  (pad "3" thru_hole circle (at 10 0) (size 2.2 2.2) (drill 1.1) (layers "*.Cu" "*.Mask") (tstamp 63b7781e-908f-4d8f-a10c-322da9c5e100))
  (pad "4" thru_hole circle (at 15 0) (size 2.2 2.2) (drill 1.1) (layers "*.Cu" "*.Mask") (tstamp 4f595410-dbd9-4158-b5f6-3a3b076b15ef))
  (pad "5" thru_hole circle (at 20 0) (size 2.2 2.2) (drill 1.1) (layers "*.Cu" "*.Mask") (tstamp 1b521302-4c4a-464a-872f-3c2f85b4e68a))
  (pad "6" thru_hole circle (at 25 0) (size 2.2 2.2) (drill 1.1) (layers "*.Cu" "*.Mask") (tstamp b32fc2df-32c2-4e3a-9425-28777a53c74e))
  (pad "7" thru_hole circle (at 30 0) (size 2.2 2.2) (drill 1.1) (layers "*.Cu" "*.Mask") (tstamp 05efc9f3-2a70-4ff8-84b7-615f13572a17))
  (pad "8" thru_hole circle (at 35 0) (size 2.2 2.2) (drill 1.1) (layers "*.Cu" "*.Mask") (tstamp eb3ba66e-5c7c-457f-a9f8-171519d2dff2))
  (pad "9" thru_hole circle (at 40 0) (size 2.2 2.2) (drill 1.1) (layers "*.Cu" "*.Mask") (tstamp d79509d1-5b87-4099-9ec0-7481d2e9042a))
  (pad "10" thru_hole circle (at 45 0) (size 2.2 2.2) (drill 1.1) (layers "*.Cu" "*.Mask") (tstamp 8aa579b3-5288-4e16-991e-997c2a8608e3))
  (model "${KICAD6_3DMODEL_DIR}/Connector_Pin.3dshapes/Pin_D1.1mm_L8.5mm_W2.5mm_FlatFork.wrl"
    (offset (xyz 0 0 0))
    (scale (xyz 1 1 1))
    (rotate (xyz 0 0 0))
  )
)
