(module C_Rect_L12.0mm_W7.5mm_P10.00mm_MPP (layer F.Cu) (tedit 5EE1363C)
  (descr "C, Rect series, Radial, pin pitch=10.00mm, , length*width=12*7.5mm^2, Capacitor, https://www.tme.eu/Document/1f7531ece130c1220b49f42a9a3462ad/MPP%20datasheet-K.pdf")
  (tags "C Rect series Radial pin pitch 10.00mm  length 12mm width 3mm Capacitor")
  (fp_text reference REF** (at 1 -4.5) (layer F.SilkS)
    (effects (font (size 1 1) (thickness 0.15)))
  )
  (fp_text value C_Rect_L13.0mm_W3.0mm_P10.00mm_FKS3_FKP3_MKS4 (at 5 2.75) (layer F.Fab)
    (effects (font (size 1 1) (thickness 0.15)))
  )
  (fp_line (start -0.9 -3.7) (end -0.9 3.7) (layer F.Fab) (width 0.1))
  (fp_line (start -0.9 3.7) (end 10.9 3.7) (layer F.Fab) (width 0.1))
  (fp_line (start 10.9 3.7) (end 10.9 -3.7) (layer F.Fab) (width 0.1))
  (fp_line (start 10.9 -3.7) (end -0.9 -3.7) (layer F.Fab) (width 0.1))
  (fp_line (start -1 -3.75) (end 11 -3.75) (layer F.SilkS) (width 0.12))
  (fp_line (start -1 3.75) (end 11 3.75) (layer F.SilkS) (width 0.12))
  (fp_line (start -1 -3.75) (end -1 -0.75) (layer F.SilkS) (width 0.12))
  (fp_line (start 11 0.75) (end 11 3.75) (layer F.SilkS) (width 0.12))
  (fp_line (start -1.1 -3.8) (end -1.1 3.8) (layer F.CrtYd) (width 0.05))
  (fp_line (start -1.1 3.8) (end 11.1 3.8) (layer F.CrtYd) (width 0.05))
  (fp_line (start 11.1 3.8) (end 11.1 -3.8) (layer F.CrtYd) (width 0.05))
  (fp_line (start 11.1 -3.8) (end -1.1 -3.8) (layer F.CrtYd) (width 0.05))
  (fp_text user %R (at 5 0) (layer F.Fab)
    (effects (font (size 1 1) (thickness 0.15)))
  )
  (fp_line (start -1 0.75) (end -1 3.75) (layer F.SilkS) (width 0.12))
  (fp_line (start 11 -3.75) (end 11 -0.75) (layer F.SilkS) (width 0.12))
  (pad 1 thru_hole circle (at 0 0) (size 2 2) (drill 1) (layers *.Cu *.Mask))
  (pad 2 thru_hole circle (at 10 0) (size 2 2) (drill 1) (layers *.Cu *.Mask))
  (model /home/jat/Dropbox/Projekty/Elektrika/Elektronika/_KiCAD_Library/3D/MPP-W12H12_4T7_5P10.step
    (at (xyz 0 0 0))
    (scale (xyz 1 1 1))
    (rotate (xyz 0 0 0))
  )
)
