(module RPS-60 (layer F.Cu) (tedit 5FEDB9E6)
  (fp_text reference REF** (at 3 1) (layer F.SilkS)
    (effects (font (size 1 1) (thickness 0.15)))
  )
  (fp_text value RPS-60 (at 13 -3) (layer F.Fab)
    (effects (font (size 1 1) (thickness 0.15)))
  )
  (fp_text user %R (at 12 -5) (layer F.Fab)
    (effects (font (size 1 1) (thickness 0.15)))
  )
  (fp_line (start 0 -50.8) (end 0 0) (layer F.CrtYd) (width 0.12))
  (fp_line (start 101.6 -50.8) (end 0 -50.8) (layer F.CrtYd) (width 0.12))
  (fp_line (start 101.6 0) (end 101.6 -50.8) (layer F.CrtYd) (width 0.12))
  (fp_line (start 0 0) (end 101.6 0) (layer F.CrtYd) (width 0.12))
  (fp_line (start 0 0) (end 101.6 0) (layer F.SilkS) (width 0.12))
  (fp_line (start 101.6 0) (end 101.6 -50.8) (layer F.SilkS) (width 0.12))
  (fp_line (start 101.6 -50.8) (end 0 -50.8) (layer F.SilkS) (width 0.12))
  (fp_line (start 0 -50.8) (end 0 0) (layer F.SilkS) (width 0.12))
  (fp_line (start 1 -26) (end 1 -37) (layer F.SilkS) (width 0.12))
  (fp_line (start 1 -37) (end 6 -37) (layer F.SilkS) (width 0.12))
  (fp_line (start 6 -37) (end 6 -26) (layer F.SilkS) (width 0.12))
  (fp_line (start 6 -26) (end 1 -26) (layer F.SilkS) (width 0.12))
  (fp_line (start 101 -26) (end 96 -26) (layer F.SilkS) (width 0.12))
  (fp_line (start 96 -26) (end 96 -12) (layer F.SilkS) (width 0.12))
  (fp_line (start 96 -12) (end 101 -12) (layer F.SilkS) (width 0.12))
  (fp_line (start 101 -12) (end 101 -26) (layer F.SilkS) (width 0.12))
  (fp_poly (pts (xy 99.5 -23.5) (xy 99 -23.5) (xy 99 -24) (xy 99.5 -24)) (layer F.SilkS) (width 0.1))
  (fp_poly (pts (xy 99.5 -20.5) (xy 99 -20.5) (xy 99 -21) (xy 99.5 -21)) (layer F.SilkS) (width 0.1))
  (fp_poly (pts (xy 99.5 -17.5) (xy 99 -17.5) (xy 99 -18) (xy 99.5 -18)) (layer F.SilkS) (width 0.1))
  (fp_poly (pts (xy 99.5 -14) (xy 99 -14) (xy 99 -14.5) (xy 99.5 -14.5)) (layer F.SilkS) (width 0.1))
  (fp_poly (pts (xy 3 -31.5) (xy 2.5 -31.5) (xy 2.5 -32) (xy 3 -32)) (layer F.SilkS) (width 0.1))
  (fp_poly (pts (xy 3 -28) (xy 2.5 -28) (xy 2.5 -28.5) (xy 3 -28.5)) (layer F.SilkS) (width 0.1))
  (fp_poly (pts (xy 3 -34.5) (xy 2.5 -34.5) (xy 2.5 -35) (xy 3 -35)) (layer F.SilkS) (width 0.1))
  (fp_line (start 43 -49) (end 43 -21) (layer F.SilkS) (width 0.12))
  (fp_line (start 43 -21) (end 71 -21) (layer F.SilkS) (width 0.12))
  (fp_line (start 71 -21) (end 71 -49) (layer F.SilkS) (width 0.12))
  (fp_line (start 71 -49) (end 43 -49) (layer F.SilkS) (width 0.12))
  (fp_line (start 47 -45) (end 47 -25) (layer F.SilkS) (width 0.12))
  (fp_line (start 47 -25) (end 67 -25) (layer F.SilkS) (width 0.12))
  (fp_line (start 67 -25) (end 67 -45) (layer F.SilkS) (width 0.12))
  (fp_line (start 67 -45) (end 47 -45) (layer F.SilkS) (width 0.12))
  (fp_circle (center 23 -14) (end 31 -13) (layer F.SilkS) (width 0.12))
  (fp_line (start 0 -51) (end 0 0) (layer F.Fab) (width 0.12))
  (fp_line (start 0 0) (end 101.5 0) (layer F.Fab) (width 0.12))
  (fp_line (start 101.5 0) (end 101.5 -51) (layer F.Fab) (width 0.12))
  (fp_line (start 101.5 -51) (end 0 -51) (layer F.Fab) (width 0.12))
  (fp_line (start 1 -37) (end 6 -37) (layer F.Fab) (width 0.12))
  (fp_line (start 6 -37) (end 6 -26) (layer F.Fab) (width 0.12))
  (fp_line (start 6 -26) (end 1 -26) (layer F.Fab) (width 0.12))
  (fp_line (start 1 -26) (end 1 -37) (layer F.Fab) (width 0.12))
  (fp_poly (pts (xy 3 -34.5) (xy 2.5 -34.5) (xy 2.5 -35) (xy 3 -35)) (layer F.Fab) (width 0.1))
  (fp_poly (pts (xy 3 -31.5) (xy 2.5 -31.5) (xy 2.5 -32) (xy 3 -32)) (layer F.Fab) (width 0.1))
  (fp_poly (pts (xy 3 -28) (xy 2.5 -28) (xy 2.5 -28.5) (xy 3 -28.5)) (layer F.Fab) (width 0.1))
  (fp_poly (pts (xy 99.5 -23.5) (xy 99 -23.5) (xy 99 -24) (xy 99.5 -24)) (layer F.Fab) (width 0.1))
  (fp_poly (pts (xy 99.5 -20.5) (xy 99 -20.5) (xy 99 -21) (xy 99.5 -21)) (layer F.Fab) (width 0.1))
  (fp_poly (pts (xy 99.5 -17.5) (xy 99 -17.5) (xy 99 -18) (xy 99.5 -18)) (layer F.Fab) (width 0.1))
  (fp_poly (pts (xy 99.5 -14) (xy 99 -14) (xy 99 -14.5) (xy 99.5 -14.5)) (layer F.Fab) (width 0.1))
  (fp_line (start 96 -26) (end 101 -26) (layer F.Fab) (width 0.12))
  (fp_line (start 101 -26) (end 101 -12) (layer F.Fab) (width 0.12))
  (fp_line (start 101 -12) (end 96 -12) (layer F.Fab) (width 0.12))
  (fp_line (start 96 -12) (end 96 -26) (layer F.Fab) (width 0.12))
  (fp_line (start 47 -45) (end 67 -45) (layer F.Fab) (width 0.12))
  (fp_line (start 67 -45) (end 67 -25) (layer F.Fab) (width 0.12))
  (fp_line (start 67 -25) (end 47 -25) (layer F.Fab) (width 0.12))
  (fp_line (start 47 -25) (end 47 -45) (layer F.Fab) (width 0.12))
  (fp_line (start 43 -49) (end 71 -49) (layer F.Fab) (width 0.12))
  (fp_line (start 71 -49) (end 71 -21) (layer F.Fab) (width 0.12))
  (fp_line (start 71 -21) (end 43 -21) (layer F.Fab) (width 0.12))
  (fp_line (start 43 -21) (end 43 -49) (layer F.Fab) (width 0.12))
  (fp_circle (center 23 -14) (end 31 -14) (layer F.Fab) (width 0.12))
  (pad 1 thru_hole circle (at 3.175 -3.175) (size 6 6) (drill 3.3) (layers *.Cu *.Mask))
  (pad 2 thru_hole circle (at 98.425 -3.175) (size 6 6) (drill 3.3) (layers *.Cu *.Mask))
  (pad 3 thru_hole circle (at 98.425 -47.625) (size 6 6) (drill 3.3) (layers *.Cu *.Mask))
  (pad 4 thru_hole circle (at 3.175 -47.625) (size 6 6) (drill 3.3) (layers *.Cu *.Mask))
  (model /home/jat/Dropbox/Projekty/Elektrika/Elektronika/_KiCAD_Library/3D/RPS-60.stp
    (offset (xyz 15.5 8 5))
    (scale (xyz 1 1 1))
    (rotate (xyz 0 0 0))
  )
)
