(module L_Radial_7.5x9.5 (layer F.Cu) (tedit 5FEDB756)
  (fp_text reference REF** (at 0.5 -4.5) (layer F.SilkS)
    (effects (font (size 1 1) (thickness 0.15)))
  )
  (fp_text value L_Radial_7.5x9.5 (at 0 -4.5) (layer F.Fab)
    (effects (font (size 1 1) (thickness 0.15)))
  )
  (fp_text user %R (at 0 -2) (layer F.Fab)
    (effects (font (size 1 1) (thickness 0.15)))
  )
  (fp_circle (center 0 0) (end 3.75 0) (layer F.CrtYd) (width 0.12))
  (fp_circle (center 0 0) (end 3.75 0) (layer F.SilkS) (width 0.12))
  (fp_circle (center 0 0) (end 3.75 0) (layer F.CrtYd) (width 0.12))
  (fp_circle (center 0 0) (end 3.75 0) (layer F.Fab) (width 0.12))
  (pad 1 thru_hole circle (at -1.5 0) (size 1.6 1.6) (drill 0.8) (layers *.Cu *.Mask))
  (pad 2 thru_hole circle (at 1.5 0) (size 1.6 1.6) (drill 0.8) (layers *.Cu *.Mask))
  (model /home/jat/Dropbox/Projekty/Elektrika/Elektronika/_KiCAD_Library/3D/COIL0608-0.0047.step
    (at (xyz 0 0 0))
    (scale (xyz 1 1 1))
    (rotate (xyz 0 0 0))
  )
)
