(footprint "5501-880" (version 20221018) (generator pcbnew)
  (layer "F.Cu")
  (descr "RJ45")
  (tags "RJ45 RJ-45")
  (attr through_hole)
  (fp_text reference "J?" (at -3.5 -7 unlocked) (layer "F.SilkS")
      (effects (font (size 1 1) (thickness 0.15)))
    (tstamp b30f2bea-6747-4f95-85f0-c2bd4be2eef6)
  )
  (fp_text value "5501-880" (at -3.5 -5.5 unlocked) (layer "F.Fab")
      (effects (font (size 1 1) (thickness 0.15)))
    (tstamp 73303efa-6595-4370-90b0-acba518c6dc6)
  )
  (fp_text user "${REFERENCE}" (at -3.5 -4 unlocked) (layer "F.Fab") hide
      (effects (font (size 1 1) (thickness 0.15)))
    (tstamp 4041f603-0da5-49d6-b929-d51efccfb09b)
  )
  (fp_rect (start -11.05 8.3) (end 3.95 -4.7)
    (stroke (width 0.12) (type default)) (fill none) (layer "F.SilkS") (tstamp 5b1278e0-83dc-48fa-9835-ef8e2b4854cb))
  (pad "" np_thru_hole circle (at -11.07 2.3) (size 2.3 2.3) (drill 2.3) (layers "F&B.Cu" "*.Mask") (tstamp 9775a5aa-10eb-4c74-b920-ba91b7b7b296))
  (pad "" np_thru_hole circle (at 3.93 2.3 270) (size 2.3 2.3) (drill 2.3) (layers "F&B.Cu" "*.Mask") (tstamp 819a2f1b-3709-4109-9833-e4fe37530dc8))
  (pad "1" thru_hole rect (at 0 0) (size 1.524 1.524) (drill 0.9) (layers "*.Cu" "*.Mask") (tstamp 3a6fd7dc-720d-4d1a-ab82-0e8b853df937))
  (pad "2" thru_hole circle (at -1.02 -2.54) (size 1.524 1.524) (drill 0.9) (layers "*.Cu" "*.Mask") (tstamp 98a109a7-8390-4360-8fce-0a076d14b0f6))
  (pad "3" thru_hole circle (at -2.04 0) (size 1.524 1.524) (drill 0.9) (layers "*.Cu" "*.Mask") (tstamp b3164478-8b7b-4078-82c9-7f44b119cf46))
  (pad "4" thru_hole circle (at -3.06 -2.54) (size 1.524 1.524) (drill 0.9) (layers "*.Cu" "*.Mask") (tstamp a37717fe-4230-4fc7-86e2-7688439ea913))
  (pad "5" thru_hole circle (at -4.08 0) (size 1.524 1.524) (drill 0.9) (layers "*.Cu" "*.Mask") (tstamp 4b5bd149-3fb1-447c-8196-c7f4c734d4b3))
  (pad "6" thru_hole circle (at -5.1 -2.54) (size 1.524 1.524) (drill 0.9) (layers "*.Cu" "*.Mask") (tstamp f5814e31-def8-4f80-8ca5-b01128ac2264))
  (pad "7" thru_hole circle (at -6.12 0) (size 1.524 1.524) (drill 0.9) (layers "*.Cu" "*.Mask") (tstamp dfab2bdc-b7c5-40c6-8520-f23d676279a9))
  (pad "8" thru_hole circle (at -7.14 -2.54) (size 1.524 1.524) (drill 0.9) (layers "*.Cu" "*.Mask") (tstamp a6a747b1-6c5c-4fe8-bc22-64ba655b8861))
)
