(footprint "UDFN6B_TOS" (version 20211014) (generator pcbnew)
  (layer "F.Cu")
  (tags "SSM6K504NU_LF ")
  (attr smd)
  (fp_text reference "REF**" (at 0 0 unlocked) (layer F.SilkS)
    (effects (font (size 1 1) (thickness 0.15)))
  )
  (fp_text value UDFN6B_TOS (at 0 0 unlocked) (layer F.Fab)
    (effects (font (size 1 1) (thickness 0.15)))
  )
  (fp_text user "${REFERENCE}" (at 0 0 unlocked) (layer F.Fab)
    (effects (font (size 1 1) (thickness 0.15)))
  )
  (fp_text user "*" (at -1.9939 -0.65) (layer F.SilkS)
    (effects (font (size 1 1) (thickness 0.15)))
  )
  (fp_text user "*" (at -0.0381 -0.65) (layer F.Fab)
    (effects (font (size 1 1) (thickness 0.15)))
  )
  (fp_poly (pts
      (xy -0.381 0.4976)
      (xy 0.381 0.4976)
      (xy 0.381 0.8024)
      (xy -0.381 0.8024)
    ) (layer "F.Cu") (width 0) (fill solid))
  (fp_poly (pts
      (xy -0.381 0.4976)
      (xy 0.381 0.4976)
      (xy 0.381 0.8024)
      (xy -0.381 0.8024)
    ) (layer "F.Mask") (width 0) (fill solid))
  (fp_poly (pts
      (xy -0.381 0.4976)
      (xy 0.381 0.4976)
      (xy 0.381 0.8024)
      (xy -0.381 0.8024)
    ) (layer "F.Paste") (width 0) (fill solid))
  (fp_poly (pts
      (xy -0.5715 -0.7949)
      (xy 0.5715 -0.7949)
      (xy 0.5715 0.1449)
      (xy -0.5715 0.1449)
    ) (layer "F.Cu") (width 0) (fill solid))
  (fp_poly (pts
      (xy -0.5715 -0.7949)
      (xy 0.5715 -0.7949)
      (xy 0.5715 0.1449)
      (xy -0.5715 0.1449)
    ) (layer "F.Mask") (width 0) (fill solid))
  (fp_poly (pts
      (xy -0.5715 -0.7949)
      (xy 0.5715 -0.7949)
      (xy 0.5715 0.1449)
      (xy -0.5715 0.1449)
    ) (layer "F.Paste") (width 0) (fill solid))
  (fp_line (start -1.2573 1.2573) (end -1.2573 1.0691) (layer "F.CrtYd") (width 0.1524))
  (fp_line (start -1.2573 1.0691) (end -1.6129 1.0691) (layer "F.CrtYd") (width 0.1524))
  (fp_line (start -1.6129 1.0691) (end -1.6129 -1.0691) (layer "F.CrtYd") (width 0.1524))
  (fp_line (start -1.6129 -1.0691) (end -1.2573 -1.0691) (layer "F.CrtYd") (width 0.1524))
  (fp_line (start -1.2573 -1.0691) (end -1.2573 -1.2573) (layer "F.CrtYd") (width 0.1524))
  (fp_line (start -1.2573 -1.2573) (end -0.0941 -1.2573) (layer "F.CrtYd") (width 0.1524))
  (fp_line (start -0.0941 -1.2573) (end -0.0941 -1.6129) (layer "F.CrtYd") (width 0.1524))
  (fp_line (start -0.0941 -1.6129) (end 0.0941 -1.6129) (layer "F.CrtYd") (width 0.1524))
  (fp_line (start 0.0941 -1.6129) (end 0.0941 -1.2573) (layer "F.CrtYd") (width 0.1524))
  (fp_line (start 0.0941 -1.2573) (end 1.2573 -1.2573) (layer "F.CrtYd") (width 0.1524))
  (fp_line (start 1.2573 -1.2573) (end 1.2573 -1.0691) (layer "F.CrtYd") (width 0.1524))
  (fp_line (start 1.2573 -1.0691) (end 1.6129 -1.0691) (layer "F.CrtYd") (width 0.1524))
  (fp_line (start 1.6129 -1.0691) (end 1.6129 1.0691) (layer "F.CrtYd") (width 0.1524))
  (fp_line (start 1.6129 1.0691) (end 1.2573 1.0691) (layer "F.CrtYd") (width 0.1524))
  (fp_line (start 1.2573 1.0691) (end 1.2573 1.2573) (layer "F.CrtYd") (width 0.1524))
  (fp_line (start 1.2573 1.2573) (end 0.0941 1.2573) (layer "F.CrtYd") (width 0.1524))
  (fp_line (start 0.0941 1.2573) (end 0.0941 1.6129) (layer "F.CrtYd") (width 0.1524))
  (fp_line (start 0.0941 1.6129) (end -0.0941 1.6129) (layer "F.CrtYd") (width 0.1524))
  (fp_line (start -0.0941 1.6129) (end -0.0941 1.2573) (layer "F.CrtYd") (width 0.1524))
  (fp_line (start -0.0941 1.2573) (end -1.2573 1.2573) (layer "F.CrtYd") (width 0.1524))
  (fp_text user "*" (at -1.9939 -0.65 unlocked) (layer "F.SilkS")
    (effects (font (size 1 1) (thickness 0.15)))
  )
  (fp_text user "*" (at -0.0381 -0.65 unlocked) (layer "F.Fab")
    (effects (font (size 1 1) (thickness 0.15)))
  )
  (fp_line (start -1.0033 0.2667) (end 0.2667 -1.0033) (layer "F.Fab") (width 0.0254))
  (fp_line (start -1.0033 -0.4595) (end -1.0033 -0.8405) (layer "F.Fab") (width 0.0254))
  (fp_line (start -1.0033 -0.8405) (end -1.0541 -0.8405) (layer "F.Fab") (width 0.0254))
  (fp_line (start -1.0541 -0.8405) (end -1.0541 -0.4595) (layer "F.Fab") (width 0.0254))
  (fp_line (start -1.0541 -0.4595) (end -1.0033 -0.4595) (layer "F.Fab") (width 0.0254))
  (fp_line (start -1.0033 0.1905) (end -1.0033 -0.1905) (layer "F.Fab") (width 0.0254))
  (fp_line (start -1.0033 -0.1905) (end -1.0541 -0.1905) (layer "F.Fab") (width 0.0254))
  (fp_line (start -1.0541 -0.1905) (end -1.0541 0.1905) (layer "F.Fab") (width 0.0254))
  (fp_line (start -1.0541 0.1905) (end -1.0033 0.1905) (layer "F.Fab") (width 0.0254))
  (fp_line (start -1.0033 0.8405) (end -1.0033 0.4595) (layer "F.Fab") (width 0.0254))
  (fp_line (start -1.0033 0.4595) (end -1.0541 0.4595) (layer "F.Fab") (width 0.0254))
  (fp_line (start -1.0541 0.4595) (end -1.0541 0.8405) (layer "F.Fab") (width 0.0254))
  (fp_line (start -1.0541 0.8405) (end -1.0033 0.8405) (layer "F.Fab") (width 0.0254))
  (fp_line (start 1.0033 0.4595) (end 1.0033 0.8405) (layer "F.Fab") (width 0.0254))
  (fp_line (start 1.0033 0.8405) (end 1.0541 0.8405) (layer "F.Fab") (width 0.0254))
  (fp_line (start 1.0541 0.8405) (end 1.0541 0.4595) (layer "F.Fab") (width 0.0254))
  (fp_line (start 1.0541 0.4595) (end 1.0033 0.4595) (layer "F.Fab") (width 0.0254))
  (fp_line (start 1.0033 -0.1905) (end 1.0033 0.1905) (layer "F.Fab") (width 0.0254))
  (fp_line (start 1.0033 0.1905) (end 1.0541 0.1905) (layer "F.Fab") (width 0.0254))
  (fp_line (start 1.0541 0.1905) (end 1.0541 -0.1905) (layer "F.Fab") (width 0.0254))
  (fp_line (start 1.0541 -0.1905) (end 1.0033 -0.1905) (layer "F.Fab") (width 0.0254))
  (fp_line (start 1.0033 -0.8405) (end 1.0033 -0.4595) (layer "F.Fab") (width 0.0254))
  (fp_line (start 1.0033 -0.4595) (end 1.0541 -0.4595) (layer "F.Fab") (width 0.0254))
  (fp_line (start 1.0541 -0.4595) (end 1.0541 -0.8405) (layer "F.Fab") (width 0.0254))
  (fp_line (start 1.0541 -0.8405) (end 1.0033 -0.8405) (layer "F.Fab") (width 0.0254))
  (fp_line (start -0.566498 1.1303) (end -0.381 1.1303) (layer "F.SilkS") (width 0.1524))
  (fp_line (start 0.566498 -1.1303) (end -0.566498 -1.1303) (layer "F.SilkS") (width 0.1524))
  (fp_line (start -1.0033 1.0033) (end 1.0033 1.0033) (layer "F.Fab") (width 0.0254))
  (fp_line (start 1.0033 1.0033) (end 1.0033 -1.0033) (layer "F.Fab") (width 0.0254))
  (fp_line (start 1.0033 -1.0033) (end -1.0033 -1.0033) (layer "F.Fab") (width 0.0254))
  (fp_line (start -1.0033 -1.0033) (end -1.0033 1.0033) (layer "F.Fab") (width 0.0254))
  (pad "1" smd rect (at -1.016 -0.649999 90) (size 0.3302 0.6858) (layers "F.Cu" "F.Paste" "F.Mask"))
  (pad "2" smd rect (at -1.016 0 90) (size 0.3302 0.6858) (layers "F.Cu" "F.Paste" "F.Mask"))
  (pad "3" smd rect (at -1.016 0.649999 90) (size 0.3302 0.6858) (layers "F.Cu" "F.Paste" "F.Mask"))
  (pad "4" smd rect (at 1.016 0.649999 90) (size 0.3302 0.6858) (layers "F.Cu" "F.Paste" "F.Mask"))
  (pad "5" smd rect (at 1.016 0 90) (size 0.3302 0.6858) (layers "F.Cu" "F.Paste" "F.Mask"))
  (pad "6" smd rect (at 1.016 -0.649999 90) (size 0.3302 0.6858) (layers "F.Cu" "F.Paste" "F.Mask"))
)
