(module MTS03008 (layer F.Cu) (tedit 562E9B86)
  (fp_text reference REF** (at 0.25 -5) (layer F.SilkS)
    (effects (font (size 1 1) (thickness 0.15)))
  )
  (fp_text value MTS03008 (at 3.5 2.75) (layer F.Fab)
    (effects (font (size 1 1) (thickness 0.15)))
  )
  (fp_line (start -1.75 4) (end 8.75 4) (layer F.SilkS) (width 0.15))
  (fp_line (start -1.75 -4) (end 8.75 -4) (layer F.SilkS) (width 0.15))
  (fp_line (start 8.75 -4) (end 8.75 4) (layer F.SilkS) (width 0.15))
  (fp_line (start -1.75 -4) (end -1.75 4) (layer F.SilkS) (width 0.15))
  (pad 1 thru_hole rect (at 0 0) (size 2 3) (drill 1) (layers *.Cu *.Mask F.SilkS))
  (pad 2 thru_hole oval (at 3.5 0) (size 2 3) (drill 1) (layers *.Cu *.Mask F.SilkS))
  (pad 3 thru_hole oval (at 7 0) (size 2 3) (drill 1) (layers *.Cu *.Mask F.SilkS))
)
