(module ASM-010 (layer F.Cu) (tedit 5E540670)
  (fp_text reference REF** (at 0 0.5) (layer F.SilkS)
    (effects (font (size 1 1) (thickness 0.15)))
  )
  (fp_text value ASM-010 (at 0 -0.5) (layer F.Fab)
    (effects (font (size 1 1) (thickness 0.15)))
  )
  (fp_text user %R (at 0 0) (layer F.Fab)
    (effects (font (size 1 1) (thickness 0.15)))
  )
  (fp_line (start -2.25 4.75) (end -2.25 -4.75) (layer F.SilkS) (width 0.15))
  (fp_line (start -2.25 -4.75) (end 15 -4.75) (layer F.SilkS) (width 0.15))
  (fp_line (start 15 -4.75) (end 15 4.75) (layer F.SilkS) (width 0.15))
  (fp_line (start 15 4.75) (end -2.25 4.75) (layer F.SilkS) (width 0.15))
  (pad 1 thru_hole rect (at 0 0) (size 1.6 1.6) (drill 0.8) (layers *.Cu *.Mask))
  (pad 3 thru_hole circle (at 12.7 0) (size 1.6 1.6) (drill 0.8) (layers *.Cu *.Mask))
  (pad 4 thru_hole circle (at 6.35 10.16) (size 3 3) (drill 1.5) (layers *.Cu *.Mask))
  (pad 5 thru_hole circle (at 6.35 -10.16) (size 3 3) (drill 1.5) (layers *.Cu *.Mask))
)
