(module ETD49 (layer F.Cu) (tedit 5E540654)
  (fp_text reference REF** (at 0 0.5) (layer F.SilkS)
    (effects (font (size 1 1) (thickness 0.15)))
  )
  (fp_text value ETD49 (at 0 -0.5) (layer F.Fab)
    (effects (font (size 1 1) (thickness 0.15)))
  )
  (fp_text user %R (at 0 0) (layer F.Fab)
    (effects (font (size 1 1) (thickness 0.15)))
  )
  (fp_line (start -4.4 8.3) (end 50 8.3) (layer F.SilkS) (width 0.15))
  (fp_line (start 50 8.3) (end 50 -48.9) (layer F.SilkS) (width 0.15))
  (fp_line (start 50 -48.9) (end -4.4 -48.9) (layer F.SilkS) (width 0.15))
  (fp_line (start -4.4 -48.9) (end -4.4 8.3) (layer F.SilkS) (width 0.15))
  (fp_line (start 4.85 -2.8) (end 40.85 -2.8) (layer F.SilkS) (width 0.15))
  (fp_line (start 40.85 -2.8) (end 40.85 -37.8) (layer F.SilkS) (width 0.15))
  (fp_line (start 40.85 -37.8) (end 4.85 -37.8) (layer F.SilkS) (width 0.15))
  (fp_line (start 4.85 -37.8) (end 4.85 -2.8) (layer F.SilkS) (width 0.15))
  (fp_line (start 40.85 -37.8) (end 49.85 -37.8) (layer F.SilkS) (width 0.15))
  (fp_line (start 4.85 -37.8) (end -4.15 -37.8) (layer F.SilkS) (width 0.15))
  (fp_line (start 4.85 -2.8) (end -4.15 -2.8) (layer F.SilkS) (width 0.15))
  (fp_line (start 40.85 -2.8) (end 49.85 -2.8) (layer F.SilkS) (width 0.15))
  (fp_line (start 4.85 -20.8) (end 40.85 -20.8) (layer F.SilkS) (width 0.15))
  (fp_line (start 40.85 -19.8) (end 4.85 -19.8) (layer F.SilkS) (width 0.15))
  (fp_line (start 4.85 -36.8) (end 40.85 -36.8) (layer F.SilkS) (width 0.15))
  (fp_line (start 4.85 -3.8) (end 40.85 -3.8) (layer F.SilkS) (width 0.15))
  (fp_line (start -5 -49) (end 50.5 -49) (layer F.CrtYd) (width 0.12))
  (fp_line (start 50.5 -49) (end 50.5 8.5) (layer F.CrtYd) (width 0.12))
  (fp_line (start 50.5 8.5) (end -5 8.5) (layer F.CrtYd) (width 0.12))
  (fp_line (start -5 8.5) (end -5 -49) (layer F.CrtYd) (width 0.12))
  (pad 1 thru_hole circle (at 0 0) (size 3.5 3.5) (drill 1.6) (layers *.Cu *.Mask))
  (pad 2 thru_hole circle (at 5.08 0) (size 3.5 3.5) (drill 1.6) (layers *.Cu *.Mask))
  (pad 3 thru_hole circle (at 10.16 0) (size 3.5 3.5) (drill 1.6) (layers *.Cu *.Mask))
  (pad 4 thru_hole circle (at 15.24 0) (size 3.5 3.5) (drill 1.6) (layers *.Cu *.Mask))
  (pad 5 thru_hole circle (at 20.32 0) (size 3.5 3.5) (drill 1.6) (layers *.Cu *.Mask))
  (pad 6 thru_hole circle (at 25.4 0) (size 3.5 3.5) (drill 1.6) (layers *.Cu *.Mask))
  (pad 7 thru_hole circle (at 30.48 0) (size 3.5 3.5) (drill 1.6) (layers *.Cu *.Mask))
  (pad 8 thru_hole circle (at 35.56 0) (size 3.5 3.5) (drill 1.6) (layers *.Cu *.Mask))
  (pad 9 thru_hole circle (at 40.64 0) (size 3.5 3.5) (drill 1.6) (layers *.Cu *.Mask))
  (pad 10 thru_hole circle (at 45.72 0) (size 3.5 3.5) (drill 1.6) (layers *.Cu *.Mask))
  (pad 11 thru_hole circle (at 45.72 -40.64 180) (size 3.5 3.5) (drill 1.6) (layers *.Cu *.Mask))
  (pad 12 thru_hole circle (at 40.64 -40.64 180) (size 3.5 3.5) (drill 1.6) (layers *.Cu *.Mask))
  (pad 13 thru_hole circle (at 35.56 -40.64 180) (size 3.5 3.5) (drill 1.6) (layers *.Cu *.Mask))
  (pad 14 thru_hole circle (at 30.48 -40.64 180) (size 3.5 3.5) (drill 1.6) (layers *.Cu *.Mask))
  (pad 15 thru_hole circle (at 25.4 -40.64 180) (size 3.5 3.5) (drill 1.6) (layers *.Cu *.Mask))
  (pad 16 thru_hole circle (at 20.32 -40.64 180) (size 3.5 3.5) (drill 1.6) (layers *.Cu *.Mask))
  (pad 17 thru_hole circle (at 15.24 -40.64 180) (size 3.5 3.5) (drill 1.6) (layers *.Cu *.Mask))
  (pad 18 thru_hole circle (at 10.16 -40.64 180) (size 3.5 3.5) (drill 1.6) (layers *.Cu *.Mask))
  (pad 19 thru_hole circle (at 5.08 -40.64 180) (size 3.5 3.5) (drill 1.6) (layers *.Cu *.Mask))
  (pad 20 thru_hole circle (at 0 -40.64 180) (size 3.5 3.5) (drill 1.6) (layers *.Cu *.Mask))
  (model /home/jat/Dropbox/Projekty/Elektrika/Elektronika/_KiCAD_Library/3D/ETD49.step
    (at (xyz 0 0 0))
    (scale (xyz 1 1 1))
    (rotate (xyz 0 0 0))
  )
)
