(footprint "THT_CABLE_3_RM5"
	(version 20240108)
	(generator "pcbnew")
	(generator_version "8.0")
	(layer "F.Cu")
	(descr "Pajkovaci pripojny bod pre kabel")
	(tags "connector cable tht rm5")
	(property "Reference" "REF**"
		(at 0 -3.5 0)
		(unlocked yes)
		(layer "F.SilkS")
		(uuid "dbfcd39d-448c-4c90-bce0-598a1ccef55c")
		(effects
			(font
				(size 1 1)
				(thickness 0.15)
			)
		)
	)
	(property "Value" "THT_CABLE_3_RM5"
		(at 2.5 5.5 0)
		(unlocked yes)
		(layer "F.Fab")
		(uuid "e1188da1-85dc-4b51-8035-83156dc4b087")
		(effects
			(font
				(size 1 1)
				(thickness 0.15)
			)
		)
	)
	(property "Footprint" ""
		(at 0 0 0)
		(layer "F.Fab")
		(hide yes)
		(uuid "978fd2ce-f521-42d2-be13-686db61221b2")
		(effects
			(font
				(size 1.27 1.27)
				(thickness 0.15)
			)
		)
	)
	(property "Datasheet" ""
		(at 0 0 0)
		(layer "F.Fab")
		(hide yes)
		(uuid "774ec8a5-89f7-4e35-8694-17431b3859c5")
		(effects
			(font
				(size 1.27 1.27)
				(thickness 0.15)
			)
		)
	)
	(property "Description" ""
		(at 0 0 0)
		(layer "F.Fab")
		(hide yes)
		(uuid "5b8f2d52-8f0c-4502-9b93-e7e714ab89ae")
		(effects
			(font
				(size 1.27 1.27)
				(thickness 0.15)
			)
		)
	)
	(attr through_hole)
	(fp_rect
		(start -2.5 -2.5)
		(end 12.5 2.5)
		(stroke
			(width 0.12)
			(type default)
		)
		(fill none)
		(layer "F.SilkS")
		(uuid "31ba34d7-0837-43c0-a4bb-8119a1a64c60")
	)
	(fp_text user "${REFERENCE}"
		(at 2.5 3.5 0)
		(unlocked yes)
		(layer "F.Fab")
		(uuid "7a296975-b801-45fa-b6d8-1493c8b58932")
		(effects
			(font
				(size 1 1)
				(thickness 0.15)
			)
		)
	)
	(pad "1" thru_hole rect
		(at 0 0)
		(size 4 4)
		(drill 2)
		(layers "*.Cu" "*.Mask")
		(remove_unused_layers no)
		(uuid "578c4651-dc72-48d5-8c02-8cad8bf9707b")
	)
	(pad "2" thru_hole circle
		(at 5 0)
		(size 4 4)
		(drill 2)
		(layers "*.Cu" "*.Mask" "B.SilkS")
		(remove_unused_layers no)
		(uuid "9f794113-c444-46a0-81b8-4b1d648220e1")
	)
	(pad "3" thru_hole circle
		(at 10 0)
		(size 4 4)
		(drill 2)
		(layers "*.Cu" "*.Mask" "B.SilkS")
		(remove_unused_layers no)
		(uuid "e7797446-4f5b-40af-98cd-419c968c39f4")
	)
)
