(module faston_pcb_horizontal (layer F.Cu) (tedit 5C375C5D)
  (fp_text reference REF** (at 2.5 -2) (layer F.SilkS)
    (effects (font (size 1 1) (thickness 0.15)))
  )
  (fp_text value faston_pcb_horizontal (at 2 2) (layer F.Fab)
    (effects (font (size 1 1) (thickness 0.15)))
  )
  (fp_line (start 1.5 -0.5) (end 3.5 -0.5) (layer F.SilkS) (width 0.15))
  (fp_line (start 3.5 0.5) (end 1.5 0.5) (layer F.SilkS) (width 0.15))
  (fp_line (start 6.5 -0.5) (end 13 -0.5) (layer F.SilkS) (width 0.15))
  (fp_line (start 13 -0.5) (end 13.5 0) (layer F.SilkS) (width 0.15))
  (fp_line (start 13.5 0) (end 13 0.5) (layer F.SilkS) (width 0.15))
  (fp_line (start 13 0.5) (end 6.5 0.5) (layer F.SilkS) (width 0.15))
  (pad 1 thru_hole circle (at 0 0) (size 2.6 2.6) (drill 1.3) (layers *.Cu *.Mask))
  (pad 1 thru_hole circle (at 5.08 0) (size 2.6 2.6) (drill 1.3) (layers *.Cu *.Mask))
)
