(module "SIM800L Smallest" (layer F.Cu) (tedit 5C6FDC15)
  (fp_text reference REF** (at 0.508 11.43) (layer F.SilkS)
    (effects (font (size 1 1) (thickness 0.15)))
  )
  (fp_text value "SIM800L Smallest" (at 5.334 9.398) (layer F.Fab)
    (effects (font (size 1 1) (thickness 0.15)))
  )
  (fp_line (start 23.622 8.128) (end 23.622 -15.494) (layer F.SilkS) (width 0.15))
  (fp_line (start 23.622 -15.494) (end -1.778 -15.494) (layer F.SilkS) (width 0.15))
  (fp_line (start -1.778 -15.494) (end -1.778 8.128) (layer F.SilkS) (width 0.15))
  (fp_line (start -1.778 8.128) (end 23.622 8.128) (layer F.SilkS) (width 0.15))
  (fp_circle (center 21.336 5.588) (end 22.86 5.842) (layer F.SilkS) (width 0.15))
  (fp_circle (center 21.336 5.588) (end 21.59 5.588) (layer F.SilkS) (width 0.15))
  (pad 1 thru_hole rect (at 0 0) (size 2 2) (drill 1) (layers *.Cu *.Mask))
  (pad 2 thru_hole circle (at 0 -2.54) (size 2 2) (drill 1) (layers *.Cu *.Mask))
  (pad 3 thru_hole circle (at 0 -5.08) (size 2 2) (drill 1) (layers *.Cu *.Mask))
  (pad 4 thru_hole circle (at 0 -7.62) (size 2 2) (drill 1) (layers *.Cu *.Mask))
  (pad 5 thru_hole circle (at 0 -10.16) (size 2 2) (drill 1) (layers *.Cu *.Mask))
  (pad 6 thru_hole circle (at 0 -12.7) (size 2 2) (drill 1) (layers *.Cu *.Mask))
  (pad 11 thru_hole rect (at 22.098 2.54) (size 2 2) (drill 1) (layers *.Cu *.Mask))
  (pad 12 thru_hole circle (at 22.098 0) (size 2 2) (drill 1) (layers *.Cu *.Mask))
  (pad 13 thru_hole circle (at 22.098 -2.54) (size 2 2) (drill 1) (layers *.Cu *.Mask))
  (pad 14 thru_hole circle (at 22.098 -5.08) (size 2 2) (drill 1) (layers *.Cu *.Mask))
  (pad 15 thru_hole circle (at 22.098 -7.62) (size 2 2) (drill 1) (layers *.Cu *.Mask))
  (pad 16 thru_hole circle (at 22.098 -10.16) (size 2 2) (drill 1) (layers *.Cu *.Mask))
)
