(module sk68-100sa (layer F.Cu) (tedit 5C2FC0F8)
  (fp_text reference REF** (at -7.112 6.604) (layer F.SilkS)
    (effects (font (size 1 1) (thickness 0.15)))
  )
  (fp_text value sk68-100sa (at 9.144 6.604) (layer F.Fab)
    (effects (font (size 1 1) (thickness 0.15)))
  )
  (fp_line (start -10 -25) (end 90.000201 -25) (layer F.SilkS) (width 0.2))
  (fp_line (start -10 -31.60001) (end 90.000201 -31.60001) (layer F.SilkS) (width 0.2))
  (fp_line (start -10 1.900056) (end 90.000201 1.900056) (layer F.SilkS) (width 0.2))
  (fp_line (start -10 -32.200013) (end 90.000201 -32.200013) (layer F.SilkS) (width 0.2))
  (fp_line (start -10 -34.900018) (end 90.000201 -34.900018) (layer F.SilkS) (width 0.2))
  (fp_line (start -10 4.600061) (end 90.000201 4.600061) (layer F.SilkS) (width 0.2))
  (fp_line (start -10 5.200063) (end 90.000201 5.200063) (layer F.SilkS) (width 0.2))
  (fp_line (start -10 -0.69995) (end 90.000201 -0.69995) (layer F.SilkS) (width 0.2))
  (fp_line (start -10 -3.399955) (end 90.000201 -3.399955) (layer F.SilkS) (width 0.2))
  (fp_line (start -10 -11.19997) (end 90.000201 -11.19997) (layer F.SilkS) (width 0.2))
  (fp_line (start -10 -17.499983) (end 90.000201 -17.499983) (layer F.SilkS) (width 0.2))
  (fp_line (start -10 5.200063) (end -10 -40.800028) (layer F.SilkS) (width 0.2))
  (fp_line (start -10 -40.800028) (end 90.000201 -40.800028) (layer F.SilkS) (width 0.2))
  (fp_line (start 90.000201 5.200063) (end 90.000201 -40.800028) (layer F.SilkS) (width 0.2))
  (fp_line (start -10 -37.500023) (end 90.000201 -37.500023) (layer F.SilkS) (width 0.2))
  (fp_line (start -10 -40.200026) (end 90.000201 -40.200026) (layer F.SilkS) (width 0.2))
  (fp_line (start -10 -3.999957) (end 90.000201 -3.999957) (layer F.SilkS) (width 0.2))
  (fp_line (start -10 -10.599967) (end 90.000201 -10.599967) (layer F.SilkS) (width 0.2))
  (fp_line (start -10 -18.099985) (end 90.000201 -18.099985) (layer F.SilkS) (width 0.2))
  (fp_line (start -10 -24.399998) (end 90.000201 -24.399998) (layer F.SilkS) (width 0.2))
  (pad 1 thru_hole circle (at 0 0) (size 6 6) (drill 3.2) (layers *.Cu *.Mask))
  (pad 2 thru_hole circle (at 40 0) (size 6 6) (drill 3.2) (layers *.Cu *.Mask))
  (pad 3 thru_hole circle (at 80 0) (size 6 6) (drill 3.2) (layers *.Cu *.Mask))
  (pad 4 thru_hole circle (at 80 -35.6) (size 6 6) (drill 3.2) (layers *.Cu *.Mask))
  (pad 5 thru_hole circle (at 40 -35.6) (size 6 6) (drill 3.2) (layers *.Cu *.Mask))
  (pad 6 thru_hole circle (at 0 -35.6) (size 6 6) (drill 3.2) (layers *.Cu *.Mask))
)
