(module L_Toroid_Vertical_L54.0mm_W23.8mm_P20.10mm_Bourns_5700 (layer F.Cu) (tedit 5EEA06AC)
  (descr "L_Toroid, Vertical series, Radial, pin pitch=20.10mm, , length*width=54*23.8mm^2, Bourns, 5700, http://www.bourns.com/docs/Product-Datasheets/5700_series.pdf")
  (tags "L_Toroid Vertical series Radial pin pitch 20.10mm  length 54mm width 23.8mm Bourns 5700")
  (fp_text reference REF** (at 0 -3.1) (layer F.SilkS)
    (effects (font (size 1 1) (thickness 0.15)))
  )
  (fp_text value L_Toroid_Vertical_L54.0mm_W23.8mm_P20.10mm_Bourns_5700 (at 0 23.2) (layer F.Fab)
    (effects (font (size 1 1) (thickness 0.15)))
  )
  (fp_text user %R (at 10.05 0) (layer F.Fab)
    (effects (font (size 1 1) (thickness 0.15)))
  )
  (fp_line (start 27.25 -2.1) (end -27.25 -2.1) (layer F.CrtYd) (width 0.05))
  (fp_line (start 27.25 22.21) (end 27.25 -2.1) (layer F.CrtYd) (width 0.05))
  (fp_line (start -27.25 22.21) (end 27.25 22.21) (layer F.CrtYd) (width 0.05))
  (fp_line (start -27.25 -2.1) (end -27.25 22.21) (layer F.CrtYd) (width 0.05))
  (fp_line (start 27.12 -1.97) (end 27.12 22.07) (layer F.SilkS) (width 0.12))
  (fp_line (start -27.12 -1.97) (end -27.12 22.07) (layer F.SilkS) (width 0.12))
  (fp_line (start 0.725 22.07) (end 27.12 22.07) (layer F.SilkS) (width 0.12))
  (fp_line (start -27.12 22.07) (end -0.725 22.07) (layer F.SilkS) (width 0.12))
  (fp_line (start 0.725 -1.97) (end 27.12 -1.97) (layer F.SilkS) (width 0.12))
  (fp_line (start -27.12 -1.97) (end -0.725 -1.97) (layer F.SilkS) (width 0.12))
  (fp_line (start 21.6 -1.85) (end 24.3 21.95) (layer F.Fab) (width 0.1))
  (fp_line (start 16.2 -1.85) (end 18.9 21.95) (layer F.Fab) (width 0.1))
  (fp_line (start 10.8 -1.85) (end 13.5 21.95) (layer F.Fab) (width 0.1))
  (fp_line (start 5.4 -1.85) (end 8.1 21.95) (layer F.Fab) (width 0.1))
  (fp_line (start 0 -1.85) (end 2.7 21.95) (layer F.Fab) (width 0.1))
  (fp_line (start -5.4 -1.85) (end -2.7 21.95) (layer F.Fab) (width 0.1))
  (fp_line (start -10.8 -1.85) (end -8.1 21.95) (layer F.Fab) (width 0.1))
  (fp_line (start -16.2 -1.85) (end -13.5 21.95) (layer F.Fab) (width 0.1))
  (fp_line (start -21.6 -1.85) (end -18.9 21.95) (layer F.Fab) (width 0.1))
  (fp_line (start -27 -1.85) (end -24.3 21.95) (layer F.Fab) (width 0.1))
  (fp_line (start 27 -1.85) (end -27 -1.85) (layer F.Fab) (width 0.1))
  (fp_line (start 27 21.95) (end 27 -1.85) (layer F.Fab) (width 0.1))
  (fp_line (start -27 21.95) (end 27 21.95) (layer F.Fab) (width 0.1))
  (fp_line (start -27 -1.85) (end -27 21.95) (layer F.Fab) (width 0.1))
  (pad 1 thru_hole circle (at 0 0) (size 4 4) (drill 2) (layers *.Cu *.Mask))
  (pad 2 thru_hole circle (at 0 20.1) (size 4 4) (drill 2) (layers *.Cu *.Mask))
  (model /home/jat/Dropbox/Projekty/Elektrika/Elektronika/_KiCAD_Library/3D/L-TOR54W24P20.step
    (at (xyz 0 0 0))
    (scale (xyz 1 1 1))
    (rotate (xyz 0 0 0))
  )
)
