#VRML V2.0 utf8
#Exported from Wings 3D 1.4.1
DEF cube1_copy6 Transform {
  children [
    Shape {
      appearance Appearance {
        material DEF PIN Material {
          diffuseColor 1.0 0.8403508771929825 0.3933333333333333
          emissiveColor 0.0 0.0 0.0
          specularColor 1.0 1.0 1.0
          ambientIntensity 0.7675736961451247
          transparency 0.0
          shininess 1.0
        }
      }
      geometry IndexedFaceSet {
        normalPerVertex TRUE
        coord Coordinate { point [
          1.374013 -0.12598399999999993 4.272917798412013,
          1.374013 0.12598399999999993 4.272917798412013,
          1.6259810000000003 0.12598399999999993 4.272917798412013,
          1.6259810000000003 -0.12598399999999993 4.272917798412013,
          1.374013 -0.12598399999999993 -1.2414277984117563,
          1.374013 0.12598399999999993 -1.2414277984117563,
          1.6259810000000003 0.12598399999999993 -1.2414277984117563,
          1.6259810000000003 -0.12598399999999993 -1.2414277984117563,
          1.4317952015881152 0.06820179841175635 4.3307,
          1.4317952015881152 -0.06820179841175635 4.3307,
          1.5681987984118846 -0.06820179841175635 4.3307,
          1.5681987984118846 0.06820179841175635 4.3307,
          1.4317952015881152 -0.06820179841175635 -1.29921,
          1.4317952015881152 0.06820179841175635 -1.29921,
          1.5681987984118846 0.06820179841175635 -1.29921,
          1.5681987984118846 -0.06820179841175635 -1.29921 ] }
        coordIndex [
          0, 1, 5, 4, -1,
          0, 3, 10, 9, -1,
          0, 4, 7, 3, -1,
          0, 9, 8, 1, -1,
          1, 2, 6, 5, -1,
          1, 8, 11, 2, -1,
          2, 3, 7, 6, -1,
          2, 11, 10, 3, -1,
          4, 5, 13, 12, -1,
          4, 12, 15, 7, -1,
          5, 6, 14, 13, -1,
          6, 7, 15, 14, -1,
          8, 9, 10, 11, -1,
          12, 13, 14, 15, -1 ]
        normal Normal { vector [
          -0.6101314768985794 -0.6101314768982989 0.5054494651253069,
          -0.6101314768985794 0.6101314768982989 0.5054494651253069,
          0.6101314768985785 0.6101314768982989 0.5054494651253079,
          0.6101314768985785 -0.6101314768982989 0.5054494651253079,
          -0.6101314768990678 -0.6101314768987873 -0.5054494651241279,
          -0.6101314768990678 0.6101314768987873 -0.5054494651241279,
          0.6101314768990668 0.6101314768987873 -0.5054494651241289,
          0.6101314768990668 -0.6101314768987873 -0.5054494651241289,
          -0.2705980500726407 0.2705980500723404 0.9238795325116429,
          -0.2705980500726407 -0.2705980500723404 0.9238795325116429,
          0.27059805007263954 -0.2705980500723402 0.9238795325116432,
          0.27059805007263954 0.2705980500723402 0.9238795325116432,
          -0.2705980500734521 -0.27059805007315185 -0.9238795325111675,
          -0.2705980500734521 0.27059805007315185 -0.9238795325111675,
          0.27059805007345095 0.27059805007315163 -0.923879532511168,
          0.27059805007345095 -0.27059805007315163 -0.923879532511168 ] }
        normalIndex [
          0, 1, 5, 4, -1,
          0, 3, 10, 9, -1,
          0, 4, 7, 3, -1,
          0, 9, 8, 1, -1,
          1, 2, 6, 5, -1,
          1, 8, 11, 2, -1,
          2, 3, 7, 6, -1,
          2, 11, 10, 3, -1,
          4, 5, 13, 12, -1,
          4, 12, 15, 7, -1,
          5, 6, 14, 13, -1,
          6, 7, 15, 14, -1,
          8, 9, 10, 11, -1,
          12, 13, 14, 15, -1 ]
      }
    }
  ]
}

DEF cube1_copy5 Transform {
  children [
    Shape {
      appearance Appearance {
        material USE PIN
      }
      geometry IndexedFaceSet {
        normalPerVertex TRUE
        coord Coordinate { point [
          0.3740149999999999 -0.12598399999999993 4.272917798412013,
          0.3740149999999999 0.12598399999999993 4.272917798412013,
          0.6259830000000001 0.12598399999999993 4.272917798412013,
          0.6259830000000001 -0.12598399999999993 4.272917798412013,
          0.3740149999999999 -0.12598399999999993 -1.2414277984117563,
          0.3740149999999999 0.12598399999999993 -1.2414277984117563,
          0.6259830000000001 0.12598399999999993 -1.2414277984117563,
          0.6259830000000001 -0.12598399999999993 -1.2414277984117563,
          0.4317972015881153 0.06820179841175635 4.3307,
          0.4317972015881153 -0.06820179841175635 4.3307,
          0.5682007984118846 -0.06820179841175635 4.3307,
          0.5682007984118846 0.06820179841175635 4.3307,
          0.4317972015881153 -0.06820179841175635 -1.29921,
          0.4317972015881153 0.06820179841175635 -1.29921,
          0.5682007984118846 0.06820179841175635 -1.29921,
          0.5682007984118846 -0.06820179841175635 -1.29921 ] }
        coordIndex [
          0, 1, 5, 4, -1,
          0, 3, 10, 9, -1,
          0, 4, 7, 3, -1,
          0, 9, 8, 1, -1,
          1, 2, 6, 5, -1,
          1, 8, 11, 2, -1,
          2, 3, 7, 6, -1,
          2, 11, 10, 3, -1,
          4, 5, 13, 12, -1,
          4, 12, 15, 7, -1,
          5, 6, 14, 13, -1,
          6, 7, 15, 14, -1,
          8, 9, 10, 11, -1,
          12, 13, 14, 15, -1 ]
        normal Normal { vector [
          -0.6101314768985793 -0.6101314768982989 0.5054494651253071,
          -0.6101314768985793 0.6101314768982989 0.5054494651253071,
          0.6101314768985793 0.6101314768982989 0.5054494651253071,
          0.6101314768985793 -0.6101314768982989 0.5054494651253071,
          -0.6101314768990674 -0.6101314768987872 -0.5054494651241281,
          -0.6101314768990674 0.6101314768987872 -0.5054494651241281,
          0.6101314768990674 0.6101314768987872 -0.5054494651241281,
          0.6101314768990674 -0.6101314768987872 -0.5054494651241281,
          -0.27059805007264043 0.2705980500723403 0.923879532511643,
          -0.27059805007264043 -0.2705980500723403 0.923879532511643,
          0.27059805007264043 -0.2705980500723403 0.923879532511643,
          0.27059805007264043 0.2705980500723403 0.923879532511643,
          -0.2705980500734519 -0.27059805007315185 -0.9238795325111677,
          -0.27059805007345183 0.27059805007315174 -0.9238795325111676,
          0.2705980500734519 0.27059805007315185 -0.9238795325111677,
          0.2705980500734519 -0.27059805007315185 -0.9238795325111677 ] }
        normalIndex [
          0, 1, 5, 4, -1,
          0, 3, 10, 9, -1,
          0, 4, 7, 3, -1,
          0, 9, 8, 1, -1,
          1, 2, 6, 5, -1,
          1, 8, 11, 2, -1,
          2, 3, 7, 6, -1,
          2, 11, 10, 3, -1,
          4, 5, 13, 12, -1,
          4, 12, 15, 7, -1,
          5, 6, 14, 13, -1,
          6, 7, 15, 14, -1,
          8, 9, 10, 11, -1,
          12, 13, 14, 15, -1 ]
      }
    }
  ]
}

DEF cube1_sep4 Transform {
  children [
    Shape {
      appearance Appearance {
        material DEF Body Material {
          diffuseColor 1.0 1.0 0.8733333333333333
          emissiveColor 0.26073999999999997 0.26073999999999997 0.20859200000000006
          specularColor 0.29404 0.29404 0.29404
          ambientIntensity 0.9755555555555556
          transparency 0.0
          shininess 1.0
        }
      }
      geometry IndexedFaceSet {
        normalPerVertex TRUE
        coord Coordinate { point [
          -1.999996 -1.2834619999999999 1.29921,
          -1.999996 0.999998 1.29921,
          1.999996 0.999998 1.29921,
          1.999996 -1.2834619999999999 1.29921,
          -1.999996 -1.2834619999999999 0.0,
          -1.999996 0.999998 0.0,
          1.999996 0.999998 0.0,
          1.999996 -1.2834619999999999 0.0 ] }
        coordIndex [
          0, 1, 5, 4, -1,
          0, 3, 2, 1, -1,
          0, 4, 7, 3, -1,
          1, 2, 6, 5, -1,
          2, 3, 7, 6, -1,
          4, 5, 6, 7, -1 ]
        normal Normal { vector [
          -0.5773502691896258 -0.5773502691896258 0.5773502691896258,
          -0.5773502691896258 0.5773502691896258 0.5773502691896258,
          0.5773502691896258 0.5773502691896258 0.5773502691896258,
          0.5773502691896258 -0.5773502691896258 0.5773502691896258,
          -0.5773502691896258 -0.5773502691896258 -0.5773502691896258,
          -0.5773502691896258 0.5773502691896258 -0.5773502691896258,
          0.5773502691896258 0.5773502691896258 -0.5773502691896258,
          0.5773502691896258 -0.5773502691896258 -0.5773502691896258 ] }
        normalIndex [
          0, 1, 5, 4, -1,
          0, 3, 2, 1, -1,
          0, 4, 7, 3, -1,
          1, 2, 6, 5, -1,
          2, 3, 7, 6, -1,
          4, 5, 6, 7, -1 ]
      }
    }
  ]
}

DEF cube1_sep3 Transform {
  children [
    Shape {
      appearance Appearance {
        material USE Body
      }
      geometry IndexedFaceSet {
        normalPerVertex TRUE
        coord Coordinate { point [
          -1.499997 0.999998 1.29921,
          -1.499997 0.606298 1.29921,
          1.499997 0.606298 1.29921,
          1.499997 0.999998 1.29921,
          -1.3425169999996676 0.999998 4.488179999999999,
          -1.499997 0.999998 4.330700000000366,
          -1.3425169999996676 0.606298 4.488179999999999,
          -1.499997 0.606298 4.330700000000366,
          1.3425169999996676 0.606298 4.488179999999999,
          1.499997 0.606298 4.330700000000366,
          1.3425169999996676 0.999998 4.488179999999999,
          1.499997 0.999998 4.330700000000366 ] }
        coordIndex [
          0, 1, 7, 5, -1,
          0, 3, 2, 1, -1,
          0, 5, 4, 10, 11, 3, -1,
          1, 2, 9, 8, 6, 7, -1,
          2, 3, 11, 9, -1,
          4, 5, 7, 6, -1,
          4, 6, 8, 10, -1,
          8, 9, 11, 10, -1 ]
        normal Normal { vector [
          -0.5773502691896258 0.5773502691896258 -0.5773502691896258,
          -0.5773502691896258 -0.5773502691896258 -0.5773502691896258,
          0.5773502691896258 -0.5773502691896258 -0.5773502691896258,
          0.5773502691896258 0.5773502691896258 -0.5773502691896258,
          -0.3365567705899101 0.47596314947779855 0.8125199200692039,
          -0.8125199200682869 0.4759631494781373 0.3365567705916449,
          -0.3365567705899101 -0.47596314947779855 0.8125199200692039,
          -0.8125199200682869 -0.4759631494781373 0.3365567705916449,
          0.3365567705899101 -0.47596314947779855 0.8125199200692039,
          0.8125199200682869 -0.4759631494781373 0.3365567705916449,
          0.3365567705899101 0.47596314947779855 0.8125199200692039,
          0.8125199200682869 0.4759631494781373 0.3365567705916449 ] }
        normalIndex [
          0, 1, 7, 5, -1,
          0, 3, 2, 1, -1,
          0, 5, 4, 10, 11, 3, -1,
          1, 2, 9, 8, 6, 7, -1,
          2, 3, 11, 9, -1,
          4, 5, 7, 6, -1,
          4, 6, 8, 10, -1,
          8, 9, 11, 10, -1 ]
      }
    }
  ]
}

DEF cube1_sep2 Transform {
  children [
    Shape {
      appearance Appearance {
        material USE PIN
      }
      geometry IndexedFaceSet {
        normalPerVertex TRUE
        coord Coordinate { point [
          -1.6259810000000003 -0.12598399999999993 4.272917798412013,
          -1.6259810000000003 0.12598399999999993 4.272917798412013,
          -1.374013 0.12598399999999993 4.272917798412013,
          -1.374013 -0.12598399999999993 4.272917798412013,
          -1.6259810000000003 -0.12598399999999993 -1.2414277984117563,
          -1.6259810000000003 0.12598399999999993 -1.2414277984117563,
          -1.374013 0.12598399999999993 -1.2414277984117563,
          -1.374013 -0.12598399999999993 -1.2414277984117563,
          -1.5681987984118846 0.06820179841175635 4.3307,
          -1.5681987984118846 -0.06820179841175635 4.3307,
          -1.4317952015881152 -0.06820179841175635 4.3307,
          -1.4317952015881152 0.06820179841175635 4.3307,
          -1.5681987984118846 -0.06820179841175635 -1.29921,
          -1.5681987984118846 0.06820179841175635 -1.29921,
          -1.4317952015881152 0.06820179841175635 -1.29921,
          -1.4317952015881152 -0.06820179841175635 -1.29921 ] }
        coordIndex [
          0, 1, 5, 4, -1,
          0, 3, 10, 9, -1,
          0, 4, 7, 3, -1,
          0, 9, 8, 1, -1,
          1, 2, 6, 5, -1,
          1, 8, 11, 2, -1,
          2, 3, 7, 6, -1,
          2, 11, 10, 3, -1,
          4, 5, 13, 12, -1,
          4, 12, 15, 7, -1,
          5, 6, 14, 13, -1,
          6, 7, 15, 14, -1,
          8, 9, 10, 11, -1,
          12, 13, 14, 15, -1 ]
        normal Normal { vector [
          -0.6101314768985785 -0.6101314768982989 0.5054494651253079,
          -0.6101314768985785 0.6101314768982989 0.5054494651253079,
          0.6101314768985794 0.6101314768982989 0.5054494651253069,
          0.6101314768985794 -0.6101314768982989 0.5054494651253069,
          -0.6101314768990668 -0.6101314768987873 -0.5054494651241289,
          -0.6101314768990668 0.6101314768987873 -0.5054494651241289,
          0.6101314768990678 0.6101314768987873 -0.5054494651241279,
          0.6101314768990678 -0.6101314768987873 -0.5054494651241279,
          -0.27059805007263954 0.2705980500723402 0.9238795325116432,
          -0.27059805007263954 -0.2705980500723402 0.9238795325116432,
          0.2705980500726407 -0.2705980500723404 0.9238795325116429,
          0.2705980500726407 0.2705980500723404 0.9238795325116429,
          -0.27059805007345095 -0.27059805007315163 -0.923879532511168,
          -0.27059805007345095 0.27059805007315163 -0.923879532511168,
          0.2705980500734521 0.27059805007315185 -0.9238795325111675,
          0.2705980500734521 -0.27059805007315185 -0.9238795325111675 ] }
        normalIndex [
          0, 1, 5, 4, -1,
          0, 3, 10, 9, -1,
          0, 4, 7, 3, -1,
          0, 9, 8, 1, -1,
          1, 2, 6, 5, -1,
          1, 8, 11, 2, -1,
          2, 3, 7, 6, -1,
          2, 11, 10, 3, -1,
          4, 5, 13, 12, -1,
          4, 12, 15, 7, -1,
          5, 6, 14, 13, -1,
          6, 7, 15, 14, -1,
          8, 9, 10, 11, -1,
          12, 13, 14, 15, -1 ]
      }
    }
  ]
}

DEF cube1 Transform {
  children [
    Shape {
      appearance Appearance {
        material USE PIN
      }
      geometry IndexedFaceSet {
        normalPerVertex TRUE
        coord Coordinate { point [
          -0.6259830000000001 -0.12598399999999993 4.272917798412013,
          -0.6259830000000001 0.12598399999999993 4.272917798412013,
          -0.374015 0.12598399999999993 4.272917798412013,
          -0.374015 -0.12598399999999993 4.272917798412013,
          -0.6259830000000001 -0.12598399999999993 -1.2414277984117563,
          -0.6259830000000001 0.12598399999999993 -1.2414277984117563,
          -0.374015 0.12598399999999993 -1.2414277984117563,
          -0.374015 -0.12598399999999993 -1.2414277984117563,
          -0.5682007984118848 0.06820179841175635 4.3307,
          -0.5682007984118848 -0.06820179841175635 4.3307,
          -0.43179720158811524 -0.06820179841175635 4.3307,
          -0.43179720158811524 0.06820179841175635 4.3307,
          -0.5682007984118848 -0.06820179841175635 -1.29921,
          -0.5682007984118848 0.06820179841175635 -1.29921,
          -0.43179720158811524 0.06820179841175635 -1.29921,
          -0.43179720158811524 -0.06820179841175635 -1.29921 ] }
        coordIndex [
          0, 1, 5, 4, -1,
          0, 3, 10, 9, -1,
          0, 4, 7, 3, -1,
          0, 9, 8, 1, -1,
          1, 2, 6, 5, -1,
          1, 8, 11, 2, -1,
          2, 3, 7, 6, -1,
          2, 11, 10, 3, -1,
          4, 5, 13, 12, -1,
          4, 12, 15, 7, -1,
          5, 6, 14, 13, -1,
          6, 7, 15, 14, -1,
          8, 9, 10, 11, -1,
          12, 13, 14, 15, -1 ]
        normal Normal { vector [
          -0.6101314768985794 -0.6101314768982988 0.5054494651253069,
          -0.6101314768985794 0.6101314768982988 0.5054494651253069,
          0.6101314768985796 0.6101314768982988 0.5054494651253068,
          0.6101314768985796 -0.6101314768982988 0.5054494651253068,
          -0.6101314768990678 -0.6101314768987873 -0.5054494651241279,
          -0.6101314768990678 0.6101314768987873 -0.5054494651241279,
          0.6101314768990678 0.6101314768987872 -0.5054494651241278,
          0.6101314768990678 -0.6101314768987872 -0.5054494651241278,
          -0.2705980500726407 0.27059805007234033 0.9238795325116429,
          -0.2705980500726407 -0.27059805007234033 0.9238795325116429,
          0.2705980500726409 -0.2705980500723404 0.9238795325116428,
          0.2705980500726409 0.2705980500723404 0.9238795325116428,
          -0.2705980500734521 -0.2705980500731518 -0.9238795325111675,
          -0.2705980500734521 0.2705980500731518 -0.9238795325111675,
          0.27059805007345233 0.27059805007315185 -0.9238795325111675,
          0.27059805007345233 -0.27059805007315185 -0.9238795325111675 ] }
        normalIndex [
          0, 1, 5, 4, -1,
          0, 3, 10, 9, -1,
          0, 4, 7, 3, -1,
          0, 9, 8, 1, -1,
          1, 2, 6, 5, -1,
          1, 8, 11, 2, -1,
          2, 3, 7, 6, -1,
          2, 11, 10, 3, -1,
          4, 5, 13, 12, -1,
          4, 12, 15, 7, -1,
          5, 6, 14, 13, -1,
          6, 7, 15, 14, -1,
          8, 9, 10, 11, -1,
          12, 13, 14, 15, -1 ]
      }
    }
  ]
}

