PCBNEW-LibModule-V1  Čt 7. červen 2012, 19:16:03 CEST
# encoding utf-8
Units deci-mils
$INDEX
conn_3x2F
conn_3x2M
conn_3x2hM90
conn_5x1VM
conn_5x2F
conn_5x2FR
conn_5x2hM90
conn_8x2FR
conn_8x2hM90
$EndINDEX
$MODULE conn_3x2F
Po 0 0 0 15 4FD0DFF6 00000000 ~~
Li conn_3x2F
Sc 0
AR 
Op 0 0 0
T0 0 -1600 393 393 0 78 N V 21 N "conn_3x2FR"
T1 0 1900 393 393 0 78 N I 21 N "Value"
DS 1900 1200 1900 1500 100 21
DS 1900 1500 -1900 1500 100 21
DS -1900 1500 -1900 1200 100 21
DS 1900 -1200 1900 1200 100 21
DS 1750 -1000 1750 1000 100 21
DS 1900 1200 -1900 1200 100 21
DS -1900 1200 -1900 -1200 100 21
DS -1900 -1200 1900 -1200 100 21
DS -1750 -1000 1750 -1000 100 21
DS 1750 1000 -1750 1000 100 21
DS -1750 1000 -1750 -1000 100 21
$PAD
Sh "1" R 750 750 0 0 0
Dr 393 0 0
At STD N 00E0FFFF
Ne 0 ""
Po 1000 500
$EndPAD
$PAD
Sh "2" C 750 750 0 0 0
Dr 393 0 0
At STD N 00E0FFFF
Ne 0 ""
Po 1000 -500
$EndPAD
$PAD
Sh "3" C 750 750 0 0 0
Dr 393 0 0
At STD N 00E0FFFF
Ne 0 ""
Po 0 500
$EndPAD
$PAD
Sh "4" C 750 750 0 0 0
Dr 393 0 0
At STD N 00E0FFFF
Ne 0 ""
Po 0 -500
$EndPAD
$PAD
Sh "5" C 750 750 0 0 0
Dr 393 0 0
At STD N 00E0FFFF
Ne 0 ""
Po -1000 500
$EndPAD
$PAD
Sh "6" C 750 750 0 0 0
Dr 393 0 0
At STD N 00E0FFFF
Ne 0 ""
Po -1000 -500
$EndPAD
$EndMODULE conn_3x2F
$MODULE conn_3x2M
Po 0 0 0 15 4FD0E032 00000000 ~~
Li conn_3x2M
Sc 0
AR 
Op 0 0 0
T0 0 -1400 393 393 0 78 N V 21 N "conn_3x2M"
T1 0 1500 393 393 0 78 N I 21 N "Value"
DS -1750 -1000 1750 -1000 100 21
DS 1750 -1000 1750 1000 100 21
DS 1750 1000 -1750 1000 100 21
DS -1750 1000 -1750 -1000 100 21
$PAD
Sh "1" R 750 750 0 0 0
Dr 393 0 0
At STD N 00E0FFFF
Ne 0 ""
Po -1000 -500
$EndPAD
$PAD
Sh "2" C 750 750 0 0 0
Dr 393 0 0
At STD N 00E0FFFF
Ne 0 ""
Po -1000 500
$EndPAD
$PAD
Sh "3" C 750 750 0 0 0
Dr 393 0 0
At STD N 00E0FFFF
Ne 0 ""
Po 0 -500
$EndPAD
$PAD
Sh "4" C 750 750 0 0 0
Dr 393 0 0
At STD N 00E0FFFF
Ne 0 ""
Po 0 500
$EndPAD
$PAD
Sh "5" C 750 750 0 0 0
Dr 393 0 0
At STD N 00E0FFFF
Ne 0 ""
Po 1000 -500
$EndPAD
$PAD
Sh "6" C 750 750 0 0 0
Dr 393 0 0
At STD N 00E0FFFF
Ne 0 ""
Po 1000 500
$EndPAD
$EndMODULE conn_3x2M
$MODULE conn_3x2hM90
Po 0 0 0 15 4FD0E014 00000000 ~~
Li conn_3x2hM90
Sc 0
AR 
Op 0 0 0
T0 0 -1400 393 393 0 78 N V 21 N "conn_3x2hM90"
T1 0 3000 393 393 0 78 N I 21 N "Value"
DS -1500 -1000 -1500 1000 100 21
DS 1500 -1000 1500 1000 100 21
DS 1000 750 1000 2500 100 21
DS 0 750 0 2500 100 21
DS -1000 750 -1000 2500 100 21
DS 1750 1000 -1750 1000 100 21
DS -1750 -1000 1750 -1000 100 21
DS 1750 -1000 1750 1000 100 21
DS -1750 1000 -1750 -1000 100 21
$PAD
Sh "1" C 750 750 0 0 0
Dr 393 0 0
At STD N 00E0FFFF
Ne 0 ""
Po -1000 500
$EndPAD
$PAD
Sh "2" C 750 750 0 0 0
Dr 393 0 0
At STD N 00E0FFFF
Ne 0 ""
Po -1000 -500
$EndPAD
$PAD
Sh "3" C 750 750 0 0 0
Dr 393 0 0
At STD N 00E0FFFF
Ne 0 ""
Po 0 500
$EndPAD
$PAD
Sh "4" C 750 750 0 0 0
Dr 393 0 0
At STD N 00E0FFFF
Ne 0 ""
Po 0 -500
$EndPAD
$PAD
Sh "5" C 750 750 0 0 0
Dr 393 0 0
At STD N 00E0FFFF
Ne 0 ""
Po 1000 500
$EndPAD
$PAD
Sh "6" C 750 750 0 0 0
Dr 393 0 0
At STD N 00E0FFFF
Ne 0 ""
Po 1000 -500
$EndPAD
$EndMODULE conn_3x2hM90
$MODULE conn_5x1VM
Po 0 0 0 15 4FD0E059 00000000 ~~
Li conn_5x1VM
Sc 0
AR 
Op 0 0 0
T0 0 -900 393 393 0 78 N V 21 N "conn_5x1VM"
T1 0 1200 393 393 0 78 N I 21 N "VAL**"
DS -2500 500 -2500 750 50 21
DS -2500 750 2500 750 50 21
DS 2500 750 2500 500 50 21
DS -2500 -500 2500 -500 50 21
DS 2500 -500 2500 500 50 21
DS 2500 500 -2500 500 50 21
DS -2500 500 -2500 -500 50 21
$PAD
Sh "1" R 750 750 0 0 0
Dr 393 0 0
At STD N 00E0FFFF
Ne 0 ""
Po -2000 0
$EndPAD
$PAD
Sh "2" C 750 750 0 0 0
Dr 393 0 0
At STD N 00E0FFFF
Ne 0 ""
Po -1000 0
$EndPAD
$PAD
Sh "3" C 750 750 0 0 0
Dr 393 0 0
At STD N 00E0FFFF
Ne 0 ""
Po 0 0
$EndPAD
$PAD
Sh "4" C 750 750 0 0 0
Dr 393 0 0
At STD N 00E0FFFF
Ne 0 ""
Po 1000 0
$EndPAD
$PAD
Sh "5" C 750 750 0 0 0
Dr 393 0 0
At STD N 00E0FFFF
Ne 0 ""
Po 2000 0
$EndPAD
$SHAPE3D
Na "connectors/female_pcb_pin/female_pcb_pin_05.wrl"
Sc 1 1 1
Of 0 0 0
Ro 0 0 0
$EndSHAPE3D
$EndMODULE conn_5x1VM
$MODULE conn_5x2F
Po 0 0 0 15 4FD0E06B 00000000 ~~
Li conn_5x2F
Sc 0
AR 
Op 0 0 0
T0 0 -1600 393 393 0 78 N V 21 N "conn_5x2F"
T1 0 1900 393 393 0 78 N I 21 N "Value"
DS 2900 1200 2900 1500 100 21
DS 2900 1500 -2900 1500 100 21
DS -2900 1500 -2900 1200 100 21
DS 900 -1200 2900 -1200 100 21
DS 2900 -1200 2900 1100 100 21
DS 2900 1100 2900 1200 100 21
DS 2900 1200 900 1200 100 21
DS 750 -1000 2750 -1000 100 21
DS 2750 -1000 2750 1000 100 21
DS 2750 1000 750 1000 100 21
DS 900 1200 -2900 1200 100 21
DS -2900 1200 -2900 -1200 100 21
DS -2900 -1200 900 -1200 100 21
DS -2750 -1000 750 -1000 100 21
DS 750 1000 -2750 1000 100 21
DS -2750 1000 -2750 -1000 100 21
$PAD
Sh "1" R 750 750 0 0 0
Dr 393 0 0
At STD N 00E0FFFF
Ne 0 ""
Po -2000 -500
$EndPAD
$PAD
Sh "2" C 750 750 0 0 0
Dr 393 0 0
At STD N 00E0FFFF
Ne 0 ""
Po -2000 500
$EndPAD
$PAD
Sh "3" C 750 750 0 0 0
Dr 393 0 0
At STD N 00E0FFFF
Ne 0 ""
Po -1000 -500
$EndPAD
$PAD
Sh "4" C 750 750 0 0 0
Dr 393 0 0
At STD N 00E0FFFF
Ne 0 ""
Po -1000 500
$EndPAD
$PAD
Sh "5" C 750 750 0 0 0
Dr 393 0 0
At STD N 00E0FFFF
Ne 0 ""
Po 0 -500
$EndPAD
$PAD
Sh "6" C 750 750 0 0 0
Dr 393 0 0
At STD N 00E0FFFF
Ne 0 ""
Po 0 500
$EndPAD
$PAD
Sh "7" C 750 750 0 0 0
Dr 393 0 0
At STD N 00E0FFFF
Ne 0 ""
Po 1000 -500
$EndPAD
$PAD
Sh "8" C 750 750 0 0 0
Dr 393 0 0
At STD N 00E0FFFF
Ne 0 ""
Po 1000 500
$EndPAD
$PAD
Sh "9" C 750 750 0 0 0
Dr 393 0 0
At STD N 00E0FFFF
Ne 0 ""
Po 2000 -500
$EndPAD
$PAD
Sh "10" C 750 750 0 0 0
Dr 393 0 0
At STD N 00E0FFFF
Ne 0 ""
Po 2000 500
$EndPAD
$EndMODULE conn_5x2F
$MODULE conn_5x2FR
Po 0 0 0 15 4FD0DFDB 00000000 ~~
Li conn_5x2FR
Sc 0
AR 
Op 0 0 0
T0 0 -1600 393 393 0 78 N V 21 N "conn_5x2FR"
T1 0 1900 393 393 0 78 N I 21 N "Value"
DS 2900 1200 2900 1500 100 21
DS 2900 1500 -2900 1500 100 21
DS -2900 1500 -2900 1200 100 21
DS 900 -1200 2900 -1200 100 21
DS 2900 -1200 2900 1100 100 21
DS 2900 1100 2900 1200 100 21
DS 2900 1200 900 1200 100 21
DS 750 -1000 2750 -1000 100 21
DS 2750 -1000 2750 1000 100 21
DS 2750 1000 750 1000 100 21
DS 900 1200 -2900 1200 100 21
DS -2900 1200 -2900 -1200 100 21
DS -2900 -1200 900 -1200 100 21
DS -2750 -1000 750 -1000 100 21
DS 750 1000 -2750 1000 100 21
DS -2750 1000 -2750 -1000 100 21
$PAD
Sh "1" R 750 750 0 0 0
Dr 393 0 0
At STD N 00E0FFFF
Ne 0 ""
Po 2000 500
$EndPAD
$PAD
Sh "2" C 750 750 0 0 0
Dr 393 0 0
At STD N 00E0FFFF
Ne 0 ""
Po 2000 -500
$EndPAD
$PAD
Sh "3" C 750 750 0 0 0
Dr 393 0 0
At STD N 00E0FFFF
Ne 0 ""
Po 1000 500
$EndPAD
$PAD
Sh "4" C 750 750 0 0 0
Dr 393 0 0
At STD N 00E0FFFF
Ne 0 ""
Po 1000 -500
$EndPAD
$PAD
Sh "5" C 750 750 0 0 0
Dr 393 0 0
At STD N 00E0FFFF
Ne 0 ""
Po 0 500
$EndPAD
$PAD
Sh "6" C 750 750 0 0 0
Dr 393 0 0
At STD N 00E0FFFF
Ne 0 ""
Po 0 -500
$EndPAD
$PAD
Sh "7" C 750 750 0 0 0
Dr 393 0 0
At STD N 00E0FFFF
Ne 0 ""
Po -1000 500
$EndPAD
$PAD
Sh "8" C 750 750 0 0 0
Dr 393 0 0
At STD N 00E0FFFF
Ne 0 ""
Po -1000 -500
$EndPAD
$PAD
Sh "9" C 750 750 0 0 0
Dr 393 0 0
At STD N 00E0FFFF
Ne 0 ""
Po -2000 500
$EndPAD
$PAD
Sh "10" C 750 750 0 0 0
Dr 393 0 0
At STD N 00E0FFFF
Ne 0 ""
Po -2000 -500
$EndPAD
$EndMODULE conn_5x2FR
$MODULE conn_5x2hM90
Po 0 0 0 15 4FD0E0DA 00000000 ~~
Li conn_5x2hM90
Sc 0
AR 
Op 0 0 0
T0 0 -1400 393 393 0 78 N V 21 N "conn_5x2hM90"
T1 0 3000 393 393 0 78 N I 21 N "Value"
DS 2750 -1000 2750 1000 100 21
DS 2500 1000 2500 -1000 100 21
DS -2500 1000 -2500 -1000 100 21
DS 2750 1000 -2750 1000 100 21
DS 2000 750 2000 2500 100 21
DS 1000 750 1000 2500 100 21
DS 750 -1000 2750 -1000 100 21
DS 0 750 0 2500 100 21
DS -1000 750 -1000 2500 100 21
DS -2000 750 -2000 2500 100 21
DS -2750 -1000 750 -1000 100 21
DS -2750 1000 -2750 -1000 100 21
$PAD
Sh "1" R 750 750 0 0 0
Dr 393 0 0
At STD N 00E0FFFF
Ne 0 ""
Po -2000 500
$EndPAD
$PAD
Sh "2" C 750 750 0 0 0
Dr 393 0 0
At STD N 00E0FFFF
Ne 0 ""
Po -2000 -500
$EndPAD
$PAD
Sh "3" C 750 750 0 0 0
Dr 393 0 0
At STD N 00E0FFFF
Ne 0 ""
Po -1000 500
$EndPAD
$PAD
Sh "4" C 750 750 0 0 0
Dr 393 0 0
At STD N 00E0FFFF
Ne 0 ""
Po -1000 -500
$EndPAD
$PAD
Sh "5" C 750 750 0 0 0
Dr 393 0 0
At STD N 00E0FFFF
Ne 0 ""
Po 0 500
$EndPAD
$PAD
Sh "6" C 750 750 0 0 0
Dr 393 0 0
At STD N 00E0FFFF
Ne 0 ""
Po 0 -500
$EndPAD
$PAD
Sh "7" C 750 750 0 0 0
Dr 393 0 0
At STD N 00E0FFFF
Ne 0 ""
Po 1000 500
$EndPAD
$PAD
Sh "8" C 750 750 0 0 0
Dr 393 0 0
At STD N 00E0FFFF
Ne 0 ""
Po 1000 -500
$EndPAD
$PAD
Sh "9" C 750 750 0 0 0
Dr 393 0 0
At STD N 00E0FFFF
Ne 0 ""
Po 2000 500
$EndPAD
$PAD
Sh "10" C 750 750 0 0 0
Dr 393 0 0
At STD N 00E0FFFF
Ne 0 ""
Po 2000 -500
$EndPAD
$EndMODULE conn_5x2hM90
$MODULE conn_8x2FR
Po 0 0 0 15 4FD0E186 00000000 ~~
Li conn_8x2FR
Sc 0
AR 
Op 0 0 0
T0 0 -1600 393 393 0 78 N V 21 N "conn_8x2FR"
T1 0 2000 393 393 0 78 N I 21 N "Value"
DS -4150 1200 -4150 1500 100 21
DS 4150 1200 4150 1500 100 21
DS 4000 -1000 -4000 -1000 100 21
DS -4000 1000 4000 1000 100 21
DS 4150 1500 -4150 1500 100 21
DS 4150 1200 -4150 1200 100 21
DS -4150 -1200 4150 -1200 100 21
DS 4150 1200 4150 -1200 100 21
DS 4000 -1000 4000 1000 100 21
DS -4150 1200 -4150 -1200 100 21
DS -4000 1000 -4000 -1000 100 21
$PAD
Sh "1" R 750 750 0 0 0
Dr 393 0 0
At STD N 00E0FFFF
Ne 0 ""
Po 3500 500
$EndPAD
$PAD
Sh "2" C 750 750 0 0 0
Dr 393 0 0
At STD N 00E0FFFF
Ne 0 ""
Po 3500 -500
$EndPAD
$PAD
Sh "3" C 750 750 0 0 0
Dr 393 0 0
At STD N 00E0FFFF
Ne 0 ""
Po 2500 500
$EndPAD
$PAD
Sh "4" C 750 750 0 0 0
Dr 393 0 0
At STD N 00E0FFFF
Ne 0 ""
Po 2500 -500
$EndPAD
$PAD
Sh "5" C 750 750 0 0 0
Dr 393 0 0
At STD N 00E0FFFF
Ne 0 ""
Po 1500 500
$EndPAD
$PAD
Sh "6" C 750 750 0 0 0
Dr 393 0 0
At STD N 00E0FFFF
Ne 0 ""
Po 1500 -500
$EndPAD
$PAD
Sh "7" C 750 750 0 0 0
Dr 393 0 0
At STD N 00E0FFFF
Ne 0 ""
Po 500 500
$EndPAD
$PAD
Sh "8" C 750 750 0 0 0
Dr 393 0 0
At STD N 00E0FFFF
Ne 0 ""
Po 500 -500
$EndPAD
$PAD
Sh "9" C 750 750 0 0 0
Dr 393 0 0
At STD N 00E0FFFF
Ne 0 ""
Po -500 500
$EndPAD
$PAD
Sh "10" C 750 750 0 0 0
Dr 393 0 0
At STD N 00E0FFFF
Ne 0 ""
Po -500 -500
$EndPAD
$PAD
Sh "11" C 750 750 0 0 0
Dr 393 0 0
At STD N 00E0FFFF
Ne 0 ""
Po -1500 500
$EndPAD
$PAD
Sh "12" C 750 750 0 0 0
Dr 393 0 0
At STD N 00E0FFFF
Ne 0 ""
Po -1500 -500
$EndPAD
$PAD
Sh "13" C 750 750 0 0 0
Dr 393 0 0
At STD N 00E0FFFF
Ne 0 ""
Po -2500 500
$EndPAD
$PAD
Sh "14" C 750 750 0 0 0
Dr 393 0 0
At STD N 00E0FFFF
Ne 0 ""
Po -2500 -500
$EndPAD
$PAD
Sh "15" C 750 750 0 0 0
Dr 393 0 0
At STD N 00E0FFFF
Ne 0 ""
Po -3500 500
$EndPAD
$PAD
Sh "16" C 750 750 0 0 0
Dr 393 0 0
At STD N 00E0FFFF
Ne 0 ""
Po -3500 -500
$EndPAD
$EndMODULE conn_8x2FR
$MODULE conn_8x2hM90
Po 0 0 0 15 4FD0E1C6 00000000 ~~
Li conn_8x2hM90
Sc 0
AR 
Op 0 0 0
T0 0 -1400 393 393 0 78 N V 21 N "conn_8x2hM90"
T1 0 3000 393 393 0 78 N I 21 N "Value"
DS 4250 1000 4250 -1000 100 21
DS 4000 1000 4000 -1000 100 21
DS -4000 1000 -4000 -1000 100 21
DS 4250 1000 -4250 1000 100 21
DS 4250 -1000 4000 -1000 100 21
DS 3500 750 3500 2500 100 21
DS 2500 750 2500 2500 100 21
DS 1500 750 1500 2500 100 21
DS 1250 -1000 4000 -1000 100 21
DS 500 750 500 2500 100 21
DS -500 750 -500 2500 100 21
DS -750 -1000 1250 -1000 100 21
DS -1500 750 -1500 2500 100 21
DS -2500 750 -2500 2500 100 21
DS -3500 750 -3500 2500 100 21
DS -4250 -1000 -750 -1000 100 21
DS -4250 1000 -4250 -1000 100 21
$PAD
Sh "1" R 750 750 0 0 0
Dr 240 0 0
At STD N 00E0FFFF
Ne 0 ""
Po -3500 500
$EndPAD
$PAD
Sh "2" C 750 750 0 0 0
Dr 240 0 0
At STD N 00E0FFFF
Ne 0 ""
Po -3500 -500
$EndPAD
$PAD
Sh "3" C 750 750 0 0 0
Dr 240 0 0
At STD N 00E0FFFF
Ne 0 ""
Po -2500 500
$EndPAD
$PAD
Sh "4" C 750 750 0 0 0
Dr 240 0 0
At STD N 00E0FFFF
Ne 0 ""
Po -2500 -500
$EndPAD
$PAD
Sh "5" C 750 750 0 0 0
Dr 240 0 0
At STD N 00E0FFFF
Ne 0 ""
Po -1500 500
$EndPAD
$PAD
Sh "6" C 750 750 0 0 0
Dr 240 0 0
At STD N 00E0FFFF
Ne 0 ""
Po -1500 -500
$EndPAD
$PAD
Sh "7" C 750 750 0 0 0
Dr 240 0 0
At STD N 00E0FFFF
Ne 0 ""
Po -500 500
$EndPAD
$PAD
Sh "8" C 750 750 0 0 0
Dr 240 0 0
At STD N 00E0FFFF
Ne 0 ""
Po -500 -500
$EndPAD
$PAD
Sh "9" C 750 750 0 0 0
Dr 240 0 0
At STD N 00E0FFFF
Ne 0 ""
Po 500 500
$EndPAD
$PAD
Sh "10" C 750 750 0 0 0
Dr 240 0 0
At STD N 00E0FFFF
Ne 0 ""
Po 500 -500
$EndPAD
$PAD
Sh "11" C 750 750 0 0 0
Dr 240 0 0
At STD N 00E0FFFF
Ne 0 ""
Po 1500 500
$EndPAD
$PAD
Sh "13" C 750 750 0 0 0
Dr 240 0 0
At STD N 00E0FFFF
Ne 0 ""
Po 2500 500
$EndPAD
$PAD
Sh "14" C 750 750 0 0 0
Dr 240 0 0
At STD N 00E0FFFF
Ne 0 ""
Po 2500 -500
$EndPAD
$PAD
Sh "15" C 750 750 0 0 0
Dr 240 0 0
At STD N 00E0FFFF
Ne 0 ""
Po 3500 500
$EndPAD
$PAD
Sh "16" C 750 750 0 0 0
Dr 240 0 0
At STD N 00E0FFFF
Ne 0 ""
Po 3500 -500
$EndPAD
$PAD
Sh "12" C 750 750 0 0 0
Dr 240 0 0
At STD N 00E0FFFF
Ne 0 ""
Po 1500 -500
$EndPAD
$EndMODULE conn_8x2hM90
$EndLIBRARY
