PCBNEW-LibModule-V1  sab 15 ago 2009 13:13:28 CEST
$INDEX
DB_9M
DB_9F
DB_15F
DB_15M
DB_25F
DB_25M
$EndINDEX
$MODULE DB_9M
Po 0 0 0 15 49F1AC72 00000000 ~~
Li DB_9M
Cd D-SUB 9 pin plug, Tyco P/N 4-338168-2
Sc 00000000
AR
Op 0 0 0
T0 0 3000 600 600 0 120 N V 21 N"DB_9M"
T1 0 0 600 600 0 120 N V 21 N"JP***"
DS 4150 600 4150 -2000 150 21
DS 4150 -2000 4300 -2800 150 21
DS 4300 -2800 5550 -2800 150 21
DS 5550 -2800 5750 -1950 150 21
DS 5750 -1950 5750 600 150 21
DS -4300 -2800 -4100 -1950 150 21
DS -4100 -1950 -4100 600 150 21
DS -5800 600 -5800 -1900 150 21
DS -5800 -1900 -5550 -2800 150 21
DS -5550 -2800 -4300 -2800 150 21
DS 5850 600 4050 600 150 21
DS 4050 600 4050 700 150 21
DS 4050 700 5850 700 150 21
DS 5850 700 5850 600 150 21
DS -4000 600 -5900 600 150 21
DS -5900 600 -5900 700 150 21
DS -5900 700 -4000 700 150 21
DS -4000 700 -4000 600 150 21
DS 4500 750 4500 -250 150 21
DS 4500 -250 5400 -250 150 21
DS 5400 -250 5400 750 150 21
DS -5400 750 -5400 -250 150 21
DS -5400 -250 -4500 -250 150 21
DS -4500 -250 -4500 750 150 21
DS 3550 750 3550 -4100 150 21
DS -3550 750 -3550 -4100 150 21
DS -6100 750 6100 750 150 21
DS -4350 1800 -4350 4100 150 21
DS -5550 1800 -5550 4100 150 21
DS 5550 1800 5550 4100 150 21
DS 4350 1800 4350 4100 150 21
DS 3950 1800 3950 4100 150 21
DS 3950 4100 5950 4100 150 21
DS 5950 4100 5950 1850 150 21
DS -5950 1800 -5950 4100 150 21
DS -5950 4100 -3950 4100 150 21
DS -3950 4100 -3950 1850 150 21
DS -3200 1800 -3200 4100 150 21
DS -3200 4100 3200 4100 150 21
DS 3200 4100 3200 1800 150 21
DS -6100 1800 6100 1800 150 21
DS 6100 1800 6100 -4100 150 21
DS 6100 -4100 -6100 -4100 150 21
DS -6100 -4100 -6100 1800 150 21
$PAD
Sh "11" C 1969 1969 0 0 0
Dr 1260 0 0
At STD N 0000FFFF
Ne 0 ""
Po 4919 -2800
$EndPAD
$PAD
Sh "3" C 787 787 0 0 0
Dr 315 0 0
At STD N 0000FFFF
Ne 0 ""
Po 0 -3300
$EndPAD
$PAD
Sh "4" C 787 787 0 0 0
Dr 315 0 0
At STD N 0000FFFF
Ne 0 ""
Po 1091 -3300
$EndPAD
$PAD
Sh "5" C 787 787 0 0 0
Dr 315 0 0
At STD N 0000FFFF
Ne 0 ""
Po 2181 -3300
$EndPAD
$PAD
Sh "2" C 787 787 0 0 0
Dr 315 0 0
At STD N 0000FFFF
Ne 0 ""
Po -1091 -3300
$EndPAD
$PAD
Sh "1" C 787 787 0 0 0
Dr 315 0 0
At STD N 0000FFFF
Ne 0 ""
Po -2181 -3300
$EndPAD
$PAD
Sh "6" C 787 787 0 0 0
Dr 315 0 0
At STD N 0000FFFF
Ne 0 ""
Po -1636 -2300
$EndPAD
$PAD
Sh "7" C 787 787 0 0 0
Dr 315 0 0
At STD N 0000FFFF
Ne 0 ""
Po -545 -2300
$EndPAD
$PAD
Sh "8" C 787 787 0 0 0
Dr 315 0 0
At STD N 0000FFFF
Ne 0 ""
Po 545 -2300
$EndPAD
$PAD
Sh "9" C 787 787 0 0 0
Dr 315 0 0
At STD N 0000FFFF
Ne 0 ""
Po 1636 -2300
$EndPAD
$PAD
Sh "10" C 1969 1969 0 0 0
Dr 1260 0 0
At STD N 0000FFFF
Ne 0 ""
Po -4919 -2800
$EndPAD
$SHAPE3D
Na "walter\conn_d-sub\db_9m.wrl"
Sc 1.000000 1.000000 1.000000
Of 0.000000 0.000000 0.000000
Ro 0.000000 0.000000 0.000000
$EndSHAPE3D
$EndMODULE  DB_9M
$MODULE DB_9F
Po 0 0 0 15 49F1AC3F 00000000 ~~
Li DB_9F
Cd D-SUB 9 pin socket, Tyco P/N 4-1634584-2
Sc 00000000
AR
Op 0 0 0
T0 0 3000 600 600 0 120 N V 21 N"DB_9F"
T1 0 0 600 600 0 120 N V 21 N"JP***"
DS 4150 600 4150 -2000 150 21
DS 4150 -2000 4300 -2800 150 21
DS 4300 -2800 5550 -2800 150 21
DS 5550 -2800 5750 -1950 150 21
DS 5750 -1950 5750 600 150 21
DS -4300 -2800 -4100 -1950 150 21
DS -4100 -1950 -4100 600 150 21
DS -5800 600 -5800 -1900 150 21
DS -5800 -1900 -5550 -2800 150 21
DS -5550 -2800 -4300 -2800 150 21
DS 5850 600 4050 600 150 21
DS 4050 600 4050 700 150 21
DS 4050 700 5850 700 150 21
DS 5850 700 5850 600 150 21
DS -4000 600 -5900 600 150 21
DS -5900 600 -5900 700 150 21
DS -5900 700 -4000 700 150 21
DS -4000 700 -4000 600 150 21
DS 4500 750 4500 -250 150 21
DS 4500 -250 5400 -250 150 21
DS 5400 -250 5400 750 150 21
DS -5400 750 -5400 -250 150 21
DS -5400 -250 -4500 -250 150 21
DS -4500 -250 -4500 750 150 21
DS 3550 750 3550 -4100 150 21
DS -3550 750 -3550 -4100 150 21
DS -6100 750 6100 750 150 21
DS -4350 1800 -4350 4100 150 21
DS -5550 1800 -5550 4100 150 21
DS 5550 1800 5550 4100 150 21
DS 4350 1800 4350 4100 150 21
DS 3950 1800 3950 4100 150 21
DS 3950 4100 5950 4100 150 21
DS 5950 4100 5950 1850 150 21
DS -5950 1800 -5950 4100 150 21
DS -5950 4100 -3950 4100 150 21
DS -3950 4100 -3950 1850 150 21
DS -3200 1800 -3200 4100 150 21
DS -3200 4100 3200 4100 150 21
DS 3200 4100 3200 1800 150 21
DS -6100 1800 6100 1800 150 21
DS 6100 1800 6100 -4100 150 21
DS 6100 -4100 -6100 -4100 150 21
DS -6100 -4100 -6100 1800 150 21
$PAD
Sh "11" C 1969 1969 0 0 0
Dr 1260 0 0
At STD N 0000FFFF
Ne 0 ""
Po 4919 -2800
$EndPAD
$PAD
Sh "3" C 787 787 0 0 0
Dr 315 0 0
At STD N 0000FFFF
Ne 0 ""
Po 0 -3300
$EndPAD
$PAD
Sh "2" C 787 787 0 0 0
Dr 315 0 0
At STD N 0000FFFF
Ne 0 ""
Po 1091 -3300
$EndPAD
$PAD
Sh "1" C 787 787 0 0 0
Dr 315 0 0
At STD N 0000FFFF
Ne 0 ""
Po 2181 -3300
$EndPAD
$PAD
Sh "4" C 787 787 0 0 0
Dr 315 0 0
At STD N 0000FFFF
Ne 0 ""
Po -1091 -3300
$EndPAD
$PAD
Sh "5" C 787 787 0 0 0
Dr 315 0 0
At STD N 0000FFFF
Ne 0 ""
Po -2181 -3300
$EndPAD
$PAD
Sh "9" C 787 787 0 0 0
Dr 315 0 0
At STD N 0000FFFF
Ne 0 ""
Po -1636 -2300
$EndPAD
$PAD
Sh "8" C 787 787 0 0 0
Dr 315 0 0
At STD N 0000FFFF
Ne 0 ""
Po -545 -2300
$EndPAD
$PAD
Sh "7" C 787 787 0 0 0
Dr 315 0 0
At STD N 0000FFFF
Ne 0 ""
Po 545 -2300
$EndPAD
$PAD
Sh "6" C 787 787 0 0 0
Dr 315 0 0
At STD N 0000FFFF
Ne 0 ""
Po 1636 -2300
$EndPAD
$PAD
Sh "10" C 1969 1969 0 0 0
Dr 1260 0 0
At STD N 0000FFFF
Ne 0 ""
Po -4919 -2800
$EndPAD
$SHAPE3D
Na "walter\conn_d-sub\db_9f.wrl"
Sc 1.000000 1.000000 1.000000
Of 0.000000 0.000000 0.000000
Ro 0.000000 0.000000 0.000000
$EndSHAPE3D
$EndMODULE  DB_9F
$MODULE DB_15F
Po 0 0 0 15 49F2EA0D 00000000 ~~
Li DB_15F
Cd D-SUB 15 pin socket, Tyco P/N 5747845-5
Sc 00000000
AR
Op 0 0 0
T0 0 3000 600 600 0 120 N V 21 N"DB_15F"
T1 0 0 600 600 0 120 N V 21 N"JP***"
DS 4900 4100 -4900 4100 150 21
DS 7450 -1950 7175 -2800 150 21
DS 7175 -2800 5950 -2800 150 21
DS 5950 -2800 5750 -2000 150 21
DS 7550 600 5650 600 150 21
DS 5650 600 5650 700 150 21
DS 5650 700 7550 700 150 21
DS 7650 1800 7650 4100 150 21
DS -7750 1800 7750 1800 150 21
DS 7750 750 -7750 750 150 21
DS 7750 -4100 -7750 -4100 150 21
DS 5750 600 5750 -2000 150 21
DS 7450 -1950 7450 600 150 21
DS -5950 -2800 -5750 -1950 150 21
DS -5750 -1950 -5750 600 150 21
DS -7450 600 -7450 -1900 150 21
DS -7450 -1900 -7200 -2800 150 21
DS -7200 -2800 -5950 -2800 150 21
DS 5650 600 5650 700 150 21
DS 7550 700 7550 600 150 21
DS -5650 600 -7550 600 150 21
DS -7550 600 -7550 700 150 21
DS -7550 700 -5650 700 150 21
DS -5650 700 -5650 600 150 21
DS 6150 750 6150 -250 150 21
DS 6150 -250 7050 -250 150 21
DS 7050 -250 7050 750 150 21
DS -7050 750 -7050 -250 150 21
DS -7050 -250 -6150 -250 150 21
DS -6150 -250 -6150 750 150 21
DS 5250 750 5250 -4100 150 21
DS -5150 750 -5150 -4100 150 21
DS -6000 1800 -6000 4100 150 21
DS -7200 1800 -7200 4100 150 21
DS 7250 1800 7250 4100 150 21
DS 6050 1800 6050 4100 150 21
DS 5650 1800 5650 4100 150 21
DS 5650 4100 7650 4100 150 21
DS -7600 1800 -7600 4100 150 21
DS -7600 4100 -5600 4100 150 21
DS -5600 4100 -5600 1850 150 21
DS -4900 1800 -4900 4100 150 21
DS 4900 4100 4900 1800 150 21
DS 7750 1800 7750 -4100 150 21
DS -7750 -4100 -7750 1800 150 21
$PAD
Sh "17" C 1969 1969 0 0 0
Dr 1260 0 0
At STD N 0000FFFF
Ne 0 ""
Po 6560 -2800
$EndPAD
$PAD
Sh "3" C 787 787 0 0 0
Dr 315 0 0
At STD N 0000FFFF
Ne 0 ""
Po 1636 -3360
$EndPAD
$PAD
Sh "2" C 787 787 0 0 0
Dr 315 0 0
At STD N 0000FFFF
Ne 0 ""
Po 2726 -3360
$EndPAD
$PAD
Sh "1" C 787 787 0 0 0
Dr 315 0 0
At STD N 0000FFFF
Ne 0 ""
Po 3817 -3360
$EndPAD
$PAD
Sh "4" C 787 787 0 0 0
Dr 315 0 0
At STD N 0000FFFF
Ne 0 ""
Po 545 -3360
$EndPAD
$PAD
Sh "5" C 787 787 0 0 0
Dr 315 0 0
At STD N 0000FFFF
Ne 0 ""
Po -545 -3360
$EndPAD
$PAD
Sh "9" C 787 787 0 0 0
Dr 315 0 0
At STD N 0000FFFF
Ne 0 ""
Po 3272 -2240
$EndPAD
$PAD
Sh "8" C 787 787 0 0 0
Dr 315 0 0
At STD N 0000FFFF
Ne 0 ""
Po -3817 -3360
$EndPAD
$PAD
Sh "7" C 787 787 0 0 0
Dr 315 0 0
At STD N 0000FFFF
Ne 0 ""
Po -2726 -3360
$EndPAD
$PAD
Sh "6" C 787 787 0 0 0
Dr 315 0 0
At STD N 0000FFFF
Ne 0 ""
Po -1636 -3360
$EndPAD
$PAD
Sh "16" C 1969 1969 0 0 0
Dr 1260 0 0
At STD N 0000FFFF
Ne 0 ""
Po -6560 -2800
$EndPAD
$PAD
Sh "10" C 787 787 0 0 0
Dr 315 0 0
At STD N 0000FFFF
Ne 0 ""
Po 2181 -2240
$EndPAD
$PAD
Sh "11" C 787 787 0 0 0
Dr 315 0 0
At STD N 0000FFFF
Ne 0 ""
Po 1091 -2240
$EndPAD
$PAD
Sh "12" C 787 787 0 0 0
Dr 315 0 0
At STD N 0000FFFF
Ne 0 ""
Po 0 -2240
$EndPAD
$PAD
Sh "13" C 787 787 0 0 0
Dr 315 0 0
At STD N 0000FFFF
Ne 0 ""
Po -1091 -2240
$EndPAD
$PAD
Sh "14" C 787 787 0 0 0
Dr 315 0 0
At STD N 0000FFFF
Ne 0 ""
Po -2181 -2240
$EndPAD
$PAD
Sh "15" C 787 787 0 0 0
Dr 315 0 0
At STD N 0000FFFF
Ne 0 ""
Po -3272 -2240
$EndPAD
$SHAPE3D
Na "walter\conn_d-sub\db_15f.wrl"
Sc 1.000000 1.000000 1.000000
Of 0.000000 0.000000 0.000000
Ro 0.000000 0.000000 0.000000
$EndSHAPE3D
$EndMODULE  DB_15F
$MODULE DB_15M
Po 0 0 0 15 49F2C90B 00000000 ~~
Li DB_15M
Cd D-SUB 15 pin plug, Tyco P/N 5747841-6
Sc 00000000
AR
Op 0 0 0
T0 0 3000 600 600 0 120 N V 21 N"DB_15M"
T1 0 0 600 600 0 120 N V 21 N"JP***"
DS 4900 4100 -4900 4100 150 21
DS 7450 -1950 7175 -2800 150 21
DS 7175 -2800 5950 -2800 150 21
DS 5950 -2800 5750 -2000 150 21
DS 7550 600 5650 600 150 21
DS 5650 600 5650 700 150 21
DS 5650 700 7550 700 150 21
DS 7650 1800 7650 4100 150 21
DS -7750 1800 7750 1800 150 21
DS 7750 750 -7750 750 150 21
DS 7750 -4100 -7750 -4100 150 21
DS 5750 600 5750 -2000 150 21
DS 7450 -1950 7450 600 150 21
DS -5950 -2800 -5750 -1950 150 21
DS -5750 -1950 -5750 600 150 21
DS -7450 600 -7450 -1900 150 21
DS -7450 -1900 -7200 -2800 150 21
DS -7200 -2800 -5950 -2800 150 21
DS 5650 600 5650 700 150 21
DS 7550 700 7550 600 150 21
DS -5650 600 -7550 600 150 21
DS -7550 600 -7550 700 150 21
DS -7550 700 -5650 700 150 21
DS -5650 700 -5650 600 150 21
DS 6150 750 6150 -250 150 21
DS 6150 -250 7050 -250 150 21
DS 7050 -250 7050 750 150 21
DS -7050 750 -7050 -250 150 21
DS -7050 -250 -6150 -250 150 21
DS -6150 -250 -6150 750 150 21
DS 5250 750 5250 -4100 150 21
DS -5150 750 -5150 -4100 150 21
DS -6000 1800 -6000 4100 150 21
DS -7200 1800 -7200 4100 150 21
DS 7250 1800 7250 4100 150 21
DS 6050 1800 6050 4100 150 21
DS 5650 1800 5650 4100 150 21
DS 5650 4100 7650 4100 150 21
DS -7600 1800 -7600 4100 150 21
DS -7600 4100 -5600 4100 150 21
DS -5600 4100 -5600 1850 150 21
DS -4900 1800 -4900 4100 150 21
DS 4900 4100 4900 1800 150 21
DS 7750 1800 7750 -4100 150 21
DS -7750 -4100 -7750 1800 150 21
$PAD
Sh "17" C 1969 1969 0 0 0
Dr 1260 0 0
At STD N 0000FFFF
Ne 0 ""
Po 6560 -2800
$EndPAD
$PAD
Sh "6" C 787 787 0 0 0
Dr 315 0 0
At STD N 0000FFFF
Ne 0 ""
Po 1636 -3360
$EndPAD
$PAD
Sh "7" C 787 787 0 0 0
Dr 315 0 0
At STD N 0000FFFF
Ne 0 ""
Po 2726 -3360
$EndPAD
$PAD
Sh "8" C 787 787 0 0 0
Dr 315 0 0
At STD N 0000FFFF
Ne 0 ""
Po 3817 -3360
$EndPAD
$PAD
Sh "5" C 787 787 0 0 0
Dr 315 0 0
At STD N 0000FFFF
Ne 0 ""
Po 545 -3360
$EndPAD
$PAD
Sh "4" C 787 787 0 0 0
Dr 315 0 0
At STD N 0000FFFF
Ne 0 ""
Po -545 -3360
$EndPAD
$PAD
Sh "15" C 787 787 0 0 0
Dr 315 0 0
At STD N 0000FFFF
Ne 0 ""
Po 3272 -2240
$EndPAD
$PAD
Sh "1" C 787 787 0 0 0
Dr 315 0 0
At STD N 0000FFFF
Ne 0 ""
Po -3817 -3360
$EndPAD
$PAD
Sh "2" C 787 787 0 0 0
Dr 315 0 0
At STD N 0000FFFF
Ne 0 ""
Po -2726 -3360
$EndPAD
$PAD
Sh "3" C 787 787 0 0 0
Dr 315 0 0
At STD N 0000FFFF
Ne 0 ""
Po -1636 -3360
$EndPAD
$PAD
Sh "16" C 1969 1969 0 0 0
Dr 1260 0 0
At STD N 0000FFFF
Ne 0 ""
Po -6560 -2800
$EndPAD
$PAD
Sh "14" C 787 787 0 0 0
Dr 315 0 0
At STD N 0000FFFF
Ne 0 ""
Po 2181 -2240
$EndPAD
$PAD
Sh "13" C 787 787 0 0 0
Dr 315 0 0
At STD N 0000FFFF
Ne 0 ""
Po 1091 -2240
$EndPAD
$PAD
Sh "12" C 787 787 0 0 0
Dr 315 0 0
At STD N 0000FFFF
Ne 0 ""
Po 0 -2240
$EndPAD
$PAD
Sh "11" C 787 787 0 0 0
Dr 315 0 0
At STD N 0000FFFF
Ne 0 ""
Po -1091 -2240
$EndPAD
$PAD
Sh "10" C 787 787 0 0 0
Dr 315 0 0
At STD N 0000FFFF
Ne 0 ""
Po -2181 -2240
$EndPAD
$PAD
Sh "9" C 787 787 0 0 0
Dr 315 0 0
At STD N 0000FFFF
Ne 0 ""
Po -3272 -2240
$EndPAD
$SHAPE3D
Na "walter\conn_d-sub\db_15m.wrl"
Sc 1.000000 1.000000 1.000000
Of 0.000000 0.000000 0.000000
Ro 0.000000 0.000000 0.000000
$EndSHAPE3D
$EndMODULE  DB_15M
$MODULE DB_25F
Po 0 0 0 15 49F2F483 00000000 ~~
Li DB_25F
Cd D-SUB 25 pin socket, Tyco P/N 4-106507-2
Sc 00000000
AR
Op 0 0 0
T0 0 3000 600 600 0 120 N V 21 N"DB_25F"
T1 0 0 600 600 0 120 N V 21 N"JP***"
DS -7700 750 -7700 -4200 150 21
DS 7600 4100 -7600 4100 150 21
DS -8250 1800 -8250 4100 150 21
DS 8625 -2800 9875 -2800 150 21
DS 8375 -1900 8625 -2800 150 21
DS 8375 600 8375 -1900 150 21
DS 10075 -1950 10075 600 150 21
DS 9875 -2800 10075 -1950 150 21
DS 10500 1800 -10500 1800 150 21
DS -10500 750 10500 750 150 21
DS 10500 -4200 10500 1800 150 21
DS 10500 -4200 -10500 -4200 150 21
DS -10500 -4200 -10500 1800 150 21
DS 10175 600 8275 600 150 21
DS 8275 600 8275 700 150 21
DS 8275 700 10175 700 150 21
DS 10225 1800 10225 4100 150 21
DS -8600 -2800 -8400 -1950 150 21
DS -8400 -1950 -8400 600 150 21
DS -10100 600 -10100 -1900 150 21
DS -10100 -1900 -9850 -2800 150 21
DS -9850 -2800 -8600 -2800 150 21
DS 8275 600 8275 700 150 21
DS 10175 700 10175 600 150 21
DS -8300 600 -10200 600 150 21
DS -10200 600 -10200 700 150 21
DS -10200 700 -8300 700 150 21
DS -8300 700 -8300 600 150 21
DS 8775 750 8775 -250 150 21
DS 8775 -250 9675 -250 150 21
DS 9675 -250 9675 750 150 21
DS -9700 750 -9700 -250 150 21
DS -9700 -250 -8800 -250 150 21
DS -8800 -250 -8800 750 150 21
DS 7700 750 7700 -4100 150 21
DS -8650 1800 -8650 4100 150 21
DS -9850 1800 -9850 4100 150 21
DS 9825 1800 9825 4100 150 21
DS 8625 1800 8625 4100 150 21
DS 8225 1800 8225 4100 150 21
DS 8225 4100 10225 4100 150 21
DS -10250 1800 -10250 4100 150 21
DS -10250 4100 -8250 4100 150 21
DS -7600 1800 -7600 4100 150 21
DS 7600 4100 7600 1800 150 21
$PAD
Sh "27" C 1969 1969 0 0 0
Dr 1260 0 0
At STD N 0000FFFF
Ne 0 ""
Po 9252 -2800
$EndPAD
$PAD
Sh "3" C 787 787 0 0 0
Dr 315 0 0
At STD N 0000FFFF
Ne 0 ""
Po 4331 -3360
$EndPAD
$PAD
Sh "2" C 787 787 0 0 0
Dr 315 0 0
At STD N 0000FFFF
Ne 0 ""
Po 5453 -3360
$EndPAD
$PAD
Sh "1" C 787 787 0 0 0
Dr 315 0 0
At STD N 0000FFFF
Ne 0 ""
Po 6543 -3360
$EndPAD
$PAD
Sh "4" C 787 787 0 0 0
Dr 315 0 0
At STD N 0000FFFF
Ne 0 ""
Po 3272 -3360
$EndPAD
$PAD
Sh "5" C 787 787 0 0 0
Dr 315 0 0
At STD N 0000FFFF
Ne 0 ""
Po 2181 -3360
$EndPAD
$PAD
Sh "9" C 787 787 0 0 0
Dr 315 0 0
At STD N 0000FFFF
Ne 0 ""
Po -2181 -3360
$EndPAD
$PAD
Sh "8" C 787 787 0 0 0
Dr 315 0 0
At STD N 0000FFFF
Ne 0 ""
Po -1091 -3360
$EndPAD
$PAD
Sh "7" C 787 787 0 0 0
Dr 315 0 0
At STD N 0000FFFF
Ne 0 ""
Po 0 -3360
$EndPAD
$PAD
Sh "6" C 787 787 0 0 0
Dr 315 0 0
At STD N 0000FFFF
Ne 0 ""
Po 1091 -3360
$EndPAD
$PAD
Sh "26" C 1969 1969 0 0 0
Dr 1260 0 0
At STD N 0000FFFF
Ne 0 ""
Po -9252 -2800
$EndPAD
$PAD
Sh "10" C 787 787 0 0 0
Dr 315 0 0
At STD N 0000FFFF
Ne 0 ""
Po -3272 -3360
$EndPAD
$PAD
Sh "11" C 787 787 0 0 0
Dr 315 0 0
At STD N 00E0FFFF
Ne 0 ""
Po -4331 -3360
$EndPAD
$PAD
Sh "12" C 787 787 0 0 0
Dr 315 0 0
At STD N 00E0FFFF
Ne 0 ""
Po -5453 -3360
$EndPAD
$PAD
Sh "13" C 787 787 0 0 0
Dr 315 0 0
At STD N 00E0FFFF
Ne 0 ""
Po -6543 -3360
$EndPAD
$PAD
Sh "14" C 787 787 0 0 0
Dr 315 0 0
At STD N 0000FFFF
Ne 0 ""
Po 5998 -2240
$EndPAD
$PAD
Sh "15" C 787 787 0 0 0
Dr 315 0 0
At STD N 0000FFFF
Ne 0 ""
Po 4907 -2240
$EndPAD
$PAD
Sh "16" C 787 787 0 0 0
Dr 315 0 0
At STD N 0000FFFF
Ne 0 ""
Po 3817 -2240
$EndPAD
$PAD
Sh "17" C 787 787 0 0 0
Dr 315 0 0
At STD N 0000FFFF
Ne 0 ""
Po 2726 -2240
$EndPAD
$PAD
Sh "18" C 787 787 0 0 0
Dr 315 0 0
At STD N 0000FFFF
Ne 0 ""
Po 1636 -2240
$EndPAD
$PAD
Sh "19" C 787 787 0 0 0
Dr 315 0 0
At STD N 0000FFFF
Ne 0 ""
Po 545 -2240
$EndPAD
$PAD
Sh "20" C 787 787 0 0 0
Dr 315 0 0
At STD N 0000FFFF
Ne 0 ""
Po -545 -2240
$EndPAD
$PAD
Sh "21" C 787 787 0 0 0
Dr 315 0 0
At STD N 0000FFFF
Ne 0 ""
Po -1636 -2240
$EndPAD
$PAD
Sh "22" C 787 787 0 0 0
Dr 315 0 0
At STD N 0000FFFF
Ne 0 ""
Po -2726 -2240
$EndPAD
$PAD
Sh "23" C 787 787 0 0 0
Dr 315 0 0
At STD N 0000FFFF
Ne 0 ""
Po -3817 -2240
$EndPAD
$PAD
Sh "24" C 787 787 0 0 0
Dr 315 0 0
At STD N 0000FFFF
Ne 0 ""
Po -4907 -2240
$EndPAD
$PAD
Sh "25" C 787 787 0 0 0
Dr 315 0 0
At STD N 0000FFFF
Ne 0 ""
Po -5998 -2240
$EndPAD
$SHAPE3D
Na "walter\conn_d-sub\db_25f.wrl"
Sc 1.000000 1.000000 1.000000
Of 0.000000 0.000000 0.000000
Ro 0.000000 0.000000 0.000000
$EndSHAPE3D
$EndMODULE  DB_25F
$MODULE DB_25M
Po 0 0 0 15 49F2C87D 00000000 ~~
Li DB_25M
Cd D-SUB 25 pin plug, Tyco P/N 5747842-5
Sc 00000000
AR
Op 0 0 0
T0 0 3000 600 600 0 120 N V 21 N"DB_25M"
T1 0 0 600 600 0 120 N V 21 N"JP***"
DS -7700 750 -7700 -4200 150 21
DS 7600 4100 -7600 4100 150 21
DS -8250 1800 -8250 4100 150 21
DS 8625 -2800 9875 -2800 150 21
DS 8375 -1900 8625 -2800 150 21
DS 8375 600 8375 -1900 150 21
DS 10075 -1950 10075 600 150 21
DS 9875 -2800 10075 -1950 150 21
DS 10500 1800 -10500 1800 150 21
DS -10500 750 10500 750 150 21
DS 10500 -4200 10500 1800 150 21
DS 10500 -4200 -10500 -4200 150 21
DS -10500 -4200 -10500 1800 150 21
DS 10175 600 8275 600 150 21
DS 8275 600 8275 700 150 21
DS 8275 700 10175 700 150 21
DS 10225 1800 10225 4100 150 21
DS -8600 -2800 -8400 -1950 150 21
DS -8400 -1950 -8400 600 150 21
DS -10100 600 -10100 -1900 150 21
DS -10100 -1900 -9850 -2800 150 21
DS -9850 -2800 -8600 -2800 150 21
DS 8275 600 8275 700 150 21
DS 10175 700 10175 600 150 21
DS -8300 600 -10200 600 150 21
DS -10200 600 -10200 700 150 21
DS -10200 700 -8300 700 150 21
DS -8300 700 -8300 600 150 21
DS 8775 750 8775 -250 150 21
DS 8775 -250 9675 -250 150 21
DS 9675 -250 9675 750 150 21
DS -9700 750 -9700 -250 150 21
DS -9700 -250 -8800 -250 150 21
DS -8800 -250 -8800 750 150 21
DS 7700 750 7700 -4100 150 21
DS -8650 1800 -8650 4100 150 21
DS -9850 1800 -9850 4100 150 21
DS 9825 1800 9825 4100 150 21
DS 8625 1800 8625 4100 150 21
DS 8225 1800 8225 4100 150 21
DS 8225 4100 10225 4100 150 21
DS -10250 1800 -10250 4100 150 21
DS -10250 4100 -8250 4100 150 21
DS -7600 1800 -7600 4100 150 21
DS 7600 4100 7600 1800 150 21
$PAD
Sh "27" C 1969 1969 0 0 0
Dr 1260 0 0
At STD N 0000FFFF
Ne 0 ""
Po 9252 -2800
$EndPAD
$PAD
Sh "11" C 787 787 0 0 0
Dr 315 0 0
At STD N 00E0FFFF
Ne 0 ""
Po 4362 -3345
$EndPAD
$PAD
Sh "12" C 787 787 0 0 0
Dr 315 0 0
At STD N 00E0FFFF
Ne 0 ""
Po 5453 -3345
$EndPAD
$PAD
Sh "13" C 787 787 0 0 0
Dr 315 0 0
At STD N 00E0FFFF
Ne 0 ""
Po 6543 -3345
$EndPAD
$PAD
Sh "10" C 787 787 0 0 0
Dr 315 0 0
At STD N 00E0FFFF
Ne 0 ""
Po 3272 -3345
$EndPAD
$PAD
Sh "9" C 787 787 0 0 0
Dr 315 0 0
At STD N 00E0FFFF
Ne 0 ""
Po 2181 -3345
$EndPAD
$PAD
Sh "5" C 787 787 0 0 0
Dr 315 0 0
At STD N 00E0FFFF
Ne 0 ""
Po -2181 -3345
$EndPAD
$PAD
Sh "6" C 787 787 0 0 0
Dr 315 0 0
At STD N 00E0FFFF
Ne 0 ""
Po -1091 -3345
$EndPAD
$PAD
Sh "7" C 787 787 0 0 0
Dr 315 0 0
At STD N 00E0FFFF
Ne 0 ""
Po 0 -3345
$EndPAD
$PAD
Sh "8" C 787 787 0 0 0
Dr 315 0 0
At STD N 00E0FFFF
Ne 0 ""
Po 1091 -3345
$EndPAD
$PAD
Sh "26" C 1969 1969 0 0 0
Dr 1260 0 0
At STD N 0000FFFF
Ne 0 ""
Po -9252 -2800
$EndPAD
$PAD
Sh "4" C 787 787 0 0 0
Dr 315 0 0
At STD N 00E0FFFF
Ne 0 ""
Po -3272 -3345
$EndPAD
$PAD
Sh "3" C 787 787 0 0 0
Dr 315 0 0
At STD N 00E0FFFF
Ne 0 ""
Po -4362 -3345
$EndPAD
$PAD
Sh "2" C 787 787 0 0 0
Dr 315 0 0
At STD N 00E0FFFF
Ne 0 ""
Po -5453 -3345
$EndPAD
$PAD
Sh "1" C 787 787 0 0 0
Dr 315 0 0
At STD N 00E0FFFF
Ne 0 ""
Po -6543 -3345
$EndPAD
$PAD
Sh "25" C 787 787 0 0 0
Dr 315 0 0
At STD N 00E0FFFF
Ne 0 ""
Po 5998 -2255
$EndPAD
$PAD
Sh "24" C 787 787 0 0 0
Dr 315 0 0
At STD N 00E0FFFF
Ne 0 ""
Po 4907 -2255
$EndPAD
$PAD
Sh "23" C 787 787 0 0 0
Dr 315 0 0
At STD N 00E0FFFF
Ne 0 ""
Po 3817 -2255
$EndPAD
$PAD
Sh "22" C 787 787 0 0 0
Dr 315 0 0
At STD N 00E0FFFF
Ne 0 ""
Po 2726 -2255
$EndPAD
$PAD
Sh "21" C 787 787 0 0 0
Dr 315 0 0
At STD N 00E0FFFF
Ne 0 ""
Po 1636 -2255
$EndPAD
$PAD
Sh "20" C 787 787 0 0 0
Dr 315 0 0
At STD N 00E0FFFF
Ne 0 ""
Po 545 -2255
$EndPAD
$PAD
Sh "19" C 787 787 0 0 0
Dr 315 0 0
At STD N 00E0FFFF
Ne 0 ""
Po -545 -2255
$EndPAD
$PAD
Sh "18" C 787 787 0 0 0
Dr 315 0 0
At STD N 00E0FFFF
Ne 0 ""
Po -1636 -2255
$EndPAD
$PAD
Sh "17" C 787 787 0 0 0
Dr 315 0 0
At STD N 00E0FFFF
Ne 0 ""
Po -2726 -2255
$EndPAD
$PAD
Sh "16" C 787 787 0 0 0
Dr 315 0 0
At STD N 00E0FFFF
Ne 0 ""
Po -3817 -2255
$EndPAD
$PAD
Sh "15" C 787 787 0 0 0
Dr 315 0 0
At STD N 00E0FFFF
Ne 0 ""
Po -4907 -2255
$EndPAD
$PAD
Sh "14" C 787 787 0 0 0
Dr 315 0 0
At STD N 00E0FFFF
Ne 0 ""
Po -5998 -2255
$EndPAD
$SHAPE3D
Na "walter\conn_d-sub\db_25m.wrl"
Sc 1.000000 1.000000 1.000000
Of 0.000000 0.000000 0.000000
Ro 0.000000 0.000000 0.000000
$EndSHAPE3D
$EndMODULE  DB_25M
$EndLIBRARY
