PCBNEW-LibModule-V1  mer 17 ago 2011 10:53:19 CEST
$INDEX
Luxeon_Rebel
Cree_CLM3C
Cree_CLP6B
Cree_XP
Seoul_P5-II
Citizen_CL82x
Avago_Aveon
Avago_Jade
Cree_MC-E
Cree_ML-E
Cree_MX
Cree_XM
sharp_doubledome
osram_oslon
Cree_XR
Seoul_P4
Osram_GoldenDragon
Osram_GoldenDragonPlus
Osram_PlatinumDragon
Edison_Edixeon_A
Edison_Edixeon_RGB
Samsung_2323
Seoul_5630
$EndINDEX
$MODULE Cree_CLM3C
Po 0 0 0 15 4D0B7E6E 00000000 ~~
Li Cree_CLM3C
Sc 00000000
AR
Op 0 0 0
T0 0 -650 315 315 0 59 N V 21 N"LD**"
T1 0 709 315 315 0 59 N V 21 N"Cree_CLM3C"
DS -610 -217 -413 -413 150 21
DS -610 0 -610 -413 150 21
DS -610 -413 610 -413 150 21
DS 610 -413 610 413 150 21
DS 610 413 -610 413 150 21
DS -610 413 -610 0 150 21
$PAD
Sh "1" R 472 709 0 0 0
Dr 0 0 0
At SMD N 00888000
Ne 0 ""
Po -443 0
$EndPAD
$PAD
Sh "2" R 472 709 0 0 0
Dr 0 0 0
At SMD N 00888000
Ne 0 ""
Po 443 0
$EndPAD
$SHAPE3D
Na "walter\smd_leds\cree_clm3c.wrl"
Sc 1.000000 1.000000 1.000000
Of 0.000000 0.000000 0.000000
Ro 0.000000 0.000000 0.000000
$EndSHAPE3D
$EndMODULE  Cree_CLM3C
$MODULE Cree_CLP6B
Po 0 0 0 15 4D97062C 00000000 ~~
Li Cree_CLP6B
Cd Cree PLCC6 Led - CLP6B
Sc 00000000
AR
Op 0 0 0
T0 0 -1476 315 315 0 59 N V 21 N"LD**"
T1 0 1575 315 315 0 59 N V 21 N"Cree_CLP6B"
DS 984 -551 1142 -551 59 21
DS 1142 -551 1142 -1102 59 21
DS 1142 -1102 984 -1102 59 21
DS 984 276 1142 276 59 21
DS 1142 276 1142 -276 59 21
DS 1142 -276 984 -276 59 21
DS 1142 1102 1142 551 59 21
DS 1142 551 984 551 59 21
DS 984 1102 1142 1102 59 21
DS -984 551 -1142 551 59 21
DS -1142 551 -1142 1102 59 21
DS -1142 1102 -984 1102 59 21
DS -984 -276 -1142 -276 59 21
DS -1142 -276 -1142 276 59 21
DS -1142 276 -984 276 59 21
DS -984 -1102 -1142 -1102 59 21
DS -1142 -1102 -1142 -551 59 21
DS -1142 -551 -984 -551 59 21
DS -984 -1102 -906 -1181 59 21
DS -984 -1063 -866 -1181 59 21
DS -984 -1024 -827 -1181 59 21
DS -984 -984 -787 -1181 59 21
DS -984 -945 -748 -1181 59 21
DS -984 -906 -709 -1181 59 21
DC 0 0 -787 39 59 21
DS -984 -1181 -984 1181 59 21
DS -984 1181 984 1181 59 21
DS 984 1181 984 -1181 59 21
DS 984 -1181 -984 -1181 59 21
$PAD
Sh "2" R 787 689 0 0 0
Dr 0 0 0
At SMD N 00888000
Ne 0 ""
Po -709 0
$EndPAD
$PAD
Sh "5" R 787 689 0 0 0
Dr 0 0 0
At SMD N 00888000
Ne 0 ""
Po 709 0
$EndPAD
$PAD
Sh "1" R 787 689 0 0 0
Dr 0 0 0
At SMD N 00888000
Ne 0 ""
Po -709 -827
$EndPAD
$PAD
Sh "6" R 787 689 0 0 0
Dr 0 0 0
At SMD N 00888000
Ne 0 ""
Po 709 -827
$EndPAD
$PAD
Sh "3" R 787 689 0 0 0
Dr 0 0 0
At SMD N 00888000
Ne 0 ""
Po -709 827
$EndPAD
$PAD
Sh "4" R 787 689 0 0 0
Dr 0 0 0
At SMD N 00888000
Ne 0 ""
Po 709 827
$EndPAD
$SHAPE3D
Na "walter\smd_leds\cree_clp6b.wrl"
Sc 1.000000 1.000000 1.000000
Of 0.000000 0.000000 0.000000
Ro 0.000000 0.000000 0.000000
$EndSHAPE3D
$EndMODULE  Cree_CLP6B
$MODULE Citizen_CL82x
Po 0 0 0 15 4D970F5C 00000000 ~~
Li Citizen_CL82x
Cd Citizen_CL82x
Sc 00000000
AR
Op 0 0 0
T0 0 -394 315 315 0 59 N V 21 N"LD**"
T1 0 472 315 315 0 59 N V 21 N"Citizen_CL82x"
DA 157 0 197 -39 900 59 21
DA -157 0 -197 39 900 59 21
DA 0 -158 197 39 900 59 21
DA 0 158 -197 -39 900 59 21
DS -315 -157 315 -157 59 21
DS 315 -157 315 157 59 21
DS 315 157 -315 157 59 21
DS -315 157 -315 -157 59 21
$PAD
Sh "1" R 335 354 0 0 0
Dr 0 0 0
At SMD N 00888000
Ne 0 ""
Po -285 0
$EndPAD
$PAD
Sh "2" R 453 236 0 0 0
Dr 0 0 0
At SMD N 00888000
Ne 0 ""
Po 226 0
$EndPAD
$PAD
Sh "2" R 289 354 0 0 0
Dr 0 0 0
At SMD N 00888000
Ne 0 ""
Po 308 0
$EndPAD
$SHAPE3D
Na "walter\smd_leds\citizen_cl82x.wrl"
Sc 1.000000 1.000000 1.000000
Of 0.000000 0.000000 0.000000
Ro 0.000000 0.000000 0.000000
$EndSHAPE3D
$EndMODULE  Citizen_CL82x
$MODULE Avago_Aveon
Po 0 0 0 15 4D9725A5 00000000 ~~
Li Avago_Aveon
Cd Avago Aveon
Sc 00000000
AR
Op 0 0 0
T0 0 -1811 394 394 0 79 N V 21 N"LD?"
T1 0 1890 394 394 0 79 N V 21 N"Avago_Aveon"
DC 2205 -433 2087 -394 150 21
DS 2677 -748 1772 -748 150 21
DS 1772 -748 1772 -591 150 21
DS 1772 -591 1457 -591 150 21
DS 2677 -748 2677 -118 150 21
DS 2677 -118 1772 -118 150 21
DS 1772 -118 1772 -276 150 21
DS 1772 -276 1457 -276 150 21
DS -2677 748 -1772 748 150 21
DS -1772 748 -1772 591 150 21
DS -1772 591 -1457 591 150 21
DS -2677 748 -2677 118 150 21
DS -2677 118 -1772 118 150 21
DS -1772 118 -1772 276 150 21
DS -1772 276 -1457 276 150 21
DS -827 1339 -1102 1102 150 21
DS -1102 1102 -1339 827 150 21
DS 1339 827 1102 1102 150 21
DS 1102 1102 827 1339 150 21
DS 827 -1339 1102 -1102 150 21
DS 1102 -1102 1339 -827 150 21
DS 591 -1457 827 -1339 150 21
DS 1457 -591 1339 -827 150 21
DS 1457 591 1339 827 150 21
DS 591 1457 827 1339 150 21
DS -591 1457 -827 1339 150 21
DS -1457 591 -1339 827 150 21
DS -1457 -591 -1339 -827 150 21
DS -1339 -827 -1102 -1102 150 21
DS -1102 -1102 -827 -1339 150 21
DS -827 -1339 -591 -1457 150 21
DS 591 1457 -591 1457 150 21
DS 1457 -591 1457 591 150 21
DS -591 -1457 591 -1457 150 21
DS -1457 591 -1457 -591 150 21
DC 0 0 -1181 0 150 21
$PAD
Sh "2" R 1043 630 0 0 0
Dr 0 0 0
At SMD N 00888000
Ne 0 ""
Po 2254 -433
.SolderMask 39
.SolderPaste -20
$EndPAD
$PAD
Sh "1" R 1043 630 0 0 0
Dr 0 0 0
At SMD N 00888000
Ne 0 ""
Po -2254 433
.SolderMask 39
.SolderPaste -20
$EndPAD
$PAD
Sh "3" C 2520 2520 0 0 0
Dr 0 0 0
At SMD N 00888000
Ne 0 ""
Po 0 0
.SolderMask 39
.SolderPaste -20
$EndPAD
$SHAPE3D
Na "walter\smd_leds\avago_aveon.wrl"
Sc 1.000000 1.000000 1.000000
Of 0.000000 0.000000 0.000000
Ro 0.000000 0.000000 0.000000
$EndSHAPE3D
$EndMODULE  Avago_Aveon
$MODULE Avago_Jade
Po 0 0 0 15 4D973EDB 00000000 ~~
Li Avago_Jade
Cd Avago Jade
Sc 00000000
AR
Op 0 0 0
T0 0 -1102 394 394 0 79 N V 21 N"LD?"
T1 0 1181 394 394 0 79 N V 21 N"Avago_Jade"
DS 787 -394 394 -787 100 21
DS 512 -787 787 -512 100 21
DS 630 -787 787 -630 100 21
DC 0 0 -669 0 100 21
DS 984 0 787 0 100 21
DS 984 -512 787 -512 100 21
DS 984 512 787 512 100 21
DS -787 512 -984 512 100 21
DS -787 -512 -984 -512 100 21
DS -787 0 -984 0 100 21
DS -787 -787 787 -787 100 21
DS 787 -787 787 787 100 21
DS 787 787 -787 787 100 21
DS -787 787 -787 -787 100 21
$PAD
Sh "2" R 335 1354 0 0 0
Dr 0 0 0
At SMD N 00888000
Ne 0 ""
Po 856 0
.SolderMask 39
.SolderPaste -20
$EndPAD
$PAD
Sh "1" R 335 1354 0 0 0
Dr 0 0 0
At SMD N 00888000
Ne 0 ""
Po -857 0
.SolderMask 39
.SolderPaste -20
$EndPAD
$PAD
Sh "3" C 748 748 0 0 0
Dr 0 0 0
At SMD N 00888000
Ne 0 ""
Po 0 0
.SolderMask 39
.SolderPaste -20
$EndPAD
$SHAPE3D
Na "walter\smd_leds\avago_jade.wrl"
Sc 1.000000 1.000000 1.000000
Of 0.000000 0.000000 0.000000
Ro 0.000000 0.000000 0.000000
$EndSHAPE3D
$EndMODULE  Avago_Jade
$MODULE Cree_ML-E
Po 0 0 0 15 4D975311 00000000 ~~
Li Cree_ML-E
Cd Cree ML-E
Sc 00000000
AR
Op 0 0 0
T0 0 -984 315 315 0 59 N V 21 N"LD**"
T1 0 1024 315 315 0 59 N V 21 N"Cree_ML-E"
DS 512 -709 630 -591 100 21
DS 433 -709 630 -512 100 21
DS 472 413 453 472 50 21
DS 453 472 394 531 50 21
DS -472 413 -453 472 50 21
DS -453 472 -394 531 50 21
DS 472 -413 453 -472 50 21
DS 453 -472 394 -531 50 21
DS 335 551 394 531 50 21
DS -335 551 -394 531 50 21
DS 394 -531 335 -551 50 21
DS 335 -551 -335 -551 50 21
DS -335 -551 -315 -551 50 21
DS 472 413 472 -413 50 21
DS -335 551 335 551 50 21
DS -472 -413 -472 413 50 21
DS -335 -551 -394 -531 50 21
DS -394 -531 -453 -472 50 21
DS -453 -472 -472 -413 50 21
DS -630 -709 630 -709 100 21
DS 630 -709 630 709 100 21
DS 630 709 -630 709 100 21
DS -630 709 -630 -709 100 21
$PAD
Sh "3" R 549 453 0 0 0
Dr 0 0 0
At SMD N 00888000
Ne 0 ""
Po 549 404
$EndPAD
$PAD
Sh "4" R 549 453 0 0 0
Dr 0 0 0
At SMD N 00888000
Ne 0 ""
Po 549 -404
$EndPAD
$PAD
Sh "2" R 549 453 0 0 0
Dr 0 0 0
At SMD N 00888000
Ne 0 ""
Po -549 404
$EndPAD
$PAD
Sh "1" R 549 453 0 0 0
Dr 0 0 0
At SMD N 00888000
Ne 0 ""
Po -549 -404
$EndPAD
$PAD
Sh "5" R 276 1260 0 0 0
Dr 0 0 0
At SMD N 00888000
Ne 0 ""
Po 0 0
$EndPAD
$SHAPE3D
Na "walter\smd_leds\cree_ml-e.wrl"
Sc 1.000000 1.000000 1.000000
Of 0.000000 0.000000 0.000000
Ro 0.000000 0.000000 0.000000
$EndSHAPE3D
$EndMODULE  Cree_ML-E
$MODULE Cree_XP
Po 0 0 0 15 4D85130E 00000000 ~~
Li Cree_XP
Cd Cree XP
Sc 00000000
AR
Op 0 0 0
T0 0 -906 206 206 0 39 N V 21 N"LD?"
T1 0 965 206 206 0 39 N V 21 N"Cree_XP"
DS -689 -453 -453 -453 59 21
DS -453 -689 -453 -453 59 21
DS 689 -453 453 -453 59 21
DS 453 -689 453 -453 59 21
DS -551 79 -551 -79 59 21
DS -472 0 -630 0 59 21
DS -689 689 689 689 59 21
DS 689 689 689 -689 59 21
DS 689 -689 -689 -689 59 21
DS -689 -689 -689 689 59 21
DC 0 0 0 -512 59 21
$PAD
Sh "2" R 236 1299 0 0 0
Dr 0 0 0
At SMD N 00888000
Ne 0 ""
Po 551 0
.SolderMask 39
.SolderPaste -20
$EndPAD
$PAD
Sh "1" R 236 1299 0 0 0
Dr 0 0 0
At SMD N 00888000
Ne 0 ""
Po -551 0
.SolderMask 39
.SolderPaste -20
$EndPAD
$PAD
Sh "3" R 551 1299 0 0 0
Dr 0 0 0
At SMD N 00888000
Ne 0 ""
Po 0 0
.SolderMask 39
.SolderPaste -20
$EndPAD
$PAD
Sh "1" R 157 197 0 0 0
Dr 0 0 0
At SMD N 00808000
Ne 0 ""
Po -728 0
$EndPAD
$PAD
Sh "2" R 157 197 0 0 0
Dr 0 0 0
At SMD N 00808000
Ne 0 ""
Po 728 0
$EndPAD
$SHAPE3D
Na "walter\smd_leds\cree_xp.wrl"
Sc 1.000000 1.000000 1.000000
Of 0.000000 0.000000 0.000000
Ro 0.000000 0.000000 0.000000
$EndSHAPE3D
$EndMODULE  Cree_XP
$MODULE Luxeon_Rebel
Po 0 0 0 15 4D8510C5 00000000 ~~
Li Luxeon_Rebel
Cd Philips Lumileds Luxeon Rebel
Sc 00000000
AR
Op 0 0 0
T0 276 -827 206 206 0 39 N V 21 N"LD?"
T1 276 827 206 206 0 39 N V 21 N"Luxeon_Rebel"
DC 0 0 0 -512 59 21
DS -630 -610 -630 610 59 21
DS -630 610 1142 610 59 21
DS 1142 610 1142 -610 59 21
DS 1142 -610 -630 -610 59 21
$PAD
Sh "1" R 354 512 0 0 0
Dr 0 0 0
At SMD N 00888000
Ne 0 ""
Po 974 -315
.SolderMask 39
.SolderPaste -39
$EndPAD
$PAD
Sh "2" R 354 512 0 0 0
Dr 0 0 0
At SMD N 00888000
Ne 0 ""
Po 974 315
$EndPAD
$PAD
Sh "3" R 748 1181 0 0 0
Dr 0 0 0
At SMD N 00888000
Ne 0 ""
Po -217 0
$EndPAD
$PAD
Sh "1" O 197 394 0 0 -450
Dr 0 0 0
At SMD N 00808000
Ne 0 ""
Po 1142 -571
$EndPAD
$PAD
Sh "2" O 197 394 0 0 450
Dr 0 0 0
At SMD N 00808000
Ne 0 ""
Po 1142 571
$EndPAD
$PAD
Sh "3" O 197 394 0 0 -450
Dr 0 0 0
At SMD N 00808000
Ne 0 ""
Po -591 591
$EndPAD
$PAD
Sh "3" O 197 394 0 0 450
Dr 0 0 0
At SMD N 00808000
Ne 0 ""
Po -591 -591
$EndPAD
$SHAPE3D
Na "walter\smd_leds\luxeon_rebel.wrl"
Sc 1.000000 1.000000 1.000000
Of 0.000000 0.000000 0.000000
Ro 0.000000 0.000000 0.000000
$EndSHAPE3D
$EndMODULE  Luxeon_Rebel
$MODULE Seoul_P5-II
Po 0 0 0 15 4D8DC734 00000000 ~~
Li Seoul_P5-II
Cd Seoul P5-II
Sc 00000000
AR
Op 0 0 0
T0 0 -1181 206 206 0 39 N V 21 N"LD?"
T1 0 1201 206 206 0 39 N V 21 N"Seoul P5-II"
DC -945 748 -1004 787 59 21
DC 0 0 0 -827 59 21
DS -1181 -984 -1181 984 59 21
DS -1181 -984 1181 -984 59 21
DS 1181 -984 1181 984 59 21
DS 1181 984 -1181 984 59 21
$PAD
Sh "1" R 236 413 0 0 0
Dr 0 0 0
At SMD N 00888000
Ne 0 ""
Po 1004 -719
$EndPAD
$PAD
Sh "2" R 236 472 0 0 0
Dr 0 0 0
At SMD N 00888000
Ne 0 ""
Po 1004 0
$EndPAD
$PAD
Sh "3" R 236 413 0 0 0
Dr 0 0 0
At SMD N 00888000
Ne 0 ""
Po 1004 719
$EndPAD
$PAD
Sh "4" R 236 413 0 0 0
Dr 0 0 0
At SMD N 00888000
Ne 0 ""
Po -1004 719
$EndPAD
$PAD
Sh "5" R 236 472 0 0 0
Dr 0 0 0
At SMD N 00888000
Ne 0 ""
Po -1004 0
$EndPAD
$PAD
Sh "6" R 236 413 0 0 0
Dr 0 0 0
At SMD N 00888000
Ne 0 ""
Po -1004 -719
$EndPAD
$PAD
Sh "7" R 1378 1850 0 0 0
Dr 0 0 0
At SMD N 00888000
Ne 0 ""
Po 0 0
$EndPAD
$SHAPE3D
Na "walter\smd_leds\seoul_p5-ii.wrl"
Sc 1.000000 1.000000 1.000000
Of 0.000000 0.000000 0.000000
Ro 0.000000 0.000000 0.000000
$EndSHAPE3D
$EndMODULE  Seoul_P5-II
$MODULE Cree_XM
Po 0 0 0 15 4D9786B9 00000000 ~~
Li Cree_XM
Cd Cree XM
Sc 00000000
AR
Op 0 0 0
T0 0 -1220 206 206 0 39 N V 21 N"LD?"
T1 0 1260 206 206 0 39 N V 21 N"Cree_XM"
DC 0 0 -827 0 100 21
DS -748 -118 -748 118 100 21
DS -866 0 -630 0 100 21
DS 669 -669 984 -669 100 21
DS 669 -669 669 -984 100 21
DS -984 -669 -669 -669 100 21
DS -669 -669 -669 -984 100 21
DS -984 -984 -984 984 100 21
DS -984 984 984 984 100 21
DS 984 984 984 -984 100 21
DS 984 -984 -984 -984 100 21
$PAD
Sh "2" R 197 1890 0 0 0
Dr 0 0 0
At SMD N 00888000
Ne 0 ""
Po 846 0
.SolderMask 39
.SolderPaste -20
$EndPAD
$PAD
Sh "1" R 197 1890 0 0 0
Dr 0 0 0
At SMD N 00888000
Ne 0 ""
Po -846 0
.SolderMask 39
.SolderPaste -20
$EndPAD
$PAD
Sh "3" R 1095 1890 0 0 0
Dr 0 0 0
At SMD N 00888000
Ne 0 ""
Po 0 0
.SolderMask 39
.SolderPaste -20
$EndPAD
$PAD
Sh "1" R 157 197 0 0 0
Dr 0 0 0
At SMD N 00808000
Ne 0 ""
Po -1016 0
.SolderMask 39
.SolderPaste -20
$EndPAD
$PAD
Sh "2" R 157 197 0 0 0
Dr 0 0 0
At SMD N 00808000
Ne 0 ""
Po 1016 0
.SolderMask 39
.SolderPaste -20
$EndPAD
$SHAPE3D
Na "walter\smd_leds\cree_xm.wrl"
Sc 1.000000 1.000000 1.000000
Of 0.000000 0.000000 0.000000
Ro 0.000000 0.000000 0.000000
$EndSHAPE3D
$EndMODULE  Cree_XM
$MODULE sharp_doubledome
Po 0 0 0 15 4D978D1B 00000000 ~~
Li sharp_doubledome
Cd Sharp DoubleDome
Sc 00000000
AR
Op 0 0 0
T0 0 -787 315 315 0 59 N V 21 N"LD**"
T1 0 866 315 315 0 59 N V 21 N"Sharp_DoubleDome"
DC 433 -433 394 -433 50 21
DC 0 0 -472 0 50 21
DS -551 -551 -551 551 50 21
DS -551 551 551 551 50 21
DS 551 551 551 -551 50 21
DS 551 -551 -551 -551 50 21
$PAD
Sh "1" R 394 945 0 0 0
Dr 0 0 0
At SMD N 00888000
Ne 0 ""
Po -354 0
.SolderMask 39
.SolderPaste -20
$EndPAD
$PAD
Sh "2" R 394 945 0 0 0
Dr 0 0 0
At SMD N 00888000
Ne 0 ""
Po 354 0
.SolderMask 39
.SolderPaste -20
$EndPAD
$SHAPE3D
Na "walter\smd_leds\sharp_doubledome.wrl"
Sc 1.000000 1.000000 1.000000
Of 0.000000 0.000000 0.000000
Ro 0.000000 0.000000 0.000000
$EndSHAPE3D
$EndMODULE  sharp_doubledome
$MODULE osram_oslon
Po 0 0 0 15 4D9798B7 00000000 ~~
Li osram_oslon
Cd Osram Oslon
Sc 00000000
AR
Op 0 0 0
T0 0 -787 206 206 0 39 N V 21 N"LD?"
T1 0 827 206 206 0 39 N V 21 N"Osram Oslon"
DS 197 -79 197 79 50 21
DA 197 0 118 0 900 50 21
DA 197 0 197 79 900 50 21
DC 0 0 -433 0 50 21
DS -591 -591 -591 591 50 21
DS -591 591 591 591 50 21
DS 591 591 591 -591 50 21
DS 591 -591 -591 -591 50 21
$PAD
Sh "2" R 217 1102 0 0 0
Dr 0 0 0
At SMD N 00888000
Ne 0 ""
Po 443 0
.SolderMask 39
.SolderPaste -20
$EndPAD
$PAD
Sh "1" R 217 1102 0 0 0
Dr 0 0 0
At SMD N 00888000
Ne 0 ""
Po -443 0
.SolderMask 39
.SolderPaste -20
$EndPAD
$PAD
Sh "3" R 394 1102 0 0 0
Dr 0 0 0
At SMD N 00888000
Ne 0 ""
Po 0 0
.SolderMask 39
.SolderPaste -20
$EndPAD
$SHAPE3D
Na "walter\smd_leds\osram_oslon.wrl"
Sc 1.000000 1.000000 1.000000
Of 0.000000 0.000000 0.000000
Ro 0.000000 0.000000 0.000000
$EndSHAPE3D
$EndMODULE  osram_oslon
$MODULE Cree_XR
Po 0 0 0 15 4D97A92C 00000000 ~~
Li Cree_XR
Cd Cree XR
Sc 00000000
AR
Op 0 0 0
T0 0 -1732 394 394 0 79 N V 21 N"LD?"
T1 0 1811 394 394 0 79 N V 21 N"Cree_XR"
DC 0 0 -1102 0 150 21
DC 0 0 -1339 0 150 21
DS -1772 -1378 -1772 1378 150 21
DS -1772 1378 1772 1378 150 21
DS 1772 1378 1772 -1378 150 21
DS 1772 -1378 -1772 -1378 150 21
DS -1535 79 -1535 -79 59 21
DS -1456 0 -1614 0 59 21
$PAD
Sh "2" R 276 2543 0 0 0
Dr 0 0 0
At SMD N 00888000
Ne 0 ""
Po 1516 0
.SolderMask 39
.SolderPaste -20
$EndPAD
$PAD
Sh "1" R 276 2543 0 0 0
Dr 0 0 0
At SMD N 00888000
Ne 0 ""
Po -1516 0
.SolderMask 39
.SolderPaste -20
$EndPAD
$PAD
Sh "3" R 1102 1272 0 0 0
Dr 0 0 0
At SMD N 00888000
Ne 0 ""
Po -551 636
.SolderMask 39
.SolderPaste -20
$EndPAD
$PAD
Sh "3" R 1102 1272 0 0 0
Dr 0 0 0
At SMD N 00888000
Ne 0 ""
Po -551 -636
$EndPAD
$PAD
Sh "3" R 1102 1272 0 0 0
Dr 0 0 0
At SMD N 00888000
Ne 0 ""
Po 551 -636
$EndPAD
$PAD
Sh "3" R 1102 1272 0 0 0
Dr 0 0 0
At SMD N 00888000
Ne 0 ""
Po 551 636
$EndPAD
$SHAPE3D
Na "walter\smd_leds\cree_xr.wrl"
Sc 1.000000 1.000000 1.000000
Of 0.000000 0.000000 0.000000
Ro 0.000000 0.000000 0.000000
$EndSHAPE3D
$EndMODULE  Cree_XR
$MODULE Seoul_P4
Po 0 0 0 15 4D9845D7 00000000 ~~
Li Seoul_P4
Cd Seoul P4
Sc 00000000
AR
Op 0 0 0
T0 0 -1811 394 394 0 79 N V 21 N"LD?"
T1 0 1890 394 394 0 79 N V 21 N"Seoul_P4"
DS -1457 -236 -1890 -236 150 21
DS -1890 -236 -1890 -551 150 21
DS -1457 -551 -1890 -551 150 21
DS 1890 236 1890 276 150 21
DS 1890 276 1772 394 150 21
DS 1772 394 1890 512 150 21
DS 1890 512 1890 551 150 21
DS 1496 236 1890 236 150 21
DS 1457 551 1890 551 150 21
DS 1969 -591 1772 -591 150 21
DS 1969 -276 1772 -276 150 21
DS 2835 -118 1969 -118 150 21
DS 1969 -748 2835 -748 150 21
DS -1772 276 -1969 276 150 21
DS -1772 591 -1969 591 150 21
DS -2835 748 -1969 748 150 21
DS -2835 118 -1969 118 150 21
DC 0 0 -1102 0 150 21
DS 1970 -748 1970 -591 150 21
DS 1772 -591 1457 -591 150 21
DS 2835 -748 2835 -118 150 21
DS 1968 -118 1968 -276 150 21
DS 1772 -276 1457 -276 150 21
DS -1968 748 -1968 591 150 21
DS -1772 591 -1457 591 150 21
DS -2835 747 -2835 117 150 21
DS -1968 118 -1968 276 150 21
DS -1772 276 -1457 276 150 21
DS -827 1339 -1102 1102 150 21
DS -1102 1102 -1339 827 150 21
DS 1339 827 1102 1102 150 21
DS 1102 1102 827 1339 150 21
DS 827 -1339 1102 -1102 150 21
DS 1102 -1102 1339 -827 150 21
DS 591 -1457 827 -1339 150 21
DS 1457 -591 1339 -827 150 21
DS 1457 591 1339 827 150 21
DS 591 1457 827 1339 150 21
DS -591 1457 -827 1339 150 21
DS -1457 591 -1339 827 150 21
DS -1457 -591 -1339 -827 150 21
DS -1339 -827 -1102 -1102 150 21
DS -1102 -1102 -827 -1339 150 21
DS -827 -1339 -591 -1457 150 21
DS 591 1457 -591 1457 150 21
DS 1457 -591 1457 591 150 21
DS -591 -1457 591 -1457 150 21
DS -1457 591 -1457 -591 150 21
$PAD
Sh "2" R 1299 827 0 0 0
Dr 0 0 0
At SMD N 00888000
Ne 0 ""
Po 2618 -441
.SolderMask 39
.SolderPaste -20
$EndPAD
$PAD
Sh "1" R 1299 827 0 0 0
Dr 0 0 0
At SMD N 00888000
Ne 0 ""
Po -2618 441
.SolderMask 39
.SolderPaste -20
$EndPAD
$PAD
Sh "3" C 2362 2362 0 0 0
Dr 0 0 0
At SMD N 00888000
Ne 0 ""
Po 0 0
.SolderMask 39
.SolderPaste -20
$EndPAD
$SHAPE3D
Na "walter\smd_leds\seoul_p4.wrl"
Sc 1.000000 1.000000 1.000000
Of 0.000000 0.000000 0.000000
Ro 0.000000 0.000000 0.000000
$EndSHAPE3D
$EndMODULE  Seoul_P4
$MODULE Cree_MX
Po 0 0 0 15 4D9780C5 00000000 ~~
Li Cree_MX
Cd Cree MX
Sc 00000000
AR
Op 0 0 0
T0 0 -1299 394 394 0 79 N V 21 N"LD?"
T1 0 1378 394 394 0 79 N V 21 N"Cree_MX"
DS 984 669 1339 669 100 21
DS 1339 669 1339 -669 100 21
DS 1339 -669 984 -669 100 21
DS -984 -669 -1339 -669 100 21
DS -1339 -669 -1339 669 100 21
DS -1339 669 -984 669 100 21
DS 984 669 669 984 100 21
DS 787 984 984 787 100 21
DA -591 -591 -787 -591 900 100 21
DA 591 -591 591 -787 900 100 21
DA 591 591 787 591 900 100 21
DA -591 591 -591 787 900 100 21
DS -787 -591 -787 591 100 21
DS 591 -787 -591 -787 100 21
DS 787 591 787 -591 100 21
DS -591 787 591 787 100 21
DA 866 866 984 866 900 100 21
DA -866 866 -866 984 900 100 21
DA 866 -866 866 -984 900 100 21
DA -866 -866 -984 -866 900 100 21
DS 866 -984 -866 -984 100 21
DS 984 866 984 -866 100 21
DS -866 984 866 984 100 21
DS -984 -866 -984 866 100 21
$PAD
Sh "2" R 689 1535 0 0 0
Dr 0 0 0
At SMD N 00888000
Ne 0 ""
Po 1230 0
.SolderMask 39
.SolderPaste -20
$EndPAD
$PAD
Sh "1" R 689 1535 0 0 0
Dr 0 0 0
At SMD N 00888000
Ne 0 ""
Po -1230 0
.SolderMask 39
.SolderPaste -20
$EndPAD
$PAD
Sh "3" R 433 1535 0 0 0
Dr 0 0 0
At SMD N 00888000
Ne 0 ""
Po 0 0
.SolderMask 39
.SolderPaste -20
$EndPAD
$SHAPE3D
Na "walter\smd_leds\cree_mx.wrl"
Sc 1.000000 1.000000 1.000000
Of 0.000000 0.000000 0.000000
Ro 0.000000 0.000000 0.000000
$EndSHAPE3D
$EndMODULE  Cree_MX
$MODULE Osram_GoldenDragon
Po 0 0 0 15 4D984F25 00000000 ~~
Li Osram_GoldenDragon
Cd Osram Golden Dragon
Sc 00000000
AR
Op 0 0 0
T0 0 -1535 394 394 0 79 N V 21 N"LD?"
T1 0 1614 394 394 0 79 N V 21 N"Osram Golden Dragon"
DS -1063 -1181 1063 -1181 150 21
DS -1378 827 -1378 -866 150 21
DS 1024 1181 -1102 1181 150 21
DS 1378 -866 1378 906 150 21
DA -1063 866 -1102 1181 900 150 21
DA -1063 -866 -1378 -866 900 150 21
DA 1063 -866 1063 -1181 900 150 21
DA 1063 866 1378 906 900 150 21
DS -1378 -354 -2205 -354 150 21
DS -2205 -354 -2205 354 150 21
DS -2205 354 -1378 354 150 21
DS 2205 -354 1378 -354 150 21
DS 2205 -354 2205 354 150 21
DS 2205 354 1378 354 150 21
DS 630 0 906 0 150 21
DS 906 0 906 79 150 21
DS 906 79 866 197 150 21
DS 866 197 787 394 150 21
DS 787 394 669 591 150 21
DS 669 591 472 748 150 21
DS 472 748 315 551 150 21
DC 0 0 630 -39 150 21
DC 1024 827 1181 827 150 21
DC -1024 827 -1181 827 150 21
DC 1024 -827 1181 -827 150 21
DC -1025 -827 -1182 -827 150 21
$PAD
Sh "2" R 630 906 0 0 0
Dr 0 0 0
At SMD N 00888000
Ne 0 ""
Po 1969 0
.SolderMask 39
.SolderPaste -20
$EndPAD
$PAD
Sh "1" R 630 906 0 0 0
Dr 0 0 0
At SMD N 00888000
Ne 0 ""
Po -1969 0
.SolderMask 39
.SolderPaste -20
$EndPAD
$PAD
Sh "3" C 1575 1575 0 0 0
Dr 0 0 0
At SMD N 00888000
Ne 0 ""
Po 0 0
.SolderMask 39
.SolderPaste -295
$EndPAD
$SHAPE3D
Na "walter\smd_leds\osram_goldendragon.wrl"
Sc 1.000000 1.000000 1.000000
Of 0.000000 0.000000 0.000000
Ro 0.000000 0.000000 0.000000
$EndSHAPE3D
$EndMODULE  Osram_GoldenDragon
$MODULE Osram_PlatinumDragon
Po 0 0 0 15 4D9861C7 00000000 ~~
Li Osram_PlatinumDragon
Cd Osram Platinum Dragon
Sc 00000000
AR
Op 0 0 0
T0 0 -1535 394 394 0 79 N V 21 N"LD?"
T1 0 1614 394 394 0 79 N V 21 N"Osram Platinum Dragon"
DS 276 276 354 276 50 21
DS 354 276 354 354 50 21
DS 354 354 276 354 50 21
DS 276 354 276 276 50 21
DS 276 276 315 315 50 21
DS -118 -118 118 -118 50 21
DS 118 -118 118 118 50 21
DS 118 118 -118 118 50 21
DS -118 118 -118 -118 50 21
DC 0 0 -984 0 150 21
DS -1063 -1181 1063 -1181 150 21
DS -1378 827 -1378 -866 150 21
DS 1024 1181 -1102 1181 150 21
DS 1378 -866 1378 906 150 21
DA -1063 866 -1102 1181 900 150 21
DA -1063 -866 -1378 -866 900 150 21
DA 1063 -866 1063 -1181 900 150 21
DA 1063 866 1378 906 900 150 21
DS -1378 -354 -2205 -354 150 21
DS -2205 -354 -2205 354 150 21
DS -2205 354 -1378 354 150 21
DS 2205 -354 1378 -354 150 21
DS 2205 -354 2205 354 150 21
DS 2205 354 1378 354 150 21
DC 1024 827 1181 827 150 21
DC -1024 827 -1181 827 150 21
DC 1024 -827 1181 -827 150 21
DC -1025 -827 -1182 -827 150 21
$PAD
Sh "2" R 630 906 0 0 0
Dr 0 0 0
At SMD N 00888000
Ne 0 ""
Po 1969 0
.SolderMask 39
.SolderPaste -20
$EndPAD
$PAD
Sh "1" R 630 906 0 0 0
Dr 0 0 0
At SMD N 00888000
Ne 0 ""
Po -1969 0
.SolderMask 39
.SolderPaste -20
$EndPAD
$PAD
Sh "3" C 1575 1575 0 0 0
Dr 0 0 0
At SMD N 00888000
Ne 0 ""
Po 0 0
.SolderMask 39
.SolderPaste -295
$EndPAD
$SHAPE3D
Na "walter\smd_leds\osram_platinumdragon.wrl"
Sc 1.000000 1.000000 1.000000
Of 0.000000 0.000000 0.000000
Ro 0.000000 0.000000 0.000000
$EndSHAPE3D
$EndMODULE  Osram_PlatinumDragon
$MODULE Osram_GoldenDragonPlus
Po 0 0 0 15 4D9861E8 00000000 ~~
Li Osram_GoldenDragonPlus
Cd Osram Golden Dragon Plus
Sc 00000000
AR
Op 0 0 0
T0 0 -1535 394 394 0 79 N V 21 N"LD?"
T1 0 1614 394 394 0 79 N V 21 N"Osram Golden Dragon Plus"
DS 276 276 354 276 50 21
DS 354 276 354 354 50 21
DS 354 354 276 354 50 21
DS 276 354 276 276 50 21
DS 276 276 354 354 50 21
DS -118 -118 118 -118 50 21
DS 118 -118 118 118 50 21
DS 118 118 -118 118 50 21
DS -118 118 -118 -118 50 21
DC 0 0 -984 0 150 21
DS -1063 -1181 1063 -1181 150 21
DS -1378 827 -1378 -866 150 21
DS 1024 1181 -1102 1181 150 21
DS 1378 -866 1378 906 150 21
DA -1063 866 -1102 1181 900 150 21
DA -1063 -866 -1378 -866 900 150 21
DA 1063 -866 1063 -1181 900 150 21
DA 1063 866 1378 906 900 150 21
DS -1378 -354 -2205 -354 150 21
DS -2205 -354 -2205 354 150 21
DS -2205 354 -1378 354 150 21
DS 2205 -354 1378 -354 150 21
DS 2205 -354 2205 354 150 21
DS 2205 354 1378 354 150 21
DC 1024 827 1181 827 150 21
DC -1024 827 -1181 827 150 21
DC 1024 -827 1181 -827 150 21
DC -1025 -827 -1182 -827 150 21
$PAD
Sh "2" R 630 906 0 0 0
Dr 0 0 0
At SMD N 00888000
Ne 0 ""
Po 1969 0
.SolderMask 39
.SolderPaste -20
$EndPAD
$PAD
Sh "1" R 630 906 0 0 0
Dr 0 0 0
At SMD N 00888000
Ne 0 ""
Po -1969 0
.SolderMask 39
.SolderPaste -20
$EndPAD
$PAD
Sh "3" C 1575 1575 0 0 0
Dr 0 0 0
At SMD N 00888000
Ne 0 ""
Po 0 0
.SolderMask 39
.SolderPaste -295
$EndPAD
$SHAPE3D
Na "walter\smd_leds\osram_goldendragonplus.wrl"
Sc 1.000000 1.000000 1.000000
Of 0.000000 0.000000 0.000000
Ro 0.000000 0.000000 0.000000
$EndSHAPE3D
$EndMODULE  Osram_GoldenDragonPlus
$MODULE Cree_MC-E
Po 0 0 0 15 4D974215 00000000 ~~
Li Cree_MC-E
Cd Cree MC-E
Sc 00000000
AR
Op 0 0 0
T0 0 -1654 315 315 0 59 N V 21 N"LD**"
T1 0 1693 315 315 0 59 N V 21 N"Cree_MC-E"
DC 0 0 -1260 0 100 21
DS -1496 1024 -1496 -1378 100 21
DS -1142 1378 -1496 1024 100 21
DS 1496 1378 1496 -1378 100 21
DS 1496 -1378 -1496 -1378 100 21
DS -1142 1378 1496 1378 100 21
$PAD
Sh "3" R 457 394 0 0 0
Dr 0 0 0
At SMD N 00888000
Ne 0 ""
Po -1744 -295
$EndPAD
$PAD
Sh "8" R 457 394 0 0 0
Dr 0 0 0
At SMD N 00888000
Ne 0 ""
Po 1744 886
$EndPAD
$PAD
Sh "4" R 457 394 0 0 0
Dr 0 0 0
At SMD N 00888000
Ne 0 ""
Po -1744 -886
$EndPAD
$PAD
Sh "7" R 457 394 0 0 0
Dr 0 0 0
At SMD N 00888000
Ne 0 ""
Po 1744 295
$EndPAD
$PAD
Sh "2" R 457 394 0 0 0
Dr 0 0 0
At SMD N 00888000
Ne 0 ""
Po -1744 295
$EndPAD
$PAD
Sh "1" R 457 394 0 0 0
Dr 0 0 0
At SMD N 00888000
Ne 0 ""
Po -1744 886
$EndPAD
$PAD
Sh "6" R 457 394 0 0 0
Dr 0 0 0
At SMD N 00888000
Ne 0 ""
Po 1744 -295
$EndPAD
$PAD
Sh "5" R 457 394 0 0 0
Dr 0 0 0
At SMD N 00888000
Ne 0 ""
Po 1744 -886
$EndPAD
$PAD
Sh "9" R 512 3780 0 0 0
Dr 0 0 0
At SMD N 00888000
Ne 0 ""
Po 0 0
$EndPAD
$PAD
Sh "9" R 1118 2205 0 0 0
Dr 0 0 0
At SMD N 00888000
Ne 0 ""
Po 0 0
$EndPAD
$SHAPE3D
Na "walter\smd_leds\cree_mc-e.wrl"
Sc 1.000000 1.000000 1.000000
Of 0.000000 0.000000 0.000000
Ro 0.000000 0.000000 0.000000
$EndSHAPE3D
$EndMODULE  Cree_MC-E
$MODULE Edison_Edixeon_RGB
Po 0 0 0 15 4D9F62C2 00000000 ~~
Li Edison_Edixeon_RGB
Cd Edison Edixeon RGB
Sc 00000000
AR Edison_Edixeon_A
Op 0 0 0
T0 0 -1811 394 394 0 79 N V 21 N "LD?"
T1 0 1890 394 394 0 79 N V 21 N "Edison Edixeon RGB"
DC -1634 -728 -1713 -728 39 21
DC -1634 728 -1713 728 39 21
DS 1457 531 2854 531 150 21
DS 2854 531 2854 925 150 21
DS 2854 925 1260 925 150 21
DS 1457 -197 2854 -197 150 21
DS 2854 -197 2854 197 150 21
DS 2854 197 1457 197 150 21
DS 1260 -925 2854 -925 150 21
DS 2854 -925 2854 -531 150 21
DS 2854 -531 1457 -531 150 21
DS -1457 531 -2854 531 150 21
DS -2854 531 -2854 925 150 21
DS -2854 925 -1260 925 150 21
DS -1457 -531 -2854 -531 150 21
DS -2854 -531 -2854 -925 150 21
DS -2854 -925 -1260 -925 150 21
DS -1457 197 -2854 197 150 21
DS -2854 197 -2854 -197 150 21
DS -2854 -197 -1457 -197 150 21
DS 256 1555 591 1457 150 21
DS -591 1457 -256 1555 150 21
DS -256 -1555 -591 -1457 150 21
DS 256 -1555 591 -1457 150 21
DS 0 -1575 256 -1555 150 21
DS -256 -1555 0 -1575 150 21
DS 256 1555 0 1575 150 21
DS -256 1555 0 1575 150 21
DC 0 0 -1102 0 150 21
DS -827 1339 -1102 1102 150 21
DS -1102 1102 -1339 827 150 21
DS 1339 827 1102 1102 150 21
DS 1102 1102 827 1339 150 21
DS 827 -1339 1102 -1102 150 21
DS 1102 -1102 1339 -827 150 21
DS 591 -1457 827 -1339 150 21
DS 1457 -591 1339 -827 150 21
DS 1457 591 1339 827 150 21
DS 591 1457 827 1339 150 21
DS -591 1457 -827 1339 150 21
DS -1457 591 -1339 827 150 21
DS -1457 -591 -1339 -827 150 21
DS -1339 -827 -1102 -1102 150 21
DS -1102 -1102 -827 -1339 150 21
DS -827 -1339 -591 -1457 150 21
DS 1457 -591 1457 591 150 21
DS -1457 591 -1457 -591 150 21
$PAD
Sh "2" R 1102 512 0 0 0
Dr 0 0 0
At SMD N 00888000
Ne 0 ""
Po -2559 728
.SolderMask 39
.SolderPaste -59
$EndPAD
$PAD
Sh "7" C 2520 2520 0 0 0
Dr 0 0 0
At SMD N 00888000
Ne 0 ""
Po 0 0
.SolderMask 39
.SolderPaste -20
$EndPAD
$PAD
Sh "3" R 1102 512 0 0 0
Dr 0 0 0
At SMD N 00888000
Ne 0 ""
Po -2559 0
$EndPAD
$PAD
Sh "1" R 1102 512 0 0 0
Dr 0 0 0
At SMD N 00888000
Ne 0 ""
Po -2559 -728
.SolderPaste -59
$EndPAD
$PAD
Sh "6" R 1102 512 0 0 0
Dr 0 0 0
At SMD N 00888000
Ne 0 ""
Po 2559 -728
$EndPAD
$PAD
Sh "4" R 1102 512 0 0 0
Dr 0 0 0
At SMD N 00888000
Ne 0 ""
Po 2559 0
$EndPAD
$PAD
Sh "5" R 1102 512 0 0 0
Dr 0 0 0
At SMD N 00888000
Ne 0 ""
Po 2559 728
$EndPAD
$SHAPE3D
Na "walter\smd_leds\edison_edixeon-RGB.wrl"
Sc 1.000000 1.000000 1.000000
Of 0.000000 0.000000 0.000000
Ro 0.000000 0.000000 0.000000
$EndSHAPE3D
$EndMODULE  Edison_Edixeon_RGB
$MODULE Edison_Edixeon_A
Po 0 0 0 15 4D9F63EF 00000000 ~~
Li Edison_Edixeon_A
Cd Edison Edixeon A
Sc 00000000
AR
Op 0 0 0
T0 0 -1811 394 394 0 79 N V 21 N "LD?"
T1 0 1890 394 394 0 79 N V 21 N "Edison Edixeon A"
DS 2343 -295 2421 -137 150 21
DS 2421 -138 2854 -138 150 21
DS 2854 -137 2854 -767 150 21
DS 2854 -768 2421 -768 150 21
DS 2421 -768 2343 -611 150 21
DS 1457 -611 2343 -611 150 21
DS 2343 -296 1457 -296 150 21
DS -1732 -394 -1732 -157 39 21
DS -1732 -157 -1693 -118 39 21
DS -1693 -118 -1634 -118 39 21
DS -1634 -118 -1594 -157 39 21
DS -1594 -157 -1594 -394 39 21
DS -1594 -394 -1634 -433 39 21
DS -1634 -433 -1693 -433 39 21
DS -1693 -433 -1732 -394 39 21
DS -1890 -551 -1890 -20 150 21
DS -1890 -20 -1811 -20 150 21
DS -1811 -20 -1811 276 150 21
DS -2343 296 -2421 138 150 21
DS -2343 611 -2421 768 150 21
DS -2854 768 -2421 768 150 21
DS -2854 138 -2421 138 150 21
DS -2343 611 -1457 611 150 21
DS -2343 296 -1457 296 150 21
DS -1457 -551 -1890 -551 150 21
DC 0 0 -1102 0 150 21
DS -2854 767 -2854 137 150 21
DS -827 1339 -1102 1102 150 21
DS -1102 1102 -1339 827 150 21
DS 1339 827 1102 1102 150 21
DS 1102 1102 827 1339 150 21
DS 827 -1339 1102 -1102 150 21
DS 1102 -1102 1339 -827 150 21
DS 591 -1457 827 -1339 150 21
DS 1457 -591 1339 -827 150 21
DS 1457 591 1339 827 150 21
DS 591 1457 827 1339 150 21
DS -591 1457 -827 1339 150 21
DS -1457 591 -1339 827 150 21
DS -1457 -591 -1339 -827 150 21
DS -1339 -827 -1102 -1102 150 21
DS -1102 -1102 -827 -1339 150 21
DS -827 -1339 -591 -1457 150 21
DS 591 1457 -591 1457 150 21
DS 1457 -591 1457 591 150 21
DS -591 -1457 591 -1457 150 21
DS -1457 591 -1457 -591 150 21
$PAD
Sh "2" R 1417 630 0 0 0
Dr 0 0 0
At SMD N 00888000
Ne 0 ""
Po 3071 -472
.SolderMask 39
.SolderPaste -20
$EndPAD
$PAD
Sh "1" R 1417 630 0 0 0
Dr 0 0 0
At SMD N 00888000
Ne 0 ""
Po -3071 472
.SolderMask 39
.SolderPaste -20
$EndPAD
$PAD
Sh "3" C 2520 2520 0 0 0
Dr 0 0 0
At SMD N 00888000
Ne 0 ""
Po 0 0
.SolderMask 39
.SolderPaste -276
$EndPAD
$SHAPE3D
Na "walter\smd_leds\edison_edixeon-a.wrl"
Sc 1.000000 1.000000 1.000000
Of 0.000000 0.000000 0.000000
Ro 0.000000 0.000000 0.000000
$EndSHAPE3D
$EndMODULE  Edison_Edixeon_A
$MODULE Samsung_2323
Po 0 0 0 15 4E234876 00000000 ~~
Li Samsung_2323
Sc 00000000
AR Samsung_2323
Op 0 0 0
T0 0 -650 315 315 0 59 N V 21 N "LD**"
T1 0 709 315 315 0 59 N V 21 N "Samsung_2323"
DS -276 -335 177 -335 50 21
DS -335 276 -335 -276 50 21
DS 276 335 -276 335 50 21
DS 335 -138 335 276 50 21
DA 157 -157 177 -335 900 50 21
DA 276 276 335 276 900 50 21
DA -276 276 -276 335 900 50 21
DA -276 -276 -335 -276 900 50 21
DS 394 -453 453 -394 50 21
DS 335 -453 453 -335 50 21
DS 453 -276 276 -453 50 21
DS 453 -453 453 453 50 21
DS 453 453 -453 453 50 21
DS -453 453 -453 -453 50 21
DS -453 -453 453 -453 50 21
$PAD
Sh "1" R 132 797 0 0 0
Dr 0 0 0
At SMD N 00888000
Ne 0 ""
Po -288 0
.SolderMask 39
.SolderPaste -39
$EndPAD
$PAD
Sh "2" R 421 797 0 0 0
Dr 0 0 0
At SMD N 00888000
Ne 0 ""
Po 152 0
.SolderMask 39
.SolderPaste -39
$EndPAD
$PAD
Sh "1" T 28 197 39 0 0
Dr 0 0 0
At SMD N 00888000
Ne 0 ""
Po -210 -282
.SolderMask 39
.SolderPaste -39
$EndPAD
$PAD
Sh "1" T 28 197 39 0 0
Dr 0 0 0
At SMD N 00888000
Ne 0 ""
Po -210 282
.SolderMask 39
.SolderPaste -39
$EndPAD
$PAD
Sh "2" T 65 394 -59 0 0
Dr 0 0 0
At SMD N 00888000
Ne 0 ""
Po -87 0
.SolderMask 39
.SolderPaste -39
$EndPAD
$PAD
Sh "1" R 118 79 0 0 0
Dr 0 0 0
At SMD N 00888000
Ne 0 ""
Po -453 0
.SolderMask 39
.SolderPaste -39
$EndPAD
$PAD
Sh "2" R 118 79 0 0 0
Dr 0 0 0
At SMD N 00888000
Ne 0 ""
Po 453 0
.SolderMask 39
.SolderPaste -39
$EndPAD
$PAD
Sh "1" T 65 394 -51 0 0
Dr 0 0 0
At SMD N 00888000
Ne 0 ""
Po -374 0
.SolderMask 39
.SolderPaste -39
$EndPAD
$PAD
Sh "2" T 65 394 51 0 0
Dr 0 0 0
At SMD N 00888000
Ne 0 ""
Po 374 0
.SolderMask 39
.SolderPaste -39
$EndPAD
$SHAPE3D
Na "walter\smd_leds\samsung_2323.wrl"
Sc 1.000000 1.000000 1.000000
Of 0.000000 0.000000 0.000000
Ro 0.000000 0.000000 0.000000
$EndSHAPE3D
$EndMODULE  Samsung_2323
$MODULE Seoul_5630
Po 0 0 0 15 4E4B8169 00000000 ~~
Li Seoul_5630
Cd Seoul 5630
Sc 00000000
AR 
Op 0 0 0
T0 0 -984 315 315 0 59 N V 21 N"LD**"
T1 0 1024 315 315 0 59 N V 21 N"Seoul_5630"
DS -1024 118 -1102 118 50 21
DS -1102 118 -1102 472 50 21
DS -1102 472 -1024 472 50 21
DS -1024 -472 -1102 -472 50 21
DS -1102 -472 -1102 -118 50 21
DS -1102 -118 -1024 -118 50 21
DS 1024 -118 1102 -118 50 21
DS 1102 -118 1102 -472 50 21
DS 1102 -472 1024 -472 50 21
DS 1024 472 1102 472 50 21
DS 1102 472 1102 118 50 21
DS 1102 118 1024 118 50 21
DS 728 -512 -728 -512 50 21
DS 866 374 866 -374 50 21
DS -728 512 728 512 50 21
DS -866 -374 -866 374 50 21
DS -787 -591 -827 -591 50 21
DS -827 -591 -1024 -394 50 21
DS -1024 -394 -1024 -433 50 21
DS -1024 -433 -866 -591 50 21
DS -866 -591 -906 -591 50 21
DS -906 -591 -1024 -472 50 21
DS -1024 -472 -1024 -512 50 21
DS -1024 -512 -945 -591 50 21
DS -1024 -354 -787 -591 50 21
DS -1024 -591 -1024 591 50 21
DS -1024 591 1024 591 50 21
DS 1024 591 1024 -591 50 21
DS 1024 -591 -1024 -591 50 21
DS 866 373 847 432 50 21
DS 847 433 788 492 50 21
DS -866 374 -847 433 50 21
DS -847 433 -788 492 50 21
DS 866 -373 847 -432 50 21
DS 847 -433 788 -492 50 21
DS 729 511 788 491 50 21
DS -728 511 -787 491 50 21
DS 788 -491 729 -511 50 21
DS -728 -512 -787 -492 50 21
DS -788 -491 -847 -432 50 21
DS -847 -433 -866 -374 50 21
$PAD
Sh "5" R 374 433 0 0 0
Dr 0 0 0
At SMD N 00888000
Ne 0 ""
Po 994 295
$EndPAD
$PAD
Sh "1" R 374 433 0 0 0
Dr 0 0 0
At SMD N 00888000
Ne 0 ""
Po 994 -295
$EndPAD
$PAD
Sh "2" R 374 433 0 0 0
Dr 0 0 0
At SMD N 00888000
Ne 0 ""
Po -994 295
$EndPAD
$PAD
Sh "4" R 374 433 0 0 0
Dr 0 0 0
At SMD N 00888000
Ne 0 ""
Po -994 -295
$EndPAD
$PAD
Sh "3" R 1102 709 0 0 0
Dr 0 0 0
At SMD N 00888000
Ne 0 ""
Po 0 0
$EndPAD
$SHAPE3D
Na "walter\smd_leds\seoul_5630.wrl"
Sc 1.000000 1.000000 1.000000
Of 0.000000 0.000000 0.000000
Ro 0.000000 0.000000 0.000000
$EndSHAPE3D
$EndMODULE  Seoul_5630
$EndLIBRARY
