PCBNEW-LibModule-V1  2.11.2011 21:13:13
# encoding utf-8
$INDEX
PC1221
PC1222
PC1621
PC1621B
PC1622
PC1623
PC5W
PT10V
PT15V
PT6V
$EndINDEX
$MODULE PC5W
Po 0 0 0 15 4E92FFE9 00000000 ~~
Li PC5W
Sc 00000000
AR
Op 0 0 0
T0 0 -6000 472 472 0 79 N V 21 N "PC5W"
T1 0 3400 472 472 0 79 N I 21 N "Val**"
DS -2500 -1000 -2500 -2000 70 26
DS -2500 -2000 -2000 -2000 70 26
DS -2000 -2000 -2000 -5500 70 26
DS -2000 -5500 2000 -5500 70 26
DS 2000 -5500 2000 -2000 70 26
DS 2000 -2000 2500 -2000 70 26
DS 2500 -2000 2500 -1000 70 26
DS 2500 750 2500 2750 70 26
DS 2500 2750 -2500 2750 70 26
DS -2500 2750 -2500 750 70 26
DS -2500 -1000 -2500 -2000 70 21
DS -2500 -2000 -2000 -2000 70 21
DS -2000 -2000 -2000 -5500 70 21
DS -2000 -5500 2000 -5500 70 21
DS 2000 -5500 2000 -2000 70 21
DS 2000 -2000 2500 -2000 70 21
DS 2500 -2000 2500 -1000 70 21
DS 2500 750 2500 2750 70 21
DS 2500 2750 -2500 2750 70 21
DS -2500 2750 -2500 750 70 21
$PAD
Sh "1" O 1700 1500 0 0 900
Dr 787 0 0
At STD N 0CC0FFFF
Ne 0 ""
Po -2000 0
$EndPAD
$PAD
Sh "2" O 1700 1500 0 0 900
Dr 787 0 0
At STD N 0CC0FFFF
Ne 0 ""
Po 0 0
$EndPAD
$PAD
Sh "3" O 1700 1500 0 0 900
Dr 787 0 0
At STD N 0CC0FFFF
Ne 0 ""
Po 2000 0
$EndPAD
$EndMODULE  PC5W
$MODULE PC1221
Po 0 0 0 15 4E930091 00000000 ~~
Li PC1221
Sc 00000000
AR
Op 0 0 0
T0 0 -5000 472 472 0 79 N V 21 N "PC1221"
T1 0 2400 472 472 0 79 N I 21 N "Val**"
DS 2500 1750 -2500 1750 70 26
DS -2500 1750 -2500 -1500 70 26
DS -2500 -1500 -1500 -1500 70 26
DS -1500 -1500 -1500 -4500 70 26
DS -1500 -4500 1500 -4500 70 26
DS 1500 -4500 1500 -1500 70 26
DS 1500 -1500 2500 -1500 70 26
DS 2500 -1500 2500 1750 70 26
DS 2500 1750 -2500 1750 70 21
DS -2500 1750 -2500 -1500 70 21
DS -2500 -1500 -1500 -1500 70 21
DS -1500 -1500 -1500 -4500 70 21
DS -1500 -4500 1500 -4500 70 21
DS 1500 -4500 1500 -1500 70 21
DS 1500 -1500 2500 -1500 70 21
DS 2500 -1500 2500 1750 70 21
$PAD
Sh "1" R 980 980 0 0 0
Dr 460 0 0
At STD N 0CC08001
Ne 0 ""
Po -1500 0
$EndPAD
$PAD
Sh "2" C 980 980 0 0 0
Dr 460 0 0
At STD N 0CC08001
Ne 0 ""
Po 0 0
$EndPAD
$PAD
Sh "3" C 980 980 0 0 0
Dr 460 0 0
At STD N 0CC08001
Ne 0 ""
Po 1500 0
$EndPAD
$EndMODULE  PC1221
$MODULE PC1222
Po 0 0 0 15 4E9300EA 00000000 ~~
Li PC1222
Sc 00000000
AR
Op 0 0 0
T0 0 -5000 472 472 0 79 N V 21 N "PC1222"
T1 0 3400 472 472 0 79 N I 21 N "Val**"
DS 2500 1750 2500 -1500 70 26
DS 2500 -1500 1500 -1500 70 26
DS 1500 -1500 1500 -4500 70 26
DS 1500 -4500 -1500 -4500 70 26
DS -1500 -4500 -1500 -1500 70 26
DS -1500 -1500 -2500 -1500 70 26
DS -2500 -1500 -2500 2750 70 26
DS -2500 2750 2500 2750 70 26
DS 2500 2750 2500 1750 70 26
DS 2500 1750 2500 -1500 70 21
DS 2500 -1500 1500 -1500 70 21
DS 1500 -1500 1500 -4500 70 21
DS 1500 -4500 -1500 -4500 70 21
DS -1500 -4500 -1500 -1500 70 21
DS -1500 -1500 -2500 -1500 70 21
DS -2500 -1500 -2500 2750 70 21
DS -2500 2750 2500 2750 70 21
DS 2500 2750 2500 1750 70 21
$PAD
Sh "1" R 980 980 0 0 0
Dr 460 0 0
At STD N 0CC08001
Ne 0 ""
Po -1500 0
$EndPAD
$PAD
Sh "2" C 980 980 0 0 0
Dr 460 0 0
At STD N 0CC08001
Ne 0 ""
Po 0 0
$EndPAD
$PAD
Sh "3" C 980 980 0 0 0
Dr 460 0 0
At STD N 0CC08001
Ne 0 ""
Po 1500 0
$EndPAD
$PAD
Sh "4" C 980 980 0 0 0
Dr 460 0 0
At STD N 0CC08001
Ne 0 ""
Po -1500 2000
$EndPAD
$PAD
Sh "5" C 980 980 0 0 0
Dr 460 0 0
At STD N 0CC08001
Ne 0 ""
Po 0 2000
$EndPAD
$PAD
Sh "6" C 980 980 0 0 0
Dr 460 0 0
At STD N 0CC08001
Ne 0 ""
Po 1500 2000
$EndPAD
$EndMODULE  PC1222
$MODULE PC1621
Po 0 0 0 15 4E930121 00000000 ~~
Li PC1621
Sc 00000000
AR
Op 0 0 0
T0 0 -4700 472 472 0 79 N V 21 N "PC1621"
T1 0 2900 472 472 0 79 N I 21 N "Val**"
DS -3000 2250 3000 2250 70 26
DS 3000 2250 3000 -1500 70 26
DS 3000 -1500 1500 -1500 70 26
DS 1500 -1500 1500 -4250 70 26
DS 1500 -4250 -1500 -4250 70 26
DS -1500 -4250 -1500 -1500 70 26
DS -1500 -1500 -3000 -1500 70 26
DS -3000 -1500 -3000 2250 70 26
DS -3000 2250 3000 2250 70 21
DS 3000 2250 3000 -1500 70 21
DS 3000 -1500 1500 -1500 70 21
DS 1500 -1500 1500 -4250 70 21
DS 1500 -4250 -1500 -4250 70 21
DS -1500 -4250 -1500 -1500 70 21
DS -1500 -1500 -3000 -1500 70 21
DS -3000 -1500 -3000 2250 70 21
$PAD
Sh "1" R 980 980 0 0 0
Dr 460 0 0
At STD N 00C08001
Ne 0 ""
Po -2000 0
$EndPAD
$PAD
Sh "2" C 980 980 0 0 0
Dr 460 0 0
At STD N 00C08001
Ne 0 ""
Po 0 0
$EndPAD
$PAD
Sh "3" C 980 980 0 0 0
Dr 460 0 0
At STD N 00C08001
Ne 0 ""
Po 2000 0
$EndPAD
$EndMODULE  PC1621
$MODULE PC1621B
Po 0 0 0 15 4E9301C4 00000000 ~~
Li PC1621B
Sc 00000000
AR
Op 0 0 0
T0 0 -1900 472 472 0 79 N V 21 N "PC1621B"
T1 -100 -1100 472 472 0 79 N I 21 N "Val**"
DA -10 -4940 -3350 -4920 1793 190 27
DS 2750 -2950 2950 -2750 190 27
DS 2950 -2750 2950 -590 190 27
DS 2950 -590 -2960 -590 190 27
DS -2960 -590 -2960 -2750 190 27
DS -2960 -2750 -2760 -2950 190 27
DS -2370 -2550 2360 -2550 190 27
DA -500 -4720 -2370 -2550 532 190 20
DA 490 -4720 3340 -4920 532 190 20
DA -10 -4940 -3350 -4920 1793 190 20
DS 2750 -2950 2950 -2750 190 20
DS 2950 -2750 2950 -590 190 20
DS 2950 -590 -2960 -590 190 20
DS -2960 -590 -2960 -2750 190 20
DS -2960 -2750 -2760 -2950 190 20
DS -2370 -2550 2360 -2550 190 20
DA -500 -4720 -2370 -2550 532 190 26
DA 490 -4720 3340 -4920 532 190 26
DA -10 -4940 -3350 -4920 1793 190 26
DS 2750 -2950 2950 -2750 190 26
DS 2950 -2750 2950 -590 190 26
DS 2950 -590 -2960 -590 190 26
DS -2960 -590 -2960 -2750 190 26
DS -2960 -2750 -2760 -2950 190 26
DS -2370 -2550 2360 -2550 190 26
DS 2750 -2950 2950 -2750 190 21
DS 2950 -2750 2950 -590 190 21
DS 2950 -590 -2960 -590 190 21
DS -2960 -590 -2960 -2750 190 21
DS -2960 -2750 -2760 -2950 190 21
DS -2370 -2550 2360 -2550 190 21
DA -500 -4720 -2370 -2550 532 190 21
DA 490 -4720 3340 -4920 532 190 21
DA -10 -4940 -3350 -4920 1793 190 21
DA -500 -4720 -2370 -2550 532 190 27
DA 490 -4720 3340 -4920 532 190 27
$PAD
Sh "1" R 980 980 0 0 0
Dr 460 0 0
At STD N 0CC08001
Ne 0 ""
Po -2000 0
$EndPAD
$PAD
Sh "2" C 980 980 0 0 0
Dr 460 0 0
At STD N 0CC08001
Ne 0 ""
Po 0 0
$EndPAD
$PAD
Sh "3" C 980 980 0 0 0
Dr 460 0 0
At STD N 0CC08001
Ne 0 ""
Po 2000 0
$EndPAD
$PAD
Sh "HRID" C 3920 3920 0 0 0
Dr 3140 0 0
At STD N 0CC08001
Ne 0 ""
Po 0 -4920
$EndPAD
$PAD
Sh "4" C 1520 1520 0 0 0
Dr 1100 0 0
At STD N 0CC08001
Ne 0 ""
Po -3350 -4920
$EndPAD
$EndMODULE  PC1621B
$MODULE PC1622
Po 0 0 0 15 4E930207 00000000 ~~
Li PC1622
Sc 00000000
AR
Op 0 0 0
T0 0 -4700 472 472 0 79 N V 21 N "PC1622"
T1 0 3500 472 472 0 79 N I 21 N "Val**"
DS -3000 3000 3000 3000 70 26
DS 3000 3000 3000 -1500 70 26
DS 3000 -1500 1500 -1500 70 26
DS 1500 -1500 1500 -4250 70 26
DS 1500 -4250 -1500 -4250 70 26
DS -1500 -4250 -1500 -1500 70 26
DS -1500 -1500 -3000 -1500 70 26
DS -3000 -1500 -3000 3000 70 26
DS -3000 3000 3000 3000 70 21
DS 3000 3000 3000 -1500 70 21
DS 3000 -1500 1500 -1500 70 21
DS 1500 -1500 1500 -4250 70 21
DS 1500 -4250 -1500 -4250 70 21
DS -1500 -4250 -1500 -1500 70 21
DS -1500 -1500 -3000 -1500 70 21
DS -3000 -1500 -3000 3000 70 21
$PAD
Sh "1" R 980 980 0 0 0
Dr 460 0 0
At STD N 00C08001
Ne 0 ""
Po -2000 0
$EndPAD
$PAD
Sh "2" C 980 980 0 0 0
Dr 460 0 0
At STD N 00C08001
Ne 0 ""
Po 0 0
$EndPAD
$PAD
Sh "3" C 980 980 0 0 0
Dr 460 0 0
At STD N 00C08001
Ne 0 ""
Po 2000 0
$EndPAD
$PAD
Sh "4" C 980 980 0 0 0
Dr 460 0 0
At STD N 00C08001
Ne 0 ""
Po -2000 2000
$EndPAD
$PAD
Sh "5" C 980 980 0 0 0
Dr 460 0 0
At STD N 00C08001
Ne 0 ""
Po 0 2000
$EndPAD
$PAD
Sh "6" C 980 980 0 0 0
Dr 460 0 0
At STD N 00C08001
Ne 0 ""
Po 2000 2000
$EndPAD
$EndMODULE  PC1622
$MODULE PC1623
Po 0 0 0 15 4E93026D 00000000 ~~
Li PC1623
Sc 00000000
AR
Op 0 0 0
T0 0 -3000 472 472 0 79 N V 21 N "PC1623"
T1 0 3200 472 472 0 79 N I 21 N "Val**"
DS 2750 4500 3000 4500 70 21
DS 3000 4500 3000 2000 70 21
DA -1250 -120 3000 -2250 531 70 21
DS 3000 -2250 3000 -5000 70 21
DS 3000 -5000 2500 -5000 70 21
DS 2500 -5000 2500 -4750 70 21
DS 2500 -4750 1500 -4750 70 21
DS 1500 -4750 1500 -5000 70 21
DS 1500 -5000 1000 -5000 70 21
DS 1000 -5000 1000 -4750 70 21
DS 1000 -4750 750 -4750 70 21
DS 750 4500 1250 4500 70 26
DS -1250 4500 -750 4500 70 26
DS -770 -4750 -1020 -4750 70 26
DS -1020 -4750 -1020 -5000 70 26
DS -1020 -5000 -1520 -5000 70 26
DS -1520 -5000 -1520 -4750 70 26
DS -1520 -4750 -2520 -4750 70 26
DS -2520 -4750 -2520 -5000 70 26
DS -2520 -5000 -3020 -5000 70 26
DS -3020 -5000 -3020 -2250 70 26
DA 1420 -120 -3020 2000 511 70 26
DS -3020 2000 -3020 4500 70 26
DS -3020 4500 -2770 4500 70 26
DS 2750 4500 3000 4500 70 26
DS 3000 4500 3000 2000 70 26
DA -1250 -120 3000 -2250 531 70 26
DS 3000 -2250 3000 -5000 70 26
DS 3000 -5000 2500 -5000 70 26
DS 2500 -5000 2500 -4750 70 26
DS 2500 -4750 1500 -4750 70 26
DS 1500 -4750 1500 -5000 70 26
DS 1500 -5000 1000 -5000 70 26
DS 1000 -5000 1000 -4750 70 26
DS 1000 -4750 750 -4750 70 26
DC 0 0 2500 0 70 24
DS 750 4500 1250 4500 70 21
DS -1250 4500 -750 4500 70 21
DS -770 -4750 -1020 -4750 70 21
DS -1020 -4750 -1020 -5000 70 21
DS -1020 -5000 -1520 -5000 70 21
DS -1520 -5000 -1520 -4750 70 21
DS -1520 -4750 -2520 -4750 70 21
DS -2520 -4750 -2520 -5000 70 21
DS -2520 -5000 -3020 -5000 70 21
DS -3020 -5000 -3020 -2250 70 21
DA 1420 -120 -3020 2000 511 70 21
DS -3020 2000 -3020 4500 70 21
DS -3020 4500 -2770 4500 70 21
$PAD
Sh "1" R 980 980 0 0 0
Dr 460 0 0
At STD N 0CC08001
Ne 0 ""
Po -2000 4500
$EndPAD
$PAD
Sh "2" C 980 980 0 0 0
Dr 460 0 0
At STD N 0CC08001
Ne 0 ""
Po 0 4500
$EndPAD
$PAD
Sh "3" C 980 980 0 0 0
Dr 460 0 0
At STD N 0CC08001
Ne 0 ""
Po 2000 4500
$EndPAD
$PAD
Sh "4" C 980 980 0 0 0
Dr 460 0 0
At STD N 0CC08001
Ne 0 ""
Po 0 -4750
$EndPAD
$EndMODULE  PC1623
$MODULE PT15V
Po 0 0 0 15 4E930521 00000000 ~~
Li PT15V
Sc 00000000
AR
Op 0 0 0
T0 0 -3400 472 472 0 79 N V 21 N "PT15V"
T1 0 3800 472 472 0 79 N I 21 N "Val**"
DS 370 1310 370 -140 110 26
DS 370 -140 920 -140 110 26
DS 920 -140 370 -690 110 26
DS 370 -690 370 -1280 110 26
DA 0 50 -2950 60 1796 110 26
DC 0 20 1380 -20 110 26
DS -1490 3000 1500 3000 110 26
DA 2520 2740 2790 2730 943 110 26
DS 2790 2730 2790 1040 110 26
DA 20 80 -2790 1040 194 110 21
DS -350 1310 -350 -140 110 21
DS -350 -140 -900 -140 110 21
DS -900 -140 -350 -690 110 21
DS -350 -690 -350 -1280 110 21
DA -2520 2740 -2520 3000 921 110 26
DS -2790 2730 -2790 1040 110 26
DA -20 80 2950 50 193 110 26
DA 20 80 -2790 1040 194 110 26
DS -350 1310 -350 -140 110 26
DS -350 -140 -900 -140 110 26
DS -900 -140 -350 -690 110 26
DS -350 -690 -350 -1280 110 26
DS 370 1310 370 -140 110 21
DS 370 -140 920 -140 110 21
DS 920 -140 370 -690 110 21
DS 370 -690 370 -1280 110 21
DA 0 50 -2950 60 1796 110 21
DC 0 20 1380 -20 110 21
DS -1490 3000 1500 3000 110 21
DA 2520 2740 2790 2730 943 110 21
DS 2790 2730 2790 1040 110 21
DA -2520 2740 -2520 3000 921 110 21
DS -2790 2730 -2790 1040 110 21
DA -20 80 2950 50 193 110 21
$PAD
Sh "1" R 980 980 0 0 0
Dr 420 0 0
At STD N 0CC08001
Ne 0 ""
Po -2000 3000
$EndPAD
$PAD
Sh "2" C 980 980 0 0 0
Dr 420 0 0
At STD N 0CC08001
Ne 0 ""
Po 2000 3000
$EndPAD
$PAD
Sh "3" C 980 980 0 0 0
Dr 420 0 0
At STD N 0CC08001
Ne 0 ""
Po 0 -2000
$EndPAD
$EndMODULE  PT15V
$MODULE PT6V
Po 0 0 0 15 4E93043C 00000000 ~~
Li PT6V
Sc 00000000
AR
Op 0 0 0
T0 0 -2000 472 472 0 79 N V 21 N "PT6V"
T1 0 2000 472 472 0 79 N I 21 N "Val**"
DS -550 1000 550 1000 118 21
DS 1250 -50 1250 500 118 21
DS -1250 -50 -1250 500 118 21
DA 0 -50 0 -1300 900 118 21
DA 0 -50 -1250 -50 900 118 21
DS 100 -300 100 -150 30 26
DS 100 -150 250 0 30 26
DS 250 0 250 50 30 26
DS 250 50 100 50 30 26
DS 100 50 100 300 30 26
DS -100 -300 -100 -150 30 26
DS -100 -150 -250 0 30 26
DS -250 0 -250 50 30 26
DS -250 50 -100 50 30 26
DS -100 50 -100 300 30 26
DC 0 0 250 250 70 26
DS 100 -300 100 -150 30 21
DS 100 -150 250 0 30 21
DS 250 0 250 50 30 21
DS 250 50 100 50 30 21
DS 100 50 100 300 30 21
DS -100 -300 -100 -150 30 21
DS -100 -150 -250 0 30 21
DS -250 0 -250 50 30 21
DS -250 50 -100 50 30 21
DS -100 50 -100 300 30 21
DC 0 0 250 250 70 21
$PAD
Sh "1" R 700 700 0 0 0
Dr 380 0 0
At STD N 0CC08001
Ne 0 ""
Po -1000 1000
$EndPAD
$PAD
Sh "2" C 700 700 0 0 0
Dr 380 0 0
At STD N 0CC08001
Ne 0 ""
Po 0 -1000
$EndPAD
$PAD
Sh "3" C 700 700 0 0 0
Dr 380 0 0
At STD N 0CC08001
Ne 0 ""
Po 1000 1000
$EndPAD
$SHAPE3D
Na "Vlastni\\PT6L.wrl"
Sc 1.000000 1.000000 1.000000
Of 0.000000 0.000000 0.000000
Ro 0.000000 0.000000 0.000000
$EndSHAPE3D
$EndMODULE  PT6V
$MODULE PT10V
Po 0 0 0 15 4E9304B7 00000000 ~~
Li PT10V
Sc 00000000
AR 
Op 0 0 0
T0 0 -3000 472 472 0 79 N V 21 N "PT10V"
T1 0 3100 472 472 0 79 N I 21 N "Val**"
DS 1450 1450 1450 2000 110 26
DS -500 2000 500 2000 110 26
DS -1450 1450 -1450 2000 110 26
DA 10 0 -1450 1450 1204 110 26
DA -10 0 500 -2000 1204 110 26
DC 0 0 600 0 30 26
DS 100 550 100 50 30 21
DS 100 50 250 50 30 21
DS 250 50 100 -100 30 21
DS 100 -100 100 -600 30 21
DS -100 -600 -100 -100 30 21
DS -100 -100 -250 50 30 21
DS -250 50 -100 50 30 21
DS -100 50 -100 550 30 21
DS 1450 1450 1450 2000 110 21
DS -500 2000 500 2000 110 21
DS -1450 1450 -1450 2000 110 21
DA -10 0 500 -2000 1204 110 21
DA 10 0 -1450 1450 1204 110 21
DC 0 0 600 0 30 21
DS 100 550 100 50 30 26
DS 100 50 250 50 30 26
DS 250 50 100 -100 30 26
DS 100 -100 100 -600 30 26
DS -100 -600 -100 -100 30 26
DS -100 -100 -250 50 30 26
DS -250 50 -100 50 30 26
DS -100 50 -100 550 30 26
$PAD
Sh "1" R 980 980 0 0 0
Dr 420 0 0
At STD N 0CC08001
Ne 0 ""
Po -1000 2000
$EndPAD
$PAD
Sh "2" C 980 980 0 0 0
Dr 420 0 0
At STD N 0CC08001
Ne 0 ""
Po 0 -2000
$EndPAD
$PAD
Sh "3" C 980 980 0 0 0
Dr 420 0 0
At STD N 0CC08001
Ne 0 ""
Po 1000 2000
$EndPAD
$SHAPE3D
Na "Vlastni\\PT10L.wrl"
Sc 1.000000 1.000000 1.000000
Of 0.000000 0.000000 0.000000
Ro 0.000000 0.000000 0.000000
$EndSHAPE3D
$EndMODULE  PT10V
$EndLIBRARY
