PCBNEW-LibModule-V1  Út 12. červen 2012, 22:21:56 CEST
# encoding utf-8
Units deci-mils
$INDEX
24ZIF600
28ZIF600
32TEX600
32ZIF600
40ZIF600
U***
$EndINDEX
$MODULE 24ZIF600
Po 0 0 0 15 4FD7A2E1 00000000 ~~
Li 24ZIF600
Cd Support TEXTOOL Dil 26 pins, pads ronds, e=600 mils
Kw DEV
Sc 0
AR 
Op 0 0 0
T0 0 -5250 393 393 0 78 N V 21 N "24ZIF600"
T1 0 0 393 393 0 78 N I 21 N "Value"
DS -9000 4500 6000 4500 150 21
DS -7500 2000 6000 2000 150 21
DS -7500 -2000 6000 -2000 150 21
DS -9000 -4500 6000 -4500 150 21
DS 6000 2000 6000 -2000 150 21
DS -7500 -2000 -7500 2000 150 21
DS -11500 4000 -7500 4000 150 21
DS -7500 4000 -7500 4500 150 21
DS 6500 -4000 6000 -4500 150 21
DS -9000 -4500 -9500 -4000 150 21
DS -9500 -4000 -9500 4000 150 21
DS -9500 4000 -9000 4500 150 21
DS 6000 4500 6500 4000 150 21
DS 6500 4000 6500 -4000 150 21
DS -11500 4500 -9000 4500 150 21
DS -11500 4500 -11500 4000 150 21
DS -11500 4000 -12000 3500 150 21
DS -12000 3500 -14500 3500 150 21
DS -14500 3500 -15000 4000 150 21
DS -15000 4000 -15000 4500 150 21
DS -15000 4500 -14500 5000 150 21
DS -14500 5000 -12000 5000 150 21
DS -12000 5000 -11500 4500 150 21
$PAD
Sh "1" R 600 600 0 0 0
Dr 400 0 0
At STD N 00E0FFFF
Ne 0 ""
Po -5500 3000
$EndPAD
$PAD
Sh "2" C 600 600 0 0 0
Dr 400 0 0
At STD N 00E0FFFF
Ne 0 ""
Po -4500 3000
$EndPAD
$PAD
Sh "3" C 600 600 0 0 0
Dr 400 0 0
At STD N 00E0FFFF
Ne 0 ""
Po -3500 3000
$EndPAD
$PAD
Sh "4" C 600 600 0 0 0
Dr 400 0 0
At STD N 00E0FFFF
Ne 0 ""
Po -2500 3000
$EndPAD
$PAD
Sh "5" C 600 600 0 0 0
Dr 400 0 0
At STD N 00E0FFFF
Ne 0 ""
Po -1500 3000
$EndPAD
$PAD
Sh "6" C 600 600 0 0 0
Dr 400 0 0
At STD N 00E0FFFF
Ne 0 ""
Po -500 3000
$EndPAD
$PAD
Sh "7" C 600 600 0 0 0
Dr 400 0 0
At STD N 00E0FFFF
Ne 0 ""
Po 500 3000
$EndPAD
$PAD
Sh "8" C 600 600 0 0 0
Dr 400 0 0
At STD N 00E0FFFF
Ne 0 ""
Po 1500 3000
$EndPAD
$PAD
Sh "9" C 600 600 0 0 0
Dr 400 0 0
At STD N 00E0FFFF
Ne 0 ""
Po 2500 3000
$EndPAD
$PAD
Sh "10" C 600 600 0 0 0
Dr 400 0 0
At STD N 00E0FFFF
Ne 0 ""
Po 3500 3000
$EndPAD
$PAD
Sh "11" C 600 600 0 0 0
Dr 400 0 0
At STD N 00E0FFFF
Ne 0 ""
Po 4500 3000
$EndPAD
$PAD
Sh "12" C 600 600 0 0 0
Dr 400 0 0
At STD N 00E0FFFF
Ne 0 ""
Po 5500 3000
$EndPAD
$PAD
Sh "13" C 600 600 0 0 0
Dr 400 0 0
At STD N 00E0FFFF
Ne 0 ""
Po 5500 -3000
$EndPAD
$PAD
Sh "14" C 600 600 0 0 0
Dr 400 0 0
At STD N 00E0FFFF
Ne 0 ""
Po 4500 -3000
$EndPAD
$PAD
Sh "15" C 600 600 0 0 0
Dr 400 0 0
At STD N 00E0FFFF
Ne 0 ""
Po 3500 -3000
$EndPAD
$PAD
Sh "16" C 600 600 0 0 0
Dr 400 0 0
At STD N 00E0FFFF
Ne 0 ""
Po 2500 -3000
$EndPAD
$PAD
Sh "17" C 600 600 0 0 0
Dr 400 0 0
At STD N 00E0FFFF
Ne 0 ""
Po 1500 -3000
$EndPAD
$PAD
Sh "18" C 600 600 0 0 0
Dr 400 0 0
At STD N 00E0FFFF
Ne 0 ""
Po 500 -3000
$EndPAD
$PAD
Sh "19" C 600 600 0 0 0
Dr 400 0 0
At STD N 00E0FFFF
Ne 0 ""
Po -500 -3000
$EndPAD
$PAD
Sh "20" C 600 600 0 0 0
Dr 400 0 0
At STD N 00E0FFFF
Ne 0 ""
Po -1500 -3000
$EndPAD
$PAD
Sh "21" C 600 600 0 0 0
Dr 400 0 0
At STD N 00E0FFFF
Ne 0 ""
Po -2500 -3000
$EndPAD
$PAD
Sh "22" C 600 600 0 0 0
Dr 400 0 0
At STD N 00E0FFFF
Ne 0 ""
Po -3500 -3000
$EndPAD
$PAD
Sh "23" C 600 600 0 0 0
Dr 400 0 0
At STD N 00E0FFFF
Ne 0 ""
Po -4500 -3000
$EndPAD
$PAD
Sh "24" C 600 600 0 0 0
Dr 400 0 0
At STD N 00E0FFFF
Ne 0 ""
Po -5500 -3000
$EndPAD
$SHAPE3D
Na "sockets/ZIF_24.wrl"
Sc 1 1 1
Of 0 0 0
Ro 0 0 0
$EndSHAPE3D
$EndMODULE 24ZIF600
$MODULE 28ZIF600
Po 0 0 0 15 4FD7A363 00000000 ~~
Li 28ZIF600
Cd Support TEXTOOL Dil 26 pins, pads ronds, e=600 mils
Kw DEV
Sc 0
AR 
Op 0 0 0
T0 0 -5000 393 393 0 78 N V 21 N "28ZIF600"
T1 0 0 393 393 0 78 N I 21 N "Value"
DS -10000 4500 7000 4500 150 21
DS -8500 2000 7000 2000 150 21
DS -8500 -2000 7000 -2000 150 21
DS -10000 -4500 7000 -4500 150 21
DS 7000 2000 7000 -2000 150 21
DS -8500 -2000 -8500 2000 150 21
DS -12500 4000 -8500 4000 150 21
DS -8500 4000 -8500 4500 150 21
DS 7500 -4000 7000 -4500 150 21
DS -10000 -4500 -10500 -4000 150 21
DS -10500 -4000 -10500 4000 150 21
DS -10500 4000 -10000 4500 150 21
DS 7000 4500 7500 4000 150 21
DS 7500 4000 7500 -4000 150 21
DS -12500 4500 -10000 4500 150 21
DS -12500 4500 -12500 4000 150 21
DS -12500 4000 -13000 3500 150 21
DS -13000 3500 -15500 3500 150 21
DS -15500 3500 -16000 4000 150 21
DS -16000 4000 -16000 4500 150 21
DS -16000 4500 -15500 5000 150 21
DS -15500 5000 -13000 5000 150 21
DS -13000 5000 -12500 4500 150 21
$PAD
Sh "1" R 600 600 0 0 0
Dr 400 0 0
At STD N 00E0FFFF
Ne 0 ""
Po -6500 3000
$EndPAD
$PAD
Sh "2" C 600 600 0 0 0
Dr 400 0 0
At STD N 00E0FFFF
Ne 0 ""
Po -5500 3000
$EndPAD
$PAD
Sh "3" C 600 600 0 0 0
Dr 400 0 0
At STD N 00E0FFFF
Ne 0 ""
Po -4500 3000
$EndPAD
$PAD
Sh "4" C 600 600 0 0 0
Dr 400 0 0
At STD N 00E0FFFF
Ne 0 ""
Po -3500 3000
$EndPAD
$PAD
Sh "5" C 600 600 0 0 0
Dr 400 0 0
At STD N 00E0FFFF
Ne 0 ""
Po -2500 3000
$EndPAD
$PAD
Sh "6" C 600 600 0 0 0
Dr 400 0 0
At STD N 00E0FFFF
Ne 0 ""
Po -1500 3000
$EndPAD
$PAD
Sh "7" C 600 600 0 0 0
Dr 400 0 0
At STD N 00E0FFFF
Ne 0 ""
Po -500 3000
$EndPAD
$PAD
Sh "8" C 600 600 0 0 0
Dr 400 0 0
At STD N 00E0FFFF
Ne 0 ""
Po 500 3000
$EndPAD
$PAD
Sh "9" C 600 600 0 0 0
Dr 400 0 0
At STD N 00E0FFFF
Ne 0 ""
Po 1500 3000
$EndPAD
$PAD
Sh "10" C 600 600 0 0 0
Dr 400 0 0
At STD N 00E0FFFF
Ne 0 ""
Po 2500 3000
$EndPAD
$PAD
Sh "11" C 600 600 0 0 0
Dr 400 0 0
At STD N 00E0FFFF
Ne 0 ""
Po 3500 3000
$EndPAD
$PAD
Sh "12" C 600 600 0 0 0
Dr 400 0 0
At STD N 00E0FFFF
Ne 0 ""
Po 4500 3000
$EndPAD
$PAD
Sh "13" C 600 600 0 0 0
Dr 400 0 0
At STD N 00E0FFFF
Ne 0 ""
Po 5500 3000
$EndPAD
$PAD
Sh "14" C 600 600 0 0 0
Dr 400 0 0
At STD N 00E0FFFF
Ne 0 ""
Po 6500 3000
$EndPAD
$PAD
Sh "15" C 600 600 0 0 0
Dr 400 0 0
At STD N 00E0FFFF
Ne 0 ""
Po 6500 -3000
$EndPAD
$PAD
Sh "16" C 600 600 0 0 0
Dr 400 0 0
At STD N 00E0FFFF
Ne 0 ""
Po 5500 -3000
$EndPAD
$PAD
Sh "17" C 600 600 0 0 0
Dr 400 0 0
At STD N 00E0FFFF
Ne 0 ""
Po 4500 -3000
$EndPAD
$PAD
Sh "18" C 600 600 0 0 0
Dr 400 0 0
At STD N 00E0FFFF
Ne 0 ""
Po 3500 -3000
$EndPAD
$PAD
Sh "19" C 600 600 0 0 0
Dr 400 0 0
At STD N 00E0FFFF
Ne 0 ""
Po 2500 -3000
$EndPAD
$PAD
Sh "20" C 600 600 0 0 0
Dr 400 0 0
At STD N 00E0FFFF
Ne 0 ""
Po 1500 -3000
$EndPAD
$PAD
Sh "21" C 600 600 0 0 0
Dr 400 0 0
At STD N 00E0FFFF
Ne 0 ""
Po 500 -3000
$EndPAD
$PAD
Sh "22" C 600 600 0 0 0
Dr 400 0 0
At STD N 00E0FFFF
Ne 0 ""
Po -500 -3000
$EndPAD
$PAD
Sh "23" C 600 600 0 0 0
Dr 400 0 0
At STD N 00E0FFFF
Ne 0 ""
Po -1500 -3000
$EndPAD
$PAD
Sh "24" C 600 600 0 0 0
Dr 400 0 0
At STD N 00E0FFFF
Ne 0 ""
Po -2500 -3000
$EndPAD
$PAD
Sh "25" C 600 600 0 0 0
Dr 400 0 0
At STD N 00E0FFFF
Ne 0 ""
Po -3500 -3000
$EndPAD
$PAD
Sh "26" C 600 600 0 0 0
Dr 400 0 0
At STD N 00E0FFFF
Ne 0 ""
Po -4500 -3000
$EndPAD
$PAD
Sh "27" C 600 600 0 0 0
Dr 400 0 0
At STD N 00E0FFFF
Ne 0 ""
Po -5500 -3000
$EndPAD
$PAD
Sh "28" C 600 600 0 0 0
Dr 400 0 0
At STD N 00E0FFFF
Ne 0 ""
Po -6500 -3000
$EndPAD
$SHAPE3D
Na "sockets/ZIF_28.wrl"
Sc 1 1 1
Of 0 0 0
Ro 0 0 0
$EndSHAPE3D
$EndMODULE 28ZIF600
$MODULE 32TEX600
Po 0 0 0 15 4FD7A030 00000000 ~~
Li 32TEX600
Cd Support TEXTOOL Dil 40 pins, pads ronds, e=600 mils
Kw DEV
Sc 0
AR 
Op 0 0 0
T0 0 -5250 393 393 0 78 N V 21 N "32TEX600"
T1 0 0 393 393 0 78 N I 21 N "Value"
DS -11000 4500 10500 4500 150 21
DS -11000 -4500 10500 -4500 150 21
DS -9500 2000 9000 2000 150 21
DS -9500 -2000 9000 -2000 150 21
DS 9000 -2000 9000 2000 150 21
DS -9500 2000 -9500 -2000 150 21
DS -7500 -4500 -7500 -6000 150 21
DS -7500 -6000 -8000 -6500 150 21
DS -8000 -6500 -9000 -6500 150 21
DS -9000 -6500 -9500 -6000 150 21
DS -9500 -6000 -9500 -4500 150 21
DS 7000 4500 7000 6000 150 21
DS 7000 6000 6500 6500 150 21
DS 6500 6500 5500 6500 150 21
DS 5500 6500 5000 6000 150 21
DS 5000 6000 5000 4500 150 21
DS -9500 4000 -9500 4500 150 21
DS -17000 4000 -17000 4500 150 21
DS -17000 4500 -16500 5000 150 21
DS -16500 5000 -14000 5000 150 21
DS -14000 5000 -13500 4500 150 21
DS -13500 4500 -13500 4000 150 21
DS -13500 4000 -9500 4000 150 21
DS -13500 4500 -11000 4500 150 21
DS -13500 4000 -14000 3500 150 21
DS -14000 3500 -16500 3500 150 21
DS -16500 3500 -17000 4000 150 21
DS 10500 -4500 11000 -4000 150 21
DS 11000 -4000 11000 4000 150 21
DS 11000 4000 10500 4500 150 21
DS -11000 4500 -11500 4000 150 21
DS -11500 4000 -11500 -4000 150 21
DS -11500 -4000 -11000 -4500 150 21
$PAD
Sh "1" R 600 600 0 0 0
Dr 400 0 0
At STD N 00E0FFFF
Ne 0 ""
Po -7500 3000
$EndPAD
$PAD
Sh "2" C 600 600 0 0 0
Dr 400 0 0
At STD N 00E0FFFF
Ne 0 ""
Po -6500 3000
$EndPAD
$PAD
Sh "3" C 600 600 0 0 0
Dr 400 0 0
At STD N 00E0FFFF
Ne 0 ""
Po -5500 3000
$EndPAD
$PAD
Sh "4" C 600 600 0 0 0
Dr 400 0 0
At STD N 00E0FFFF
Ne 0 ""
Po -4500 3000
$EndPAD
$PAD
Sh "5" C 600 600 0 0 0
Dr 400 0 0
At STD N 00E0FFFF
Ne 0 ""
Po -3500 3000
$EndPAD
$PAD
Sh "6" C 600 600 0 0 0
Dr 400 0 0
At STD N 00E0FFFF
Ne 0 ""
Po -2500 3000
$EndPAD
$PAD
Sh "7" C 600 600 0 0 0
Dr 400 0 0
At STD N 00E0FFFF
Ne 0 ""
Po -1500 3000
$EndPAD
$PAD
Sh "8" C 600 600 0 0 0
Dr 400 0 0
At STD N 00E0FFFF
Ne 0 ""
Po -500 3000
$EndPAD
$PAD
Sh "9" C 600 600 0 0 0
Dr 400 0 0
At STD N 00E0FFFF
Ne 0 ""
Po 500 3000
$EndPAD
$PAD
Sh "10" C 600 600 0 0 0
Dr 400 0 0
At STD N 00E0FFFF
Ne 0 ""
Po 1500 3000
$EndPAD
$PAD
Sh "11" C 600 600 0 0 0
Dr 400 0 0
At STD N 00E0FFFF
Ne 0 ""
Po 2500 3000
$EndPAD
$PAD
Sh "12" C 600 600 0 0 0
Dr 400 0 0
At STD N 00E0FFFF
Ne 0 ""
Po 3500 3000
$EndPAD
$PAD
Sh "13" C 600 600 0 0 0
Dr 400 0 0
At STD N 00E0FFFF
Ne 0 ""
Po 4500 3000
$EndPAD
$PAD
Sh "14" C 600 600 0 0 0
Dr 400 0 0
At STD N 00E0FFFF
Ne 0 ""
Po 5500 3000
$EndPAD
$PAD
Sh "15" C 600 600 0 0 0
Dr 400 0 0
At STD N 00E0FFFF
Ne 0 ""
Po 6500 3000
$EndPAD
$PAD
Sh "16" C 600 600 0 0 0
Dr 400 0 0
At STD N 00E0FFFF
Ne 0 ""
Po 7500 3000
$EndPAD
$PAD
Sh "17" C 600 600 0 0 0
Dr 400 0 0
At STD N 00E0FFFF
Ne 0 ""
Po 7500 -3000
$EndPAD
$PAD
Sh "18" C 600 600 0 0 0
Dr 400 0 0
At STD N 00E0FFFF
Ne 0 ""
Po 6500 -3000
$EndPAD
$PAD
Sh "19" C 600 600 0 0 0
Dr 400 0 0
At STD N 00E0FFFF
Ne 0 ""
Po 5500 -3000
$EndPAD
$PAD
Sh "20" C 600 600 0 0 0
Dr 400 0 0
At STD N 00E0FFFF
Ne 0 ""
Po 4500 -3000
$EndPAD
$PAD
Sh "21" C 600 600 0 0 0
Dr 400 0 0
At STD N 00E0FFFF
Ne 0 ""
Po 3500 -3000
$EndPAD
$PAD
Sh "22" C 600 600 0 0 0
Dr 400 0 0
At STD N 00E0FFFF
Ne 0 ""
Po 2500 -3000
$EndPAD
$PAD
Sh "23" C 600 600 0 0 0
Dr 400 0 0
At STD N 00E0FFFF
Ne 0 ""
Po 1500 -3000
$EndPAD
$PAD
Sh "24" C 600 600 0 0 0
Dr 400 0 0
At STD N 00E0FFFF
Ne 0 ""
Po 500 -3000
$EndPAD
$PAD
Sh "25" C 600 600 0 0 0
Dr 400 0 0
At STD N 00E0FFFF
Ne 0 ""
Po -500 -3000
$EndPAD
$PAD
Sh "26" C 600 600 0 0 0
Dr 400 0 0
At STD N 00E0FFFF
Ne 0 ""
Po -1500 -3000
$EndPAD
$PAD
Sh "27" C 600 600 0 0 0
Dr 400 0 0
At STD N 00E0FFFF
Ne 0 ""
Po -2500 -3000
$EndPAD
$PAD
Sh "28" C 600 600 0 0 0
Dr 400 0 0
At STD N 00E0FFFF
Ne 0 ""
Po -3500 -3000
$EndPAD
$PAD
Sh "29" C 600 600 0 0 0
Dr 400 0 0
At STD N 00E0FFFF
Ne 0 ""
Po -4500 -3000
$EndPAD
$PAD
Sh "30" C 600 600 0 0 0
Dr 400 0 0
At STD N 00E0FFFF
Ne 0 ""
Po -5500 -3000
$EndPAD
$PAD
Sh "31" C 600 600 0 0 0
Dr 400 0 0
At STD N 00E0FFFF
Ne 0 ""
Po -6500 -3000
$EndPAD
$PAD
Sh "32" C 600 600 0 0 0
Dr 400 0 0
At STD N 00E0FFFF
Ne 0 ""
Po -7500 -3000
$EndPAD
$PAD
Sh "" C 1181 1181 0 0 0
Dr 1181 0 0
At HOLE N 00E0FFFF
Ne 0 ""
Po -8500 -5500
$EndPAD
$PAD
Sh "" C 1181 1181 0 0 0
Dr 1181 0 0
At HOLE N 00E0FFFF
Ne 0 ""
Po 6000 5500
$EndPAD
$SHAPE3D
Na "sockets/textool_32.wrl"
Sc 1 1 1
Of 0 0 0
Ro 0 0 0
$EndSHAPE3D
$EndMODULE 32TEX600
$MODULE 32ZIF600
Po 0 0 0 15 4FD7A3A4 00000000 ~~
Li 32ZIF600
Cd Support TEXTOOL Dil 40 pins, pads ronds, e=600 mils
Kw DEV
Sc 0
AR 
Op 0 0 0
T0 0 -5000 393 393 0 78 N V 21 N "32ZIF600"
T1 0 0 393 393 0 78 N I 21 N "Value"
DS -11000 4500 8500 4500 150 21
DS -9500 2000 8000 2000 150 21
DS -9500 -2000 8000 -2000 150 21
DS -11000 -4500 8500 -4500 150 21
DS 8000 -2000 8000 2000 150 21
DS -9500 2000 -9500 -2000 150 21
DS -9500 4000 -9500 4500 150 21
DS -17000 4000 -17000 4500 150 21
DS -17000 4500 -16500 5000 150 21
DS -16500 5000 -14000 5000 150 21
DS -14000 5000 -13500 4500 150 21
DS -13500 4500 -13500 4000 150 21
DS -13500 4000 -9500 4000 150 21
DS -13500 4500 -11000 4500 150 21
DS -13500 4000 -14000 3500 150 21
DS -14000 3500 -16500 3500 150 21
DS -16500 3500 -17000 4000 150 21
DS 8500 -4500 9000 -4000 150 21
DS 9000 -4000 9000 4000 150 21
DS 9000 4000 8500 4500 150 21
DS -11000 4500 -11500 4000 150 21
DS -11500 4000 -11500 -4000 150 21
DS -11500 -4000 -11000 -4500 150 21
$PAD
Sh "1" R 600 600 0 0 0
Dr 400 0 0
At STD N 00E0FFFF
Ne 0 ""
Po -7500 3000
$EndPAD
$PAD
Sh "2" C 600 600 0 0 0
Dr 400 0 0
At STD N 00E0FFFF
Ne 0 ""
Po -6500 3000
$EndPAD
$PAD
Sh "3" C 600 600 0 0 0
Dr 400 0 0
At STD N 00E0FFFF
Ne 0 ""
Po -5500 3000
$EndPAD
$PAD
Sh "4" C 600 600 0 0 0
Dr 400 0 0
At STD N 00E0FFFF
Ne 0 ""
Po -4500 3000
$EndPAD
$PAD
Sh "5" C 600 600 0 0 0
Dr 400 0 0
At STD N 00E0FFFF
Ne 0 ""
Po -3500 3000
$EndPAD
$PAD
Sh "6" C 600 600 0 0 0
Dr 400 0 0
At STD N 00E0FFFF
Ne 0 ""
Po -2500 3000
$EndPAD
$PAD
Sh "7" C 600 600 0 0 0
Dr 400 0 0
At STD N 00E0FFFF
Ne 0 ""
Po -1500 3000
$EndPAD
$PAD
Sh "8" C 600 600 0 0 0
Dr 400 0 0
At STD N 00E0FFFF
Ne 0 ""
Po -500 3000
$EndPAD
$PAD
Sh "9" C 600 600 0 0 0
Dr 400 0 0
At STD N 00E0FFFF
Ne 0 ""
Po 500 3000
$EndPAD
$PAD
Sh "10" C 600 600 0 0 0
Dr 400 0 0
At STD N 00E0FFFF
Ne 0 ""
Po 1500 3000
$EndPAD
$PAD
Sh "11" C 600 600 0 0 0
Dr 400 0 0
At STD N 00E0FFFF
Ne 0 ""
Po 2500 3000
$EndPAD
$PAD
Sh "12" C 600 600 0 0 0
Dr 400 0 0
At STD N 00E0FFFF
Ne 0 ""
Po 3500 3000
$EndPAD
$PAD
Sh "13" C 600 600 0 0 0
Dr 400 0 0
At STD N 00E0FFFF
Ne 0 ""
Po 4500 3000
$EndPAD
$PAD
Sh "14" C 600 600 0 0 0
Dr 400 0 0
At STD N 00E0FFFF
Ne 0 ""
Po 5500 3000
$EndPAD
$PAD
Sh "15" C 600 600 0 0 0
Dr 400 0 0
At STD N 00E0FFFF
Ne 0 ""
Po 6500 3000
$EndPAD
$PAD
Sh "16" C 600 600 0 0 0
Dr 400 0 0
At STD N 00E0FFFF
Ne 0 ""
Po 7500 3000
$EndPAD
$PAD
Sh "17" C 600 600 0 0 0
Dr 400 0 0
At STD N 00E0FFFF
Ne 0 ""
Po 7500 -3000
$EndPAD
$PAD
Sh "18" C 600 600 0 0 0
Dr 400 0 0
At STD N 00E0FFFF
Ne 0 ""
Po 6500 -3000
$EndPAD
$PAD
Sh "19" C 600 600 0 0 0
Dr 400 0 0
At STD N 00E0FFFF
Ne 0 ""
Po 5500 -3000
$EndPAD
$PAD
Sh "20" C 600 600 0 0 0
Dr 400 0 0
At STD N 00E0FFFF
Ne 0 ""
Po 4500 -3000
$EndPAD
$PAD
Sh "21" C 600 600 0 0 0
Dr 400 0 0
At STD N 00E0FFFF
Ne 0 ""
Po 3500 -3000
$EndPAD
$PAD
Sh "22" C 600 600 0 0 0
Dr 400 0 0
At STD N 00E0FFFF
Ne 0 ""
Po 2500 -3000
$EndPAD
$PAD
Sh "23" C 600 600 0 0 0
Dr 400 0 0
At STD N 00E0FFFF
Ne 0 ""
Po 1500 -3000
$EndPAD
$PAD
Sh "24" C 600 600 0 0 0
Dr 400 0 0
At STD N 00E0FFFF
Ne 0 ""
Po 500 -3000
$EndPAD
$PAD
Sh "25" C 600 600 0 0 0
Dr 400 0 0
At STD N 00E0FFFF
Ne 0 ""
Po -500 -3000
$EndPAD
$PAD
Sh "26" C 600 600 0 0 0
Dr 400 0 0
At STD N 00E0FFFF
Ne 0 ""
Po -1500 -3000
$EndPAD
$PAD
Sh "27" C 600 600 0 0 0
Dr 400 0 0
At STD N 00E0FFFF
Ne 0 ""
Po -2500 -3000
$EndPAD
$PAD
Sh "28" C 600 600 0 0 0
Dr 400 0 0
At STD N 00E0FFFF
Ne 0 ""
Po -3500 -3000
$EndPAD
$PAD
Sh "29" C 600 600 0 0 0
Dr 400 0 0
At STD N 00E0FFFF
Ne 0 ""
Po -4500 -3000
$EndPAD
$PAD
Sh "30" C 600 600 0 0 0
Dr 400 0 0
At STD N 00E0FFFF
Ne 0 ""
Po -5500 -3000
$EndPAD
$PAD
Sh "31" C 600 600 0 0 0
Dr 400 0 0
At STD N 00E0FFFF
Ne 0 ""
Po -6500 -3000
$EndPAD
$PAD
Sh "32" C 600 600 0 0 0
Dr 400 0 0
At STD N 00E0FFFF
Ne 0 ""
Po -7500 -3000
$EndPAD
$SHAPE3D
Na "sockets/ZIF_32.wrl"
Sc 1 1 1
Of -0.05 0 0
Ro 0 0 0
$EndSHAPE3D
$EndMODULE 32ZIF600
$MODULE 40ZIF600
Po 0 0 0 15 4FD7A41F 00000000 ~~
Li 40ZIF600
Cd Support TEXTOOL Dil 40 pins, pads ronds, e=600 mils
Kw DEV
Sc 0
AR 
Op 0 0 0
T0 0 -5000 393 393 0 78 N V 21 N "40ZIF600"
T1 0 0 393 393 0 78 N I 21 N "Value"
DS -13000 4500 10000 4500 150 21
DS -11500 2000 10000 2000 150 21
DS -11500 -2000 10000 -2000 150 21
DS -13000 -4500 10000 -4500 150 21
DS 10000 -2000 10000 2000 150 21
DS -11500 2000 -11500 -2000 150 21
DS -11500 4000 -11500 4500 150 21
DS -19000 4000 -19000 4500 150 21
DS -19000 4500 -18500 5000 150 21
DS -18500 5000 -16000 5000 150 21
DS -16000 5000 -15500 4500 150 21
DS -15500 4500 -15500 4000 150 21
DS -15500 4000 -11500 4000 150 21
DS -15500 4500 -13000 4500 150 21
DS -15500 4000 -16000 3500 150 21
DS -16000 3500 -18500 3500 150 21
DS -18500 3500 -19000 4000 150 21
DS 10000 -4500 10500 -4000 150 21
DS 10500 -4000 10500 4000 150 21
DS 10500 4000 10000 4500 150 21
DS -13000 4500 -13500 4000 150 21
DS -13500 4000 -13500 -4000 150 21
DS -13500 -4000 -13000 -4500 150 21
$PAD
Sh "1" R 600 600 0 0 0
Dr 400 0 0
At STD N 00E0FFFF
Ne 0 ""
Po -9500 3000
$EndPAD
$PAD
Sh "2" C 600 600 0 0 0
Dr 400 0 0
At STD N 00E0FFFF
Ne 0 ""
Po -8500 3000
$EndPAD
$PAD
Sh "3" C 600 600 0 0 0
Dr 400 0 0
At STD N 00E0FFFF
Ne 0 ""
Po -7500 3000
$EndPAD
$PAD
Sh "4" C 600 600 0 0 0
Dr 400 0 0
At STD N 00E0FFFF
Ne 0 ""
Po -6500 3000
$EndPAD
$PAD
Sh "5" C 600 600 0 0 0
Dr 400 0 0
At STD N 00E0FFFF
Ne 0 ""
Po -5500 3000
$EndPAD
$PAD
Sh "6" C 600 600 0 0 0
Dr 400 0 0
At STD N 00E0FFFF
Ne 0 ""
Po -4500 3000
$EndPAD
$PAD
Sh "7" C 600 600 0 0 0
Dr 400 0 0
At STD N 00E0FFFF
Ne 0 ""
Po -3500 3000
$EndPAD
$PAD
Sh "8" C 600 600 0 0 0
Dr 400 0 0
At STD N 00E0FFFF
Ne 0 ""
Po -2500 3000
$EndPAD
$PAD
Sh "9" C 600 600 0 0 0
Dr 400 0 0
At STD N 00E0FFFF
Ne 0 ""
Po -1500 3000
$EndPAD
$PAD
Sh "10" C 600 600 0 0 0
Dr 400 0 0
At STD N 00E0FFFF
Ne 0 ""
Po -500 3000
$EndPAD
$PAD
Sh "11" C 600 600 0 0 0
Dr 400 0 0
At STD N 00E0FFFF
Ne 0 ""
Po 500 3000
$EndPAD
$PAD
Sh "12" C 600 600 0 0 0
Dr 400 0 0
At STD N 00E0FFFF
Ne 0 ""
Po 1500 3000
$EndPAD
$PAD
Sh "13" C 600 600 0 0 0
Dr 400 0 0
At STD N 00E0FFFF
Ne 0 ""
Po 2500 3000
$EndPAD
$PAD
Sh "14" C 600 600 0 0 0
Dr 400 0 0
At STD N 00E0FFFF
Ne 0 ""
Po 3500 3000
$EndPAD
$PAD
Sh "15" C 600 600 0 0 0
Dr 400 0 0
At STD N 00E0FFFF
Ne 0 ""
Po 4500 3000
$EndPAD
$PAD
Sh "16" C 600 600 0 0 0
Dr 400 0 0
At STD N 00E0FFFF
Ne 0 ""
Po 5500 3000
$EndPAD
$PAD
Sh "17" C 600 600 0 0 0
Dr 400 0 0
At STD N 00E0FFFF
Ne 0 ""
Po 6500 3000
$EndPAD
$PAD
Sh "18" C 600 600 0 0 0
Dr 400 0 0
At STD N 00E0FFFF
Ne 0 ""
Po 7500 3000
$EndPAD
$PAD
Sh "19" C 600 600 0 0 0
Dr 400 0 0
At STD N 00E0FFFF
Ne 0 ""
Po 8500 3000
$EndPAD
$PAD
Sh "20" C 600 600 0 0 0
Dr 400 0 0
At STD N 00E0FFFF
Ne 0 ""
Po 9500 3000
$EndPAD
$PAD
Sh "21" C 600 600 0 0 0
Dr 400 0 0
At STD N 00E0FFFF
Ne 0 ""
Po 9500 -3000
$EndPAD
$PAD
Sh "22" C 600 600 0 0 0
Dr 400 0 0
At STD N 00E0FFFF
Ne 0 ""
Po 8500 -3000
$EndPAD
$PAD
Sh "23" C 600 600 0 0 0
Dr 400 0 0
At STD N 00E0FFFF
Ne 0 ""
Po 7500 -3000
$EndPAD
$PAD
Sh "24" C 600 600 0 0 0
Dr 400 0 0
At STD N 00E0FFFF
Ne 0 ""
Po 6500 -3000
$EndPAD
$PAD
Sh "25" C 600 600 0 0 0
Dr 400 0 0
At STD N 00E0FFFF
Ne 0 ""
Po 5500 -3000
$EndPAD
$PAD
Sh "26" C 600 600 0 0 0
Dr 400 0 0
At STD N 00E0FFFF
Ne 0 ""
Po 4500 -3000
$EndPAD
$PAD
Sh "27" C 600 600 0 0 0
Dr 400 0 0
At STD N 00E0FFFF
Ne 0 ""
Po 3500 -3000
$EndPAD
$PAD
Sh "28" C 600 600 0 0 0
Dr 400 0 0
At STD N 00E0FFFF
Ne 0 ""
Po 2500 -3000
$EndPAD
$PAD
Sh "29" C 600 600 0 0 0
Dr 400 0 0
At STD N 00E0FFFF
Ne 0 ""
Po 1500 -3000
$EndPAD
$PAD
Sh "30" C 600 600 0 0 0
Dr 400 0 0
At STD N 00E0FFFF
Ne 0 ""
Po 500 -3000
$EndPAD
$PAD
Sh "31" C 600 600 0 0 0
Dr 400 0 0
At STD N 00E0FFFF
Ne 0 ""
Po -500 -3000
$EndPAD
$PAD
Sh "32" C 600 600 0 0 0
Dr 400 0 0
At STD N 00E0FFFF
Ne 0 ""
Po -1500 -3000
$EndPAD
$PAD
Sh "33" C 600 600 0 0 0
Dr 400 0 0
At STD N 00E0FFFF
Ne 0 ""
Po -2500 -3000
$EndPAD
$PAD
Sh "34" C 600 600 0 0 0
Dr 400 0 0
At STD N 00E0FFFF
Ne 0 ""
Po -3500 -3000
$EndPAD
$PAD
Sh "35" C 600 600 0 0 0
Dr 400 0 0
At STD N 00E0FFFF
Ne 0 ""
Po -4500 -3000
$EndPAD
$PAD
Sh "36" C 600 600 0 0 0
Dr 400 0 0
At STD N 00E0FFFF
Ne 0 ""
Po -5500 -3000
$EndPAD
$PAD
Sh "37" C 600 600 0 0 0
Dr 400 0 0
At STD N 00E0FFFF
Ne 0 ""
Po -6500 -3000
$EndPAD
$PAD
Sh "38" C 600 600 0 0 0
Dr 400 0 0
At STD N 00E0FFFF
Ne 0 ""
Po -7500 -3000
$EndPAD
$PAD
Sh "39" C 600 600 0 0 0
Dr 400 0 0
At STD N 00E0FFFF
Ne 0 ""
Po -8500 -3000
$EndPAD
$PAD
Sh "40" C 600 600 0 0 0
Dr 400 0 0
At STD N 00E0FFFF
Ne 0 ""
Po -9500 -3000
$EndPAD
$SHAPE3D
Na "sockets/ZIF_40.wrl"
Sc 1 1 1
Of 0 0 0
Ro 0 0 0
$EndSHAPE3D
$EndMODULE 40ZIF600
$MODULE U***
Po 0 0 0 15 44B951FE 44C3C6D9 ~~
Li U***
Cd Support TEXTOOL Dil 40 pins, pads ronds, e=600 mils
Kw DEV
Sc 44C3C6D9
AR 
Op 0 0 0
T0 -6500 -1000 800 500 0 120 N V 21 N "U***"
T1 0 0 800 500 0 120 N V 21 N "32TEX600"
DS -11000 4500 10500 4500 150 21
DS -11000 -4500 10500 -4500 150 21
DS -9500 2000 9000 2000 150 21
DS -9500 -2000 9000 -2000 150 21
DS 9000 -2000 9000 2000 150 21
DS -9500 2000 -9500 -2000 150 21
DS -7500 -4500 -7500 -6000 150 21
DS -7500 -6000 -8000 -6500 150 21
DS -8000 -6500 -9000 -6500 150 21
DS -9000 -6500 -9500 -6000 150 21
DS -9500 -6000 -9500 -4500 150 21
DS 7000 4500 7000 6000 150 21
DS 7000 6000 6500 6500 150 21
DS 6500 6500 5500 6500 150 21
DS 5500 6500 5000 6000 150 21
DS 5000 6000 5000 4500 150 21
DS -9500 4000 -9500 4500 150 21
DS -17000 4000 -17000 4500 150 21
DS -17000 4500 -16500 5000 150 21
DS -16500 5000 -14000 5000 150 21
DS -14000 5000 -13500 4500 150 21
DS -13500 4500 -13500 4000 150 21
DS -13500 4000 -9500 4000 150 21
DS -13500 4500 -11000 4500 150 21
DS -13500 4000 -14000 3500 150 21
DS -14000 3500 -16500 3500 150 21
DS -16500 3500 -17000 4000 150 21
DS 10500 -4500 11000 -4000 150 21
DS 11000 -4000 11000 4000 150 21
DS 11000 4000 10500 4500 150 21
DS -11000 4500 -11500 4000 150 21
DS -11500 4000 -11500 -4000 150 21
DS -11500 -4000 -11000 -4500 150 21
$PAD
Sh "1" R 600 600 0 0 0
Dr 400 0 0
At STD N 00E0FFFF
Ne 0 ""
Po -7500 3000
$EndPAD
$PAD
Sh "2" C 600 600 0 0 0
Dr 400 0 0
At STD N 00E0FFFF
Ne 0 ""
Po -6500 3000
$EndPAD
$PAD
Sh "3" C 600 600 0 0 0
Dr 400 0 0
At STD N 00E0FFFF
Ne 0 ""
Po -5500 3000
$EndPAD
$PAD
Sh "4" C 600 600 0 0 0
Dr 400 0 0
At STD N 00E0FFFF
Ne 0 ""
Po -4500 3000
$EndPAD
$PAD
Sh "5" C 600 600 0 0 0
Dr 400 0 0
At STD N 00E0FFFF
Ne 0 ""
Po -3500 3000
$EndPAD
$PAD
Sh "6" C 600 600 0 0 0
Dr 400 0 0
At STD N 00E0FFFF
Ne 0 ""
Po -2500 3000
$EndPAD
$PAD
Sh "7" C 600 600 0 0 0
Dr 400 0 0
At STD N 00E0FFFF
Ne 0 ""
Po -1500 3000
$EndPAD
$PAD
Sh "8" C 600 600 0 0 0
Dr 400 0 0
At STD N 00E0FFFF
Ne 0 ""
Po -500 3000
$EndPAD
$PAD
Sh "9" C 600 600 0 0 0
Dr 400 0 0
At STD N 00E0FFFF
Ne 0 ""
Po 500 3000
$EndPAD
$PAD
Sh "10" C 600 600 0 0 0
Dr 400 0 0
At STD N 00E0FFFF
Ne 0 ""
Po 1500 3000
$EndPAD
$PAD
Sh "11" C 600 600 0 0 0
Dr 400 0 0
At STD N 00E0FFFF
Ne 0 ""
Po 2500 3000
$EndPAD
$PAD
Sh "12" C 600 600 0 0 0
Dr 400 0 0
At STD N 00E0FFFF
Ne 0 ""
Po 3500 3000
$EndPAD
$PAD
Sh "13" C 600 600 0 0 0
Dr 400 0 0
At STD N 00E0FFFF
Ne 0 ""
Po 4500 3000
$EndPAD
$PAD
Sh "14" C 600 600 0 0 0
Dr 400 0 0
At STD N 00E0FFFF
Ne 0 ""
Po 5500 3000
$EndPAD
$PAD
Sh "15" C 600 600 0 0 0
Dr 400 0 0
At STD N 00E0FFFF
Ne 0 ""
Po 6500 3000
$EndPAD
$PAD
Sh "16" C 600 600 0 0 0
Dr 400 0 0
At STD N 00E0FFFF
Ne 0 ""
Po 7500 3000
$EndPAD
$PAD
Sh "17" C 600 600 0 0 0
Dr 400 0 0
At STD N 00E0FFFF
Ne 0 ""
Po 7500 -3000
$EndPAD
$PAD
Sh "18" C 600 600 0 0 0
Dr 400 0 0
At STD N 00E0FFFF
Ne 0 ""
Po 6500 -3000
$EndPAD
$PAD
Sh "19" C 600 600 0 0 0
Dr 400 0 0
At STD N 00E0FFFF
Ne 0 ""
Po 5500 -3000
$EndPAD
$PAD
Sh "20" C 600 600 0 0 0
Dr 400 0 0
At STD N 00E0FFFF
Ne 0 ""
Po 4500 -3000
$EndPAD
$PAD
Sh "21" C 600 600 0 0 0
Dr 400 0 0
At STD N 00E0FFFF
Ne 0 ""
Po 3500 -3000
$EndPAD
$PAD
Sh "22" C 600 600 0 0 0
Dr 400 0 0
At STD N 00E0FFFF
Ne 0 ""
Po 2500 -3000
$EndPAD
$PAD
Sh "23" C 600 600 0 0 0
Dr 400 0 0
At STD N 00E0FFFF
Ne 0 ""
Po 1500 -3000
$EndPAD
$PAD
Sh "24" C 600 600 0 0 0
Dr 400 0 0
At STD N 00E0FFFF
Ne 0 ""
Po 500 -3000
$EndPAD
$PAD
Sh "25" C 600 600 0 0 0
Dr 400 0 0
At STD N 00E0FFFF
Ne 0 ""
Po -500 -3000
$EndPAD
$PAD
Sh "26" C 600 600 0 0 0
Dr 400 0 0
At STD N 00E0FFFF
Ne 0 ""
Po -1500 -3000
$EndPAD
$PAD
Sh "27" C 600 600 0 0 0
Dr 400 0 0
At STD N 00E0FFFF
Ne 0 ""
Po -2500 -3000
$EndPAD
$PAD
Sh "28" C 600 600 0 0 0
Dr 400 0 0
At STD N 00E0FFFF
Ne 0 ""
Po -3500 -3000
$EndPAD
$PAD
Sh "29" C 600 600 0 0 0
Dr 400 0 0
At STD N 00E0FFFF
Ne 0 ""
Po -4500 -3000
$EndPAD
$PAD
Sh "30" C 600 600 0 0 0
Dr 400 0 0
At STD N 00E0FFFF
Ne 0 ""
Po -5500 -3000
$EndPAD
$PAD
Sh "31" C 600 600 0 0 0
Dr 400 0 0
At STD N 00E0FFFF
Ne 0 ""
Po -6500 -3000
$EndPAD
$PAD
Sh "32" C 600 600 0 0 0
Dr 400 0 0
At STD N 00E0FFFF
Ne 0 ""
Po -7500 -3000
$EndPAD
$PAD
Sh "HOLE" C 600 600 0 0 0
Dr 400 0 0
At STD N 00E0FFFF
Ne 0 ""
Po -8500 -5500
$EndPAD
$PAD
Sh "HOLE" C 600 600 0 0 0
Dr 400 0 0
At STD N 00E0FFFF
Ne 0 ""
Po 6000 5500
$EndPAD
$SHAPE3D
Na "novos/textool_32.wrl"
Sc 1 1 1
Of 0 0 0
Ro 0 0 0
$EndSHAPE3D
$EndMODULE U***
$EndLIBRARY
