PCBNEW-LibModule-V1  11.5.2012 21:18:14
# encoding utf-8
$INDEX
BATERIA1
BATERIA2
BATERIASUPORTE
$EndINDEX
$MODULE BATERIASUPORTE
Po 0 0 0 15 44B94481 00000000 ~~
Li BATERIASUPORTE
Sc 00000000
AR
Op 0 0 0
.SolderPasteRatio 9.44317e-317
T0 150 -4750 600 600 0 120 N V 21 N "BATERIASUPORTE"
T1 100 4700 600 600 0 120 N V 21 N "VAL**"
DC 0 0 4050 300 150 21
DS 2000 -50 2700 -50 150 21
DS -2250 -550 -2250 450 150 21
DS -2800 50 -1650 50 150 21
$PAD
Sh "1" C 984 984 0 0 0
Dr 591 0 0
At STD N 00E0FFFF
Ne 0 ""
Po -3950 -50
$EndPAD
$PAD
Sh "2" C 984 984 0 0 0
Dr 591 0 0
At STD N 00E0FFFF
Ne 0 ""
Po 3950 0
$EndPAD
$SHAPE3D
Na "Battery\\bateria_suporte.wrl"
Sc 2.000000 2.000000 2.000000
Of 0.000000 0.000000 0.000000
Ro 0.000000 0.000000 0.000000
$EndSHAPE3D
$EndMODULE  BATERIASUPORTE
$MODULE BATERIA2
Po 0 0 0 15 44B94554 00000000 ~~
Li BATERIA2
Sc 00000000
AR
Op 0 0 0
T0 150 -4750 600 600 0 120 N V 21 N "BATERIA2"
T1 100 4700 600 600 0 120 N V 21 N "VAL**"
DC 0 0 4050 300 150 21
DS 2000 -50 2700 -50 150 21
DS -2250 -550 -2250 450 150 21
DS -2800 50 -1650 50 150 21
$PAD
Sh "1" C 984 984 0 0 0
Dr 591 0 0
At STD N 00E0FFFF
Ne 0 ""
Po -3950 -50
$EndPAD
$PAD
Sh "2" C 984 984 0 0 0
Dr 591 0 0
At STD N 00E0FFFF
Ne 0 ""
Po 1900 0
$EndPAD
$SHAPE3D
Na "Battery\\bateria2.wrl"
Sc 2.000000 2.000000 2.000000
Of 0.000000 0.000000 0.000000
Ro 0.000000 0.000000 0.000000
$EndSHAPE3D
$EndMODULE  BATERIA2
$MODULE BATERIA1
Po 0 0 0 15 44B9426C 00000000 ~~
Li BATERIA1
Sc 00000000
AR 
Op 0 0 0
T0 50 -4200 600 600 0 120 N V 21 N "BATERIA1"
T1 -50 4150 600 600 0 120 N V 21 N "VAL**"
DS 2000 -50 2700 -50 150 21
DS -2250 -550 -2250 450 150 21
DS -2800 50 -1650 50 150 21
DS -4000 -50 -4000 3550 150 21
DS -4000 3550 4050 3550 150 21
DS 4050 3550 4050 -3500 150 21
DS 4050 -3500 4050 -3550 150 21
DS 4050 -3550 -4000 -3550 150 21
DS -4000 -3550 -4000 100 150 21
$PAD
Sh "1" C 984 984 0 0 0
Dr 591 0 0
At STD N 00E0FFFF
Ne 0 ""
Po -3950 -50
$EndPAD
$PAD
Sh "2" C 984 984 0 0 0
Dr 591 0 0
At STD N 00E0FFFF
Ne 0 ""
Po 3950 0
$EndPAD
$SHAPE3D
Na "Battery\\bateria1.wrl"
Sc 2.200000 2.200000 2.200000
Of 0.000000 0.000000 0.000000
Ro 0.000000 0.000000 0.000000
$EndSHAPE3D
$EndMODULE  BATERIA1
$EndLIBRARY
