PCBNEW-LibModule-V1  4.4.2010 14:14:07
$INDEX
PSH02-02W
PSH02-09W
$EndINDEX
$MODULE PSH02-02W
Po 0 0 0 15 43C58C74 00000000 ~~
Li PSH02-02W
Sc 00000000
AR
Op 0 0 0
T0 0 -79 157 157 -1800 20 N V 21 N"J4"
T1 0 118 118 118 -1800 20 N I 21 N"PSH02-2P"
DS 1550 -1700 1550 -700 70 21
DS 1550 -700 -550 -700 70 21
DS -550 -700 -550 -1700 70 21
DS -550 -1700 0 -1700 70 21
DS 0 -1700 1550 -1700 70 21
DS 1550 -1700 1550 -700 70 26
DS 1550 -700 -550 -700 70 26
DS -550 -700 -550 -1700 70 26
DS -550 -1700 0 -1700 70 26
DS 0 -1700 1550 -1700 70 26
DS -590 440 1580 440 1 24
DS 1580 440 1580 -4280 1 24
DS 1580 -4280 -590 -4280 1 24
DS -590 -4280 -590 440 1 24
DS 1000 -1750 1000 -4250 70 21
DS 1000 -1750 1000 -4250 70 26
DS 0 -1750 0 -4250 70 21
DS 0 -1750 0 -4250 70 26
$PAD
Sh "1" R 580 1180 0 0 0
Dr 380 0 0
At STD N 0CC08001
Ne 2 "N1512936"
Po 0 0
$EndPAD
$PAD
Sh "2" O 580 1180 0 0 0
Dr 380 0 0
At STD N 0CC08001
Ne 1 "GND"
Po 1000 0
$EndPAD
$EndMODULE  PSH02-02W
$MODULE PSH02-09W
Po 0 0 0 15 43C58C74 00000000 ~~
Li PSH02-09W
Sc 00000000
AR 
Op 0 0 0
T0 0 -79 157 157 -2700 20 N V 21 N"J3"
T1 0 118 118 118 -2700 20 N I 21 N"PSH02-09W"
DS 2000 -1750 2000 -4250 70 21
DS 2000 -1750 2000 -4250 70 26
DS 0 -1750 0 -4250 70 21
DS 0 -1750 0 -4250 70 26
DS -590 440 8580 440 1 24
DS 8580 440 8580 -4280 1 24
DS 8580 -4280 -590 -4280 1 24
DS -590 -4280 -590 440 1 24
DS 8000 -1750 8000 -4250 70 21
DS 8000 -1750 8000 -4250 70 26
DS 6000 -1750 6000 -4250 70 21
DS 6000 -1750 6000 -4250 70 26
DS 4000 -4250 4000 -1750 70 26
DS 8550 -1700 8550 -700 70 21
DS 8550 -700 8550 -700 70 21
DS 8550 -700 -550 -700 70 21
DS -550 -700 -550 -1700 70 21
DS -550 -1700 0 -1700 70 21
DS 0 -1700 2000 -1700 70 21
DS 2000 -1700 4000 -1700 70 21
DS 4000 -1700 6000 -1700 70 21
DS 6000 -1700 7950 -1700 70 21
DS 7950 -1700 8550 -1700 70 21
DS 8550 -1700 8550 -700 70 26
DS 8550 -700 8550 -700 70 26
DS 8550 -700 -550 -700 70 26
DS -550 -700 -550 -1700 70 26
DS -550 -1700 0 -1700 70 26
DS 0 -1700 2000 -1700 70 26
DS 2000 -1700 4000 -1700 70 26
DS 4000 -1700 6000 -1700 70 26
DS 6000 -1700 7950 -1700 70 26
DS 7950 -1700 8550 -1700 70 26
DS 4000 -4250 4000 -1750 70 21
$PAD
Sh "1" R 580 1180 0 0 0
Dr 380 0 0
At STD N 0CC08001
Ne 9 "N155710"
Po 0 0
$EndPAD
$PAD
Sh "2" O 580 1180 0 0 0
Dr 380 0 0
At STD N 0CC08001
Ne 8 "N155708"
Po 1000 0
$EndPAD
$PAD
Sh "3" O 580 1180 0 0 0
Dr 380 0 0
At STD N 0CC08001
Ne 7 "N155706"
Po 2000 0
$EndPAD
$PAD
Sh "4" O 580 1180 0 0 0
Dr 380 0 0
At STD N 0CC08001
Ne 6 "N155704"
Po 3000 0
$EndPAD
$PAD
Sh "5" O 580 1180 0 0 0
Dr 380 0 0
At STD N 0CC08001
Ne 5 "N155702"
Po 4000 0
$EndPAD
$PAD
Sh "6" O 580 1180 0 0 0
Dr 380 0 0
At STD N 0CC08001
Ne 4 "N155700"
Po 5000 0
$EndPAD
$PAD
Sh "7" O 580 1180 0 0 0
Dr 380 0 0
At STD N 0CC08001
Ne 3 "N155698"
Po 6000 0
$EndPAD
$PAD
Sh "8" O 580 1180 0 0 0
Dr 380 0 0
At STD N 0CC08001
Ne 2 "N155696"
Po 7000 0
$EndPAD
$PAD
Sh "9" O 580 1180 0 0 0
Dr 380 0 0
At STD N 0CC08001
Ne 1 "GND"
Po 8000 0
$EndPAD
$EndMODULE  PSH02-09W
$EndLIBRARY
