PCBNEW-LibModule-V1  19/8/2005-15:49:19
$INDEX
PIN_ARRAY_10x2
$EndINDEX
$MODULE PIN_ARRAY_10x2
Po 0 0 0 15 4305FF6D 4305FF07 ~~
Li PIN_ARRAY_10x2
Cd Double rangee de contacts 2 x 8 pins
Kw CONN
Sc 4305FF07
Op 0 0 0
T0 1000 -1300 400 400 0 80 N V 21 "PIN_ARRAY_10x2"
T1 1300 1300 400 400 0 80 N V 21 "Val**"
DS 2900 -900 4900 -900 120 21
DS 4900 -900 4900 900 120 21
DS 4900 900 2800 900 120 21
DS -4900 900 -4900 -900 120 21
DS -4900 -900 2900 -900 120 21
DS 2900 900 -4900 900 120 21
$PAD
Sh "1" R 600 600 0 0 0
Dr 400 0 0
At STD N 00E0FFFF
Ne 0 ""
Po -4500 500
$EndPAD
$PAD
Sh "2" C 600 600 0 0 0
Dr 400 0 0
At STD N 00E0FFFF
Ne 0 ""
Po -4500 -500
$EndPAD
$PAD
Sh "3" C 600 600 0 0 0
Dr 400 0 0
At STD N 00E0FFFF
Ne 0 ""
Po -3500 500
$EndPAD
$PAD
Sh "4" C 600 600 0 0 0
Dr 400 0 0
At STD N 00E0FFFF
Ne 0 ""
Po -3500 -500
$EndPAD
$PAD
Sh "5" C 600 600 0 0 0
Dr 400 0 0
At STD N 00E0FFFF
Ne 0 ""
Po -2500 500
$EndPAD
$PAD
Sh "6" C 600 600 0 0 0
Dr 400 0 0
At STD N 00E0FFFF
Ne 0 ""
Po -2500 -500
$EndPAD
$PAD
Sh "7" C 600 600 0 0 0
Dr 400 0 0
At STD N 00E0FFFF
Ne 0 ""
Po -1500 500
$EndPAD
$PAD
Sh "8" C 600 600 0 0 0
Dr 400 0 0
At STD N 00E0FFFF
Ne 0 ""
Po -1500 -500
$EndPAD
$PAD
Sh "9" C 600 600 0 0 0
Dr 400 0 0
At STD N 00E0FFFF
Ne 0 ""
Po -500 500
$EndPAD
$PAD
Sh "10" C 600 600 0 0 0
Dr 400 0 0
At STD N 00E0FFFF
Ne 0 ""
Po -500 -500
$EndPAD
$PAD
Sh "11" C 600 600 0 0 0
Dr 400 0 0
At STD N 00E0FFFF
Ne 0 ""
Po 500 500
$EndPAD
$PAD
Sh "12" C 600 600 0 0 0
Dr 400 0 0
At STD N 00E0FFFF
Ne 0 ""
Po 500 -500
$EndPAD
$PAD
Sh "13" C 600 600 0 0 0
Dr 400 0 0
At STD N 00E0FFFF
Ne 0 ""
Po 1500 500
$EndPAD
$PAD
Sh "14" C 600 600 0 0 0
Dr 400 0 0
At STD N 00E0FFFF
Ne 0 ""
Po 1500 -500
$EndPAD
$PAD
Sh "15" C 600 600 0 0 0
Dr 400 0 0
At STD N 00E0FFFF
Ne 0 ""
Po 2500 500
$EndPAD
$PAD
Sh "16" C 600 600 0 0 0
Dr 400 0 0
At STD N 00E0FFFF
Ne 0 ""
Po 2500 -500
$EndPAD
$PAD
Sh "17" C 550 550 0 0 0
Dr 320 0 0
At STD N 00E0FFFF
Ne 0 ""
Po 3500 500
$EndPAD
$PAD
Sh "18" C 550 550 0 0 0
Dr 320 0 0
At STD N 00E0FFFF
Ne 0 ""
Po 3500 -500
$EndPAD
$PAD
Sh "19" C 550 550 0 0 0
Dr 320 0 0
At STD N 00E0FFFF
Ne 0 ""
Po 4400 500
$EndPAD
$PAD
Sh "20" C 550 550 0 0 0
Dr 320 0 0
At STD N 00E0FFFF
Ne 0 ""
Po 4400 -500
$EndPAD
$SHAPE3D
Na "pin_array/pins_array_8x2.wrl"
Sc 1.000000 1.000000 1.000000
Of 0.000000 0.000000 0.000000
Ro 0.000000 0.000000 0.000000
$EndSHAPE3D
$EndMODULE  PIN_ARRAY_10x2
$EndLIBRARY
