PCBNEW-LibModule-V1  Čt 7. červen 2012, 18:15:19 CEST
# encoding utf-8
Units deci-mils
$INDEX
AMPSeal23
$EndINDEX
$MODULE AMPSeal23
Po 0 0 0 15 4860014C 00000000 ~~
Li AMPSeal23
Cd AMPSeal 1-770669
Kw AMPSeal 1-770669
Sc 0
AR 
Op 0 0 0
T0 -1000 -4000 600 600 0 120 N V 21 N "AMPSeal23"
T1 0 4500 600 600 0 120 N V 21 N "Val**"
DS -9500 2500 -9500 3500 150 21
DS 9500 2500 9500 3500 150 21
DS -9500 3500 9500 3500 150 21
DS -9500 -3000 -9500 2500 150 21
DS 9500 2500 9500 -3000 150 21
DS 9500 -3000 -9500 -3000 150 21
$PAD
Sh "" C 1500 1500 0 0 0
Dr 1122 0 0
At STD N 00E0FFFF
Ne 0 ""
Po 8142 0
$EndPAD
$PAD
Sh "" C 1500 1500 0 0 0
Dr 1122 0 0
At STD N 00E0FFFF
Ne 0 ""
Po -8000 0
$EndPAD
$PAD
Sh "1" C 1181 1181 0 0 0
Dr 866 0 0
At STD N 00E0FFFF
Ne 0 ""
Po -5441 -1772
$EndPAD
$PAD
Sh "2" C 1181 1181 0 0 0
Dr 866 0 0
At STD N 00E0FFFF
Ne 0 ""
Po -3866 -1772
$EndPAD
$PAD
Sh "3" C 1181 1181 0 0 0
Dr 866 0 0
At STD N 00E0FFFF
Ne 0 ""
Po -2291 -1772
$EndPAD
$PAD
Sh "4" C 1181 1181 0 0 0
Dr 866 0 0
At STD N 00E0FFFF
Ne 0 ""
Po -717 -1772
$EndPAD
$PAD
Sh "5" C 1181 1181 0 0 0
Dr 866 0 0
At STD N 00E0FFFF
Ne 0 ""
Po 858 -1772
$EndPAD
$PAD
Sh "6" C 1181 1181 0 0 0
Dr 866 0 0
At STD N 00E0FFFF
Ne 0 ""
Po 2433 -1772
$EndPAD
$PAD
Sh "7" C 1181 1181 0 0 0
Dr 866 0 0
At STD N 00E0FFFF
Ne 0 ""
Po 4008 -1772
$EndPAD
$PAD
Sh "8" C 1181 1181 0 0 0
Dr 866 0 0
At STD N 00E0FFFF
Ne 0 ""
Po 5583 -1772
$EndPAD
$PAD
Sh "9" C 1181 1181 0 0 0
Dr 866 0 0
At STD N 00E0FFFF
Ne 0 ""
Po -4654 -197
$EndPAD
$PAD
Sh "10" C 1181 1181 0 0 0
Dr 866 0 0
At STD N 00E0FFFF
Ne 0 ""
Po -3079 -197
$EndPAD
$PAD
Sh "11" C 1181 1181 0 0 0
Dr 866 0 0
At STD N 00E0FFFF
Ne 0 ""
Po -1504 -197
$EndPAD
$PAD
Sh "12" C 1181 1181 0 0 0
Dr 866 0 0
At STD N 00E0FFFF
Ne 0 ""
Po 71 -197
$EndPAD
$PAD
Sh "13" C 1181 1181 0 0 0
Dr 866 0 0
At STD N 00E0FFFF
Ne 0 ""
Po 1646 -197
$EndPAD
$PAD
Sh "14" C 1181 1181 0 0 0
Dr 866 0 0
At STD N 00E0FFFF
Ne 0 ""
Po 3220 -197
$EndPAD
$PAD
Sh "15" C 1181 1181 0 0 0
Dr 866 0 0
At STD N 00E0FFFF
Ne 0 ""
Po 4795 -197
$EndPAD
$PAD
Sh "16" C 1181 1181 0 0 0
Dr 866 0 0
At STD N 00E0FFFF
Ne 0 ""
Po -5441 1378
$EndPAD
$PAD
Sh "17" C 1181 1181 0 0 0
Dr 866 0 0
At STD N 00E0FFFF
Ne 0 ""
Po -3866 1378
$EndPAD
$PAD
Sh "18" C 1181 1181 0 0 0
Dr 866 0 0
At STD N 00E0FFFF
Ne 0 ""
Po -2291 1378
$EndPAD
$PAD
Sh "19" C 1181 1181 0 0 0
Dr 866 0 0
At STD N 00E0FFFF
Ne 0 ""
Po -717 1378
$EndPAD
$PAD
Sh "20" C 1181 1181 0 0 0
Dr 866 0 0
At STD N 00E0FFFF
Ne 0 ""
Po 858 1378
$EndPAD
$PAD
Sh "21" C 1181 1181 0 0 0
Dr 866 0 0
At STD N 00E0FFFF
Ne 0 ""
Po 2433 1378
$EndPAD
$PAD
Sh "22" C 1181 1181 0 0 0
Dr 866 0 0
At STD N 00E0FFFF
Ne 0 ""
Po 4008 1378
$EndPAD
$PAD
Sh "23" C 1181 1181 0 0 0
Dr 866 0 0
At STD N 00E0FFFF
Ne 0 ""
Po 5583 1378
$EndPAD
$SHAPE3D
Na "connectors/ampseal23.wrl"
Sc 2 2 2
Of 0 0 0
Ro 0 0 0
$EndSHAPE3D
$EndMODULE AMPSeal23
$EndLIBRARY
