PCBNEW-LibModule-V1  Čt 21. červen 2012, 22:21:21 CEST
# encoding utf-8
Units deci-mils
$INDEX
CNT-RJ45
CONN_PCB_RJ45_TYCO
NU1S041C
RJ45-AMP
RJ45-TFN1-64P
RJ45-TFN1-88P
RJ45-TFN3-10BP
RJ45ETH
j00-00xx
$EndINDEX
$MODULE CNT-RJ45
Po 0 0 0 15 4FE38224 00000000 ~~
Li CNT-RJ45
Kw RJ45
Sc 0
AR 
Op 0 0 0
T0 0 -2100 393 393 0 78 N V 21 N "CNT-RJ45"
T1 0 4800 393 393 0 78 N I 21 N "Value"
DS -2880 -1570 -2910 5570 150 21
DS -2910 5570 3070 5570 150 21
DS 3040 5330 3040 5570 150 21
DS 3020 -1620 3040 5340 150 21
DS 3020 -1590 -2890 -1590 150 21
$PAD
Sh "" C 1280 1280 0 0 0
Dr 1280 0 0
At HOLE N 00E0FFFF
Ne 0 ""
Po -2150 2540
$EndPAD
$PAD
Sh "" C 1260 1260 0 0 0
Dr 1260 0 0
At HOLE N 00E0FFFF
Ne 0 ""
Po 2360 2540
$EndPAD
$PAD
Sh "7" C 708 708 0 0 0
Dr 350 0 0
At STD N 00E0FFFF
Ne 0 ""
Po 1260 0
$EndPAD
$PAD
Sh "5" C 708 708 0 0 0
Dr 350 0 0
At STD N 00E0FFFF
Ne 0 ""
Po 260 -10
$EndPAD
$PAD
Sh "3" C 708 708 0 0 0
Dr 350 0 0
At STD N 00E0FFFF
Ne 0 ""
Po -730 -10
$EndPAD
$PAD
Sh "1" C 708 708 0 0 0
Dr 350 0 0
At STD N 00E0FFFF
Ne 0 ""
Po -1704 7
$EndPAD
$PAD
Sh "8" C 708 708 0 0 0
Dr 350 0 0
At STD N 00E0FFFF
Ne 0 ""
Po 1760 -1000
$EndPAD
$PAD
Sh "6" C 708 708 0 0 0
Dr 350 0 0
At STD N 00E0FFFF
Ne 0 ""
Po 760 -1000
$EndPAD
$PAD
Sh "4" C 708 708 0 0 0
Dr 350 0 0
At STD N 00E0FFFF
Ne 0 ""
Po -230 -1000
$EndPAD
$PAD
Sh "2" C 708 708 0 0 0
Dr 350 0 0
At STD N 00E0FFFF
Ne 0 ""
Po -1240 -1000
$EndPAD
$SHAPE3D
Na "connectors/RJ/rj45_tfn1_88p.wrl"
Sc 1 1 1
Of 0 0 0
Ro 0 0 0
$EndSHAPE3D
$EndMODULE CNT-RJ45
$MODULE CONN_PCB_RJ45_TYCO
Po 0 0 0 15 4FE372DB 00000000 ~~
Li CONN_PCB_RJ45_TYCO
Sc 0
AR 
Op 0 0 0
T0 0 -3465 472 472 0 100 N V 21 N "CONN_PCB_RJ45_TYCO"
T1 0 -1750 472 472 0 100 N I 21 N "VAL**"
DS 3425 3425 -3425 3425 100 21
DS -3425 3425 -3425 709 100 21
DS 3425 3425 3425 709 100 21
DS -3425 -2756 3425 -2756 100 21
DS 3425 -2756 3425 -709 100 21
DS -3425 -2756 -3425 -709 100 21
DS 2520 2402 2717 2677 100 21
DS 2520 3150 2520 2402 100 21
DS 2520 2402 2323 2677 100 21
DS -2520 2441 -2283 2717 100 21
DS -2520 3150 -2520 2402 100 21
DS -2520 2402 -2756 2717 100 21
DS -3937 3425 3937 3425 100 25
DS 3937 3425 3937 -2992 100 25
DS 3937 -2992 -3937 -2992 100 25
DS -3937 -2992 -3937 3425 100 25
$PAD
Sh "1" C 630 630 0 0 0
Dr 472 0 0
At STD N 00C0FFFF
Ne 0 ""
Po 1406 350
$EndPAD
$PAD
Sh "2" C 630 630 0 0 0
Dr 472 0 0
At STD N 00C0FFFF
Ne 0 ""
Po 1004 -350
$EndPAD
$PAD
Sh "3" C 630 630 0 0 0
Dr 472 0 0
At STD N 00C0FFFF
Ne 0 ""
Po 602 350
$EndPAD
$PAD
Sh "4" C 630 630 0 0 0
Dr 472 0 0
At STD N 00C0FFFF
Ne 0 ""
Po 201 -350
$EndPAD
$PAD
Sh "5" C 630 630 0 0 0
Dr 472 0 0
At STD N 00C0FFFF
Ne 0 ""
Po -201 350
$EndPAD
$PAD
Sh "6" C 630 630 0 0 0
Dr 472 0 0
At STD N 00C0FFFF
Ne 0 ""
Po -602 -350
$EndPAD
$PAD
Sh "7" C 630 630 0 0 0
Dr 472 0 0
At STD N 00C0FFFF
Ne 0 ""
Po -1004 350
$EndPAD
$PAD
Sh "8" C 630 630 0 0 0
Dr 472 0 0
At STD N 00C0FFFF
Ne 0 ""
Po -1406 -350
$EndPAD
$PAD
Sh "9" C 1181 1181 0 0 0
Dr 787 0 0
At STD N 00C0FFFF
Ne 0 ""
Po -3205 0
$EndPAD
$PAD
Sh "10" C 1181 1181 0 0 0
Dr 787 0 0
At STD N 00C0FFFF
Ne 0 ""
Po 3205 0
$EndPAD
$PAD
Sh "" C 1417 1417 0 0 0
Dr 1417 0 0
At HOLE N 00E0FFFF
Ne 0 ""
Po -2504 1350
$EndPAD
$PAD
Sh "" C 1417 1417 0 0 0
Dr 1417 0 0
At HOLE N 00E0FFFF
Ne 0 ""
Po 2504 1350
$EndPAD
$SHAPE3D
Na "connectors/RJ/rj45_amp.wrl"
Sc 1 1 1
Of 0 -0.04 0
Ro 0 0 0
$EndSHAPE3D
$EndMODULE CONN_PCB_RJ45_TYCO
$MODULE NU1S041C
Po 0 0 0 15 4FAF699B 00000000 ~~
Li NU1S041C
Sc 0
AR 
Op 0 0 0
T0 0 -6791 600 600 0 120 N V 21 N "CN1"
T1 0 2657 394 394 0 79 N I 21 N "VAL**"
DS 3300 5200 3300 -6300 150 21
DS 3300 -6300 -3350 -6300 150 21
DS -3350 -6300 -3350 5200 150 21
DS -3350 5200 3300 5200 150 21
DS -3350 4200 3300 4200 150 21
$PAD
Sh "" C 1400 1400 0 0 0
Dr 1260 0 0
At STD N 00E0FFFF
Ne 0 ""
Po -2250 0
$EndPAD
$PAD
Sh "" C 1400 1400 0 0 0
Dr 1260 0 0
At STD N 00E0FFFF
Ne 0 ""
Po 2250 0
$EndPAD
$PAD
Sh "1" C 600 600 0 0 0
Dr 320 0 0
At STD N 00E0FFFF
Ne 0 ""
Po -1750 -2500
$EndPAD
$PAD
Sh "2" C 600 600 0 0 0
Dr 320 0 0
At STD N 00E0FFFF
Ne 0 ""
Po -1250 -3500
$EndPAD
$PAD
Sh "3" C 600 600 0 0 0
Dr 320 0 0
At STD N 00E0FFFF
Ne 0 ""
Po -750 -2500
$EndPAD
$PAD
Sh "4" C 600 600 0 0 0
Dr 320 0 0
At STD N 00E0FFFF
Ne 0 ""
Po -250 -3500
$EndPAD
$PAD
Sh "5" C 600 600 0 0 0
Dr 320 0 0
At STD N 00E0FFFF
Ne 0 ""
Po 250 -2500
$EndPAD
$PAD
Sh "6" C 600 600 0 0 0
Dr 320 0 0
At STD N 00E0FFFF
Ne 0 ""
Po 750 -3500
$EndPAD
$PAD
Sh "7" C 600 600 0 0 0
Dr 320 0 0
At STD N 00E0FFFF
Ne 0 ""
Po 1250 -2500
$EndPAD
$PAD
Sh "8" C 600 600 0 0 0
Dr 320 0 0
At STD N 00E0FFFF
Ne 0 ""
Po 1750 -3500
$EndPAD
$PAD
Sh "0" C 900 900 0 0 0
Dr 600 0 0
At STD N 00E0FFFF
Ne 0 ""
Po -3100 -1150
$EndPAD
$PAD
Sh "0" C 900 900 0 0 0
Dr 600 0 0
At STD N 00E0FFFF
Ne 0 ""
Po 3100 -1200
$EndPAD
$PAD
Sh "13" C 700 700 0 0 0
Dr 360 0 0
At STD N 00E0FFFF
Ne 0 ""
Po -1600 -4350
$EndPAD
$PAD
Sh "14" C 700 700 0 0 0
Dr 360 0 0
At STD N 00E0FFFF
Ne 0 ""
Po -2350 -5400
$EndPAD
$PAD
Sh "11" C 700 700 0 0 0
Dr 360 0 0
At STD N 00E0FFFF
Ne 0 ""
Po 600 -4400
$EndPAD
$PAD
Sh "12" C 700 700 0 0 0
Dr 360 0 0
At STD N 00E0FFFF
Ne 0 ""
Po -200 -5400
$EndPAD
$PAD
Sh "9" C 700 700 0 0 0
Dr 360 0 0
At STD N 00E0FFFF
Ne 0 ""
Po 2600 -4400
$EndPAD
$PAD
Sh "10" C 700 700 0 0 0
Dr 360 0 0
At STD N 00E0FFFF
Ne 0 ""
Po 1800 -5400
$EndPAD
$SHAPE3D
Na "connectors\\RJ\\NU1S041C.wrl"
Sc 5.08 5.08 5.08
Of 0 0 0
Ro 0 0 0
$EndSHAPE3D
$EndMODULE NU1S041C
$MODULE RJ45-AMP
Po 0 0 0 15 4FB0144D 00000000 ~~
Li RJ45-AMP
Kw RJ45
Sc 0
AR 
Op 0 0 0
T0 0 -3642 600 600 0 120 N V 21 N "RJ45-AMP"
T1 72 2426 600 600 0 120 N I 21 N "CN?"
DS 3160 3037 -3272 3037 150 21
DS -3272 3037 -3272 -3123 150 21
DS -3272 -3123 3144 -3107 150 21
DS 3144 -3107 3144 3005 150 21
DS 3144 3005 3144 3037 150 21
$PAD
Sh "" C 1280 1280 0 0 0
Dr 1280 0 0
At HOLE N 00E0FFFF
Ne 0 ""
Po -2489 1084
$EndPAD
$PAD
Sh "" C 1280 1280 0 0 0
Dr 1280 0 0
At HOLE N 00E0FFFF
Ne 0 ""
Po 2504 1053
$EndPAD
$PAD
Sh "D" C 787 787 0 0 0
Dr 630 0 0
At STD N 00E0FFFF
Ne 0 ""
Po 3176 -355
$EndPAD
$PAD
Sh "C" C 787 787 0 0 0
Dr 630 0 0
At STD N 00E0FFFF
Ne 0 ""
Po -3194 -383
$EndPAD
$PAD
Sh "1" C 450 450 0 0 0
Dr 350 0 0
At STD N 00E0FFFF
Ne 0 ""
Po 1400 13
$EndPAD
$PAD
Sh "2" C 450 450 0 0 0
Dr 350 0 0
At STD N 00E0FFFF
Ne 0 ""
Po 616 13
$EndPAD
$PAD
Sh "3" C 450 450 0 0 0
Dr 350 0 0
At STD N 00E0FFFF
Ne 0 ""
Po -200 -3
$EndPAD
$PAD
Sh "4" C 450 450 0 0 0
Dr 350 0 0
At STD N 00E0FFFF
Ne 0 ""
Po -984 -3
$EndPAD
$PAD
Sh "5" C 450 450 0 0 0
Dr 350 0 0
At STD N 00E0FFFF
Ne 0 ""
Po 1003 -823
$EndPAD
$PAD
Sh "6" C 450 450 0 0 0
Dr 350 0 0
At STD N 00E0FFFF
Ne 0 ""
Po 186 -823
$EndPAD
$PAD
Sh "7" C 450 450 0 0 0
Dr 350 0 0
At STD N 00E0FFFF
Ne 0 ""
Po -593 -823
$EndPAD
$PAD
Sh "8" C 450 450 0 0 0
Dr 350 0 0
At STD N 00E0FFFF
Ne 0 ""
Po -1410 -823
$EndPAD
$SHAPE3D
Na "connectors\\RJ\\rj45_amp.wrl"
Sc 1 1 1
Of 0 0 0
Ro 0 0 0
$EndSHAPE3D
$EndMODULE RJ45-AMP
$MODULE RJ45-TFN1-64P
Po 0 0 0 15 4FB013FD 00000000 ~~
Li RJ45-TFN1-64P
Kw RJ45
Sc 0
AR 
Op 0 0 0
T0 -42 -2115 600 600 0 120 N V 21 N "RJ45-TFN1-64P"
T1 140 4790 600 600 0 120 N I 21 N "CN?"
DS 420 -2020 380 -2020 150 21
DS -2880 -1570 -2910 5570 150 21
DS -2910 5570 3070 5570 150 21
DS 3040 5330 3040 5570 150 21
DS 3020 -1620 3040 5340 150 21
DS 3020 -1590 -2890 -1590 150 21
$PAD
Sh "" C 1280 1280 0 0 0
Dr 1280 0 0
At HOLE N 00E0FFFF
Ne 0 ""
Po -2150 2540
$EndPAD
$PAD
Sh "" C 1260 1260 0 0 0
Dr 1260 0 0
At HOLE N 00E0FFFF
Ne 0 ""
Po 2360 2540
$EndPAD
$PAD
Sh "1" C 450 450 0 0 0
Dr 350 0 0
At STD N 00E0FFFF
Ne 0 ""
Po 260 -10
$EndPAD
$PAD
Sh "2" C 450 450 0 0 0
Dr 350 0 0
At STD N 00E0FFFF
Ne 0 ""
Po -730 -10
$EndPAD
$PAD
Sh "3" C 450 450 0 0 0
Dr 350 0 0
At STD N 00E0FFFF
Ne 0 ""
Po 760 -1000
$EndPAD
$PAD
Sh "4" C 450 450 0 0 0
Dr 350 0 0
At STD N 00E0FFFF
Ne 0 ""
Po -230 -1000
$EndPAD
$SHAPE3D
Na "connectors\\RJ\\rj45_tfn1_64p.wrl"
Sc 1 1 1
Of 0 0 0
Ro 0 0 0
$EndSHAPE3D
$EndMODULE RJ45-TFN1-64P
$MODULE RJ45-TFN1-88P
Po 0 0 0 15 4FB01398 00000000 ~~
Li RJ45-TFN1-88P
Kw RJ45
Sc 0
AR 
Op 0 0 0
T0 -42 -2115 600 600 0 120 N V 21 N "RJ45-TFN1-88P"
T1 140 4790 600 600 0 120 N I 21 N "CN?"
DS -2880 -1570 -2910 5570 150 21
DS -2910 5570 3070 5570 150 21
DS 3040 5330 3040 5570 150 21
DS 3020 -1620 3040 5340 150 21
DS 3020 -1590 -2890 -1590 150 21
$PAD
Sh "" C 1280 1280 0 0 0
Dr 1280 0 0
At HOLE N 00E0FFFF
Ne 0 ""
Po -2150 2540
$EndPAD
$PAD
Sh "" C 1260 1260 0 0 0
Dr 1260 0 0
At HOLE N 00E0FFFF
Ne 0 ""
Po 2360 2540
$EndPAD
$PAD
Sh "1" C 450 450 0 0 0
Dr 350 0 0
At STD N 00E0FFFF
Ne 0 ""
Po 1260 0
$EndPAD
$PAD
Sh "2" C 450 450 0 0 0
Dr 350 0 0
At STD N 00E0FFFF
Ne 0 ""
Po 260 -10
$EndPAD
$PAD
Sh "3" C 450 450 0 0 0
Dr 350 0 0
At STD N 00E0FFFF
Ne 0 ""
Po -730 -10
$EndPAD
$PAD
Sh "4" C 450 450 0 0 0
Dr 350 0 0
At STD N 00E0FFFF
Ne 0 ""
Po -1704 7
$EndPAD
$PAD
Sh "5" C 450 450 0 0 0
Dr 350 0 0
At STD N 00E0FFFF
Ne 0 ""
Po 1760 -1000
$EndPAD
$PAD
Sh "6" C 450 450 0 0 0
Dr 350 0 0
At STD N 00E0FFFF
Ne 0 ""
Po 760 -1000
$EndPAD
$PAD
Sh "7" C 450 450 0 0 0
Dr 350 0 0
At STD N 00E0FFFF
Ne 0 ""
Po -230 -1000
$EndPAD
$PAD
Sh "8" C 450 450 0 0 0
Dr 350 0 0
At STD N 00E0FFFF
Ne 0 ""
Po -1240 -1000
$EndPAD
$SHAPE3D
Na "connectors\\RJ\\rj45_tfn1_88p.wrl"
Sc 1 1 1
Of 0 0 0
Ro 0 0 0
$EndSHAPE3D
$EndMODULE RJ45-TFN1-88P
$MODULE RJ45-TFN3-10BP
Po 0 0 0 15 4FB013ED 00000000 ~~
Li RJ45-TFN3-10BP
Kw RJ45
Sc 0
AR 
Op 0 0 0
T0 -42 -2115 600 600 0 120 N V 21 N "RJ45-TFN3-10BP"
T1 140 4790 600 600 0 120 N I 21 N "CN?"
DS -2860 -1620 -2890 5340 150 21
DS -2890 5340 3060 5340 150 21
DS 3020 -1620 3040 5340 150 21
DS 3020 -1590 -2890 -1590 150 21
$PAD
Sh "" C 1280 1280 0 0 0
Dr 1280 0 0
At HOLE N 00E0FFFF
Ne 0 ""
Po -2150 2540
$EndPAD
$PAD
Sh "" C 1260 1260 0 0 0
Dr 1260 0 0
At HOLE N 00E0FFFF
Ne 0 ""
Po 2360 2540
$EndPAD
$PAD
Sh "1" C 450 450 0 0 0
Dr 350 0 0
At STD N 00E0FFFF
Ne 0 ""
Po 1365 0
$EndPAD
$PAD
Sh "2" C 450 450 0 0 0
Dr 350 0 0
At STD N 00E0FFFF
Ne 0 ""
Po 365 -10
$EndPAD
$PAD
Sh "3" C 450 450 0 0 0
Dr 350 0 0
At STD N 00E0FFFF
Ne 0 ""
Po -625 -10
$EndPAD
$PAD
Sh "4" C 450 450 0 0 0
Dr 350 0 0
At STD N 00E0FFFF
Ne 0 ""
Po -1599 7
$EndPAD
$PAD
Sh "5" C 450 450 0 0 0
Dr 350 0 0
At STD N 00E0FFFF
Ne 0 ""
Po 1865 -1000
$EndPAD
$PAD
Sh "6" C 450 450 0 0 0
Dr 350 0 0
At STD N 00E0FFFF
Ne 0 ""
Po 865 -1000
$EndPAD
$PAD
Sh "7" C 450 450 0 0 0
Dr 350 0 0
At STD N 00E0FFFF
Ne 0 ""
Po -125 -1000
$EndPAD
$PAD
Sh "8" C 450 450 0 0 0
Dr 350 0 0
At STD N 00E0FFFF
Ne 0 ""
Po -1135 -1000
$EndPAD
$SHAPE3D
Na "connectors\\RJ\\rj45_tfn3_108p.wrl"
Sc 1 1 1
Of 0 0 0
Ro 0 0 0
$EndSHAPE3D
$EndMODULE RJ45-TFN3-10BP
$MODULE RJ45ETH
Po 0 0 0 15 4FB013D5 00000000 ~~
Li RJ45ETH
Sc 0
AR 
Op 0 0 0
T0 0 -4724 600 600 0 120 N V 21 N "CN1"
T1 0 3740 394 394 0 79 N I 21 N "VAL**"
DS 3300 3000 -3300 3000 100 21
DS 3300 -1700 3300 -4200 100 21
DS 3300 -4200 -3300 -4200 100 21
DS -3300 -4200 -3300 -1600 100 21
DS -3300 4200 -3300 -700 100 21
DS -3300 4200 3300 4200 100 21
DS 3300 4200 3300 -700 100 21
$PAD
Sh "" C 1400 1400 0 0 0
Dr 1260 0 0
At STD N 00E0FFFF
Ne 0 ""
Po -2250 0
$EndPAD
$PAD
Sh "" C 1400 1400 0 0 0
Dr 1260 0 0
At STD N 00E0FFFF
Ne 0 ""
Po 2250 0
$EndPAD
$PAD
Sh "1" C 600 600 0 0 0
Dr 320 0 0
At STD N 00E0FFFF
Ne 0 ""
Po -1750 -2500
$EndPAD
$PAD
Sh "2" C 600 600 0 0 0
Dr 320 0 0
At STD N 00E0FFFF
Ne 0 ""
Po -1250 -3500
$EndPAD
$PAD
Sh "3" C 600 600 0 0 0
Dr 320 0 0
At STD N 00E0FFFF
Ne 0 ""
Po -750 -2500
$EndPAD
$PAD
Sh "4" C 600 600 0 0 0
Dr 320 0 0
At STD N 00E0FFFF
Ne 0 ""
Po -250 -3500
$EndPAD
$PAD
Sh "5" C 600 600 0 0 0
Dr 320 0 0
At STD N 00E0FFFF
Ne 0 ""
Po 250 -2500
$EndPAD
$PAD
Sh "6" C 600 600 0 0 0
Dr 320 0 0
At STD N 00E0FFFF
Ne 0 ""
Po 750 -3500
$EndPAD
$PAD
Sh "7" C 600 600 0 0 0
Dr 320 0 0
At STD N 00E0FFFF
Ne 0 ""
Po 1250 -2500
$EndPAD
$PAD
Sh "8" C 600 600 0 0 0
Dr 320 0 0
At STD N 00E0FFFF
Ne 0 ""
Po 1750 -3500
$EndPAD
$PAD
Sh "0" C 900 900 0 0 0
Dr 600 0 0
At STD N 00E0FFFF
Ne 0 ""
Po -3100 -1150
$EndPAD
$PAD
Sh "0" C 900 900 0 0 0
Dr 600 0 0
At STD N 00E0FFFF
Ne 0 ""
Po 3100 -1200
$EndPAD
$PAD
Sh "9" C 700 700 0 0 0
Dr 360 0 0
At STD N 00E0FFFF
Ne 0 ""
Po -2550 1600
$EndPAD
$PAD
Sh "10" C 700 700 0 0 0
Dr 360 0 0
At STD N 00E0FFFF
Ne 0 ""
Po -1550 1600
$EndPAD
$PAD
Sh "11" C 700 700 0 0 0
Dr 360 0 0
At STD N 00E0FFFF
Ne 0 ""
Po 1550 1600
$EndPAD
$PAD
Sh "12" C 700 700 0 0 0
Dr 360 0 0
At STD N 00E0FFFF
Ne 0 ""
Po 2550 1600
$EndPAD
$SHAPE3D
Na "connectors\\RJ\\rj45_ETH.wrl"
Sc 5 5 5
Of 0 0 0
Ro 0 0 0
$EndSHAPE3D
$EndMODULE RJ45ETH
$MODULE j00-00xx
Po 0 0 0 15 4FAF6959 00000000 ~~
Li j00-00xx
Sc 0
AR 
Op 0 0 0
T0 0 -4626 600 600 0 120 N V 21 N "CN1"
T1 0 3642 394 394 0 79 N I 21 N "VAL**"
DS 3300 3000 -3300 3000 100 21
DS 3300 -1700 3300 -4200 100 21
DS 3300 -4200 -3300 -4200 100 21
DS -3300 -4200 -3300 -1600 100 21
DS -3300 4200 -3300 -700 100 21
DS -3300 4200 3300 4200 100 21
DS 3300 4200 3300 -700 100 21
$PAD
Sh "" C 1400 1400 0 0 0
Dr 1260 0 0
At STD N 00E0FFFF
Ne 0 ""
Po -2250 0
$EndPAD
$PAD
Sh "" C 1400 1400 0 0 0
Dr 1260 0 0
At STD N 00E0FFFF
Ne 0 ""
Po 2250 0
$EndPAD
$PAD
Sh "1" C 600 600 0 0 0
Dr 320 0 0
At STD N 00E0FFFF
Ne 0 ""
Po -1750 -2500
$EndPAD
$PAD
Sh "2" C 600 600 0 0 0
Dr 320 0 0
At STD N 00E0FFFF
Ne 0 ""
Po -1250 -3500
$EndPAD
$PAD
Sh "3" C 600 600 0 0 0
Dr 320 0 0
At STD N 00E0FFFF
Ne 0 ""
Po -750 -2500
$EndPAD
$PAD
Sh "4" C 600 600 0 0 0
Dr 320 0 0
At STD N 00E0FFFF
Ne 0 ""
Po -250 -3500
$EndPAD
$PAD
Sh "5" C 600 600 0 0 0
Dr 320 0 0
At STD N 00E0FFFF
Ne 0 ""
Po 250 -2500
$EndPAD
$PAD
Sh "6" C 600 600 0 0 0
Dr 320 0 0
At STD N 00E0FFFF
Ne 0 ""
Po 750 -3500
$EndPAD
$PAD
Sh "7" C 600 600 0 0 0
Dr 320 0 0
At STD N 00E0FFFF
Ne 0 ""
Po 1250 -2500
$EndPAD
$PAD
Sh "8" C 600 600 0 0 0
Dr 320 0 0
At STD N 00E0FFFF
Ne 0 ""
Po 1750 -3500
$EndPAD
$PAD
Sh "0" C 900 900 0 0 0
Dr 600 0 0
At STD N 00E0FFFF
Ne 0 ""
Po -3100 -1150
$EndPAD
$PAD
Sh "0" C 900 900 0 0 0
Dr 600 0 0
At STD N 00E0FFFF
Ne 0 ""
Po 3100 -1200
$EndPAD
$PAD
Sh "9" C 700 700 0 0 0
Dr 360 0 0
At STD N 00E0FFFF
Ne 0 ""
Po -2550 1850
$EndPAD
$PAD
Sh "10" C 700 700 0 0 0
Dr 360 0 0
At STD N 00E0FFFF
Ne 0 ""
Po -1550 1350
$EndPAD
$PAD
Sh "11" C 700 700 0 0 0
Dr 360 0 0
At STD N 00E0FFFF
Ne 0 ""
Po 1550 1850
$EndPAD
$PAD
Sh "12" C 700 700 0 0 0
Dr 360 0 0
At STD N 00E0FFFF
Ne 0 ""
Po 2550 1350
$EndPAD
$SHAPE3D
Na "connectors\\RJ\\rj45_j00-00xx.wrl"
Sc 5.08 5.08 5.08
Of 0 0 0
Ro 0 0 0
$EndSHAPE3D
$EndMODULE j00-00xx
$EndLIBRARY
