PCBNEW-LibModule-V1  3.11.2011 12:01:54
# encoding utf-8
$INDEX
c_1206
r_0402
r_0603
r_0805
r_1206
r_1210
r_2010
r_2512
r_cat16-2
r_cat16-4
r_cat16-8
$EndINDEX
$MODULE r_cat16-8
Po 0 0 0 15 4A9CE189 00000000 ~~
Li r_cat16-8
Cd SMT resistor net, Bourns CAT16 series, 8 way
Sc 00000000
AR
Op 0 0 0
T0 0 -1417 79 79 0 16 N V 21 N"r_cat16-8"
T1 0 1417 79 79 0 16 N I 21 N"RN***"
DS -197 -945 197 -945 50 21
DS -197 -630 197 -630 50 21
DS -197 -315 197 -315 50 21
DS -197 0 197 0 50 21
DS -197 315 197 315 50 21
DS -197 630 197 630 50 21
DS -197 945 197 945 50 21
DS -354 -1181 -197 -1181 50 21
DS 197 -1181 354 -1181 50 21
DS -354 -1024 -197 -1024 50 21
DS 197 -1024 354 -1024 50 21
DS -354 -866 -197 -866 50 21
DS 197 -866 354 -866 50 21
DS -354 -709 -197 -709 50 21
DS 197 -709 354 -709 50 21
DS -354 -551 -197 -551 50 21
DS 197 -551 354 -551 50 21
DS -354 -394 -197 -394 50 21
DS 197 -394 354 -394 50 21
DS 354 -236 197 -236 50 21
DS -197 -236 -354 -236 50 21
DS -354 -79 -197 -79 50 21
DS 197 -79 354 -79 50 21
DS 354 79 197 79 50 21
DS -197 79 -354 79 50 21
DS -354 236 -197 236 50 21
DS 197 236 354 236 50 21
DS 197 551 354 551 50 21
DS 197 394 354 394 50 21
DS -354 394 -197 394 50 21
DS -354 551 -197 551 50 21
DS -354 866 -197 866 50 21
DS -197 709 -354 709 50 21
DS 354 709 197 709 50 21
DS 354 866 197 866 50 21
DS 197 1181 354 1181 50 21
DS 354 1024 197 1024 50 21
DS -197 1024 -354 1024 50 21
DS -354 1181 -197 1181 50 21
DS -197 -1299 -197 1299 50 21
DS 197 1299 197 -1299 50 21
DS -354 1299 -354 -1299 50 21
DS -354 -1299 354 -1299 50 21
DS 354 -1299 354 1299 50 21
DS 354 1299 -354 1299 50 21
$PAD
Sh "4" R 300 170 0 0 0
Dr 0 0 0
At SMD N 00888000
Ne 0 ""
Po 300 157
$EndPAD
$PAD
Sh "13" R 300 170 0 0 0
Dr 0 0 0
At SMD N 00888000
Ne 0 ""
Po -300 157
$EndPAD
$PAD
Sh "5" R 300 170 0 0 0
Dr 0 0 0
At SMD N 00888000
Ne 0 ""
Po 300 -157
$EndPAD
$PAD
Sh "12" R 300 170 0 0 0
Dr 0 0 0
At SMD N 00888000
Ne 0 ""
Po -300 -157
$EndPAD
$PAD
Sh "3" R 300 170 0 0 0
Dr 0 0 0
At SMD N 00888000
Ne 0 ""
Po 300 472
$EndPAD
$PAD
Sh "6" R 300 170 0 0 0
Dr 0 0 0
At SMD N 00888000
Ne 0 ""
Po 300 -472
$EndPAD
$PAD
Sh "11" R 300 170 0 0 0
Dr 0 0 0
At SMD N 00888000
Ne 0 ""
Po -300 -472
$EndPAD
$PAD
Sh "14" R 300 170 0 0 0
Dr 0 0 0
At SMD N 00888000
Ne 0 ""
Po -300 472
$EndPAD
$PAD
Sh "7" R 300 170 0 0 0
Dr 0 0 0
At SMD N 00888000
Ne 0 ""
Po 300 -787
$EndPAD
$PAD
Sh "8" R 300 170 0 0 0
Dr 0 0 0
At SMD N 00888000
Ne 0 ""
Po 300 -1102
$EndPAD
$PAD
Sh "1" R 300 170 0 0 0
Dr 0 0 0
At SMD N 00888000
Ne 0 ""
Po 300 1102
$EndPAD
$PAD
Sh "2" R 300 170 0 0 0
Dr 0 0 0
At SMD N 00888000
Ne 0 ""
Po 300 787
$EndPAD
$PAD
Sh "15" R 300 170 0 0 0
Dr 0 0 0
At SMD N 00888000
Ne 0 ""
Po -300 787
$EndPAD
$PAD
Sh "16" R 300 170 0 0 0
Dr 0 0 0
At SMD N 00888000
Ne 0 ""
Po -300 1102
$EndPAD
$PAD
Sh "9" R 300 170 0 0 0
Dr 0 0 0
At SMD N 00888000
Ne 0 ""
Po -300 -1102
$EndPAD
$PAD
Sh "10" R 300 170 0 0 0
Dr 0 0 0
At SMD N 00888000
Ne 0 ""
Po -300 -787
$EndPAD
$SHAPE3D
Na "walter\smd_resistors\r_cat16-8.wrl"
Sc 1.000000 1.000000 1.000000
Of 0.000000 0.000000 0.000000
Ro 0.000000 0.000000 0.000000
$EndSHAPE3D
$EndMODULE  r_cat16-8
$MODULE r_cat16-4
Po 0 0 0 15 4A9CE279 00000000 ~~
Li r_cat16-4
Cd SMT resistor net, Bourns CAT16 series, 4 way
Sc 00000000
AR
Op 0 0 0
T0 0 -827 79 79 0 16 N V 21 N"r_cat16-4"
T1 0 787 79 79 0 16 N I 21 N"RN***"
DS 197 -669 197 669 50 21
DS -197 669 -197 -669 50 21
DS -354 -669 -354 669 50 21
DS 354 669 354 -669 50 21
DS -354 -669 354 -669 50 21
DS -354 669 354 669 50 21
DS -197 -315 197 -315 50 21
DS -197 0 197 0 50 21
DS -197 315 197 315 50 21
DS -354 -551 -197 -551 50 21
DS 197 -551 354 -551 50 21
DS -354 -394 -197 -394 50 21
DS 197 -394 354 -394 50 21
DS 354 -236 197 -236 50 21
DS -197 -236 -354 -236 50 21
DS -354 -79 -197 -79 50 21
DS 197 -79 354 -79 50 21
DS 354 79 197 79 50 21
DS -197 79 -354 79 50 21
DS -354 236 -197 236 50 21
DS 197 236 354 236 50 21
DS 197 551 354 551 50 21
DS 197 394 354 394 50 21
DS -354 394 -197 394 50 21
DS -354 551 -197 551 50 21
$PAD
Sh "2" R 300 170 0 0 0
Dr 0 0 0
At SMD N 00888000
Ne 0 ""
Po 300 157
$EndPAD
$PAD
Sh "7" R 300 170 0 0 0
Dr 0 0 0
At SMD N 00888000
Ne 0 ""
Po -300 157
$EndPAD
$PAD
Sh "3" R 300 170 0 0 0
Dr 0 0 0
At SMD N 00888000
Ne 0 ""
Po 300 -157
$EndPAD
$PAD
Sh "6" R 300 170 0 0 0
Dr 0 0 0
At SMD N 00888000
Ne 0 ""
Po -300 -157
$EndPAD
$PAD
Sh "1" R 300 170 0 0 0
Dr 0 0 0
At SMD N 00888000
Ne 0 ""
Po 300 472
$EndPAD
$PAD
Sh "4" R 300 170 0 0 0
Dr 0 0 0
At SMD N 00888000
Ne 0 ""
Po 300 -472
$EndPAD
$PAD
Sh "5" R 300 170 0 0 0
Dr 0 0 0
At SMD N 00888000
Ne 0 ""
Po -300 -472
$EndPAD
$PAD
Sh "8" R 300 170 0 0 0
Dr 0 0 0
At SMD N 00888000
Ne 0 ""
Po -300 472
$EndPAD
$SHAPE3D
Na "walter\smd_resistors\r_cat16-4.wrl"
Sc 1.000000 1.000000 1.000000
Of 0.000000 0.000000 0.000000
Ro 0.000000 0.000000 0.000000
$EndSHAPE3D
$EndMODULE  r_cat16-4
$MODULE r_cat16-2
Po 0 0 0 15 4A9CE2CD 00000000 ~~
Li r_cat16-2
Cd SMT resistor net, Bourns CAT16 series, 2 way
Sc 00000000
AR
Op 0 0 0
T0 0 -512 79 79 0 16 N V 21 N"r_cat16-2"
T1 0 472 79 79 0 16 N I 21 N"RN***"
DS -197 354 -197 -354 50 21
DS 197 -354 197 354 50 21
DS 354 -354 -354 -354 50 21
DS -354 -354 -354 354 50 21
DS -354 354 354 354 50 21
DS 354 354 354 -354 50 21
DS -197 0 197 0 50 21
DS 354 -236 197 -236 50 21
DS -197 -236 -354 -236 50 21
DS -354 -79 -197 -79 50 21
DS 197 -79 354 -79 50 21
DS 354 79 197 79 50 21
DS -197 79 -354 79 50 21
DS -354 236 -197 236 50 21
DS 197 236 354 236 50 21
$PAD
Sh "1" R 300 170 0 0 0
Dr 0 0 0
At SMD N 00888000
Ne 0 ""
Po 300 157
$EndPAD
$PAD
Sh "4" R 300 170 0 0 0
Dr 0 0 0
At SMD N 00888000
Ne 0 ""
Po -300 157
$EndPAD
$PAD
Sh "2" R 300 170 0 0 0
Dr 0 0 0
At SMD N 00888000
Ne 0 ""
Po 300 -157
$EndPAD
$PAD
Sh "3" R 300 170 0 0 0
Dr 0 0 0
At SMD N 00888000
Ne 0 ""
Po -300 -157
$EndPAD
$SHAPE3D
Na "walter\smd_resistors\r_cat16-2.wrl"
Sc 1.000000 1.000000 1.000000
Of 0.000000 0.000000 0.000000
Ro 0.000000 0.000000 0.000000
$EndSHAPE3D
$EndMODULE  r_cat16-2
$MODULE r_0805
Po 0 0 0 15 4E8C545A 00000000 ~~
Li r_0805
Cd SMT resistor, 0805
Sc 00000000
AR
Op 0 0 0
T0 0 -550 118 118 0 24 N V 21 N "r_0805"
T1 0 550 118 118 0 24 N I 21 N "R***"
DS -750 400 750 400 79 21
DS 750 400 750 -400 79 21
DS 750 -400 -750 -400 79 21
DS -750 -400 -750 400 79 21
$PAD
Sh "1" R 512 590 0 0 0
Dr 0 0 0
At SMD N 00888000
Ne 0 ""
Po 375 0
$EndPAD
$PAD
Sh "2" R 512 590 0 0 0
Dr 0 0 0
At SMD N 00888000
Ne 0 ""
Po -375 0
$EndPAD
$SHAPE3D
Na "walter\\smd_resistors\\r_0805.wrl"
Sc 1.000000 1.000000 1.000000
Of 0.000000 0.000000 0.000000
Ro 0.000000 0.000000 0.000000
$EndSHAPE3D
$EndMODULE  r_0805
$MODULE r_1206
Po 0 0 0 15 4E8C54AE 00000000 ~~
Li r_1206
Cd SMT resistor, 1206
Sc 00000000
AR
Op 0 0 0
T0 0 -650 197 197 0 47 N V 21 N "r_1206"
T1 0 700 197 197 0 47 N I 21 N "R***"
DS -950 450 950 450 79 21
DS 950 450 950 -450 79 21
DS 950 -450 -950 -450 79 21
DS -950 -450 -950 450 79 21
$PAD
Sh "1" R 630 710 0 0 0
Dr 0 0 0
At SMD N 00888000
Ne 0 ""
Po 550 0
$EndPAD
$PAD
Sh "2" R 630 710 0 0 0
Dr 0 0 0
At SMD N 00888000
Ne 0 ""
Po -550 0
$EndPAD
$SHAPE3D
Na "walter\\smd_resistors\\r_1206.wrl"
Sc 1.000000 1.000000 1.000000
Of 0.000000 0.000000 0.000000
Ro 0.000000 0.000000 0.000000
$EndSHAPE3D
$EndMODULE  r_1206
$MODULE r_0603
Po 0 0 0 15 4E8C54EF 00000000 ~~
Li r_0603
Cd SMT resistor, 0603
Sc 00000000
AR
Op 0 0 0
T0 0 -400 79 79 0 16 N V 21 N "r_0603"
T1 0 400 79 79 0 16 N I 21 N "R***"
DS -600 300 600 300 59 21
DS 600 300 600 -300 59 21
DS 600 -300 -600 -300 59 21
DS -600 -300 -600 300 59 21
$PAD
Sh "1" R 354 394 0 0 0
Dr 0 0 0
At SMD N 00888000
Ne 0 ""
Po 296 0
$EndPAD
$PAD
Sh "2" R 354 394 0 0 0
Dr 0 0 0
At SMD N 00888000
Ne 0 ""
Po -296 0
$EndPAD
$SHAPE3D
Na "walter\\smd_resistors\\r_0603.wrl"
Sc 1.000000 1.000000 1.000000
Of 0.000000 0.000000 0.000000
Ro 0.000000 0.000000 0.000000
$EndSHAPE3D
$EndMODULE  r_0603
$MODULE r_0402
Po 0 0 0 15 4E8C5545 00000000 ~~
Li r_0402
Cd SMT resistor, 0402
Sc 00000000
AR
Op 0 0 0
T0 0 -300 60 60 0 12 N V 21 N "r_0402"
T1 0 325 60 60 0 12 N I 21 N "R***"
DS -450 225 450 225 59 21
DS 450 225 450 -225 59 21
DS 450 -225 -450 -225 59 21
DS -450 -225 -450 225 59 21
$PAD
Sh "1" R 315 275 0 0 0
Dr 0 0 0
At SMD N 00888000
Ne 0 ""
Po 216 0
$EndPAD
$PAD
Sh "2" R 315 275 0 0 0
Dr 0 0 0
At SMD N 00888000
Ne 0 ""
Po -216 0
$EndPAD
$SHAPE3D
Na "walter\\smd_resistors\\r_0402.wrl"
Sc 1.000000 1.000000 1.000000
Of 0.000000 0.000000 0.000000
Ro 0.000000 0.000000 0.000000
$EndSHAPE3D
$EndMODULE  r_0402
$MODULE r_1210
Po 0 0 0 15 4E8C5597 00000000 ~~
Li r_1210
Cd SMT resistor, 1210
Sc 00000000
AR
Op 0 0 0
T0 0 -850 197 197 0 47 N V 21 N "r_1210"
T1 0 850 197 197 0 47 N I 21 N "R***"
DS -1000 650 1000 650 79 21
DS 1000 650 1000 -650 79 21
DS 1000 -650 -1000 -650 79 21
DS -1000 -650 -1000 650 79 21
$PAD
Sh "1" R 630 1060 0 0 0
Dr 0 0 0
At SMD N 00888000
Ne 0 ""
Po 550 0
$EndPAD
$PAD
Sh "2" R 630 1060 0 0 0
Dr 0 0 0
At SMD N 00888000
Ne 0 ""
Po -550 0
$EndPAD
$SHAPE3D
Na "walter\\smd_resistors\\r_1210.wrl"
Sc 1.000000 1.000000 1.000000
Of 0.000000 0.000000 0.000000
Ro 0.000000 0.000000 0.000000
$EndSHAPE3D
$EndMODULE  r_1210
$MODULE r_2010
Po 0 0 0 15 4E8C55C4 00000000 ~~
Li r_2010
Cd SMT resistor, 2010
Sc 00000000
AR
Op 0 0 0
T0 0 -850 197 197 0 47 N V 21 N "r_2010"
T1 0 850 197 197 0 47 N I 21 N "R***"
DS -1450 650 1450 650 79 21
DS 1450 650 1450 -650 79 21
DS 1450 -650 -1450 -650 79 21
DS -1450 -650 -1450 650 79 21
$PAD
Sh "1" R 630 1060 0 0 0
Dr 0 0 0
At SMD N 00888000
Ne 0 ""
Po 1015 0
$EndPAD
$PAD
Sh "2" R 630 1060 0 0 0
Dr 0 0 0
At SMD N 00888000
Ne 0 ""
Po -1015 0
$EndPAD
$SHAPE3D
Na "walter\\smd_resistors\\r_2010.wrl"
Sc 1.000000 1.000000 1.000000
Of 0.000000 0.000000 0.000000
Ro 0.000000 0.000000 0.000000
$EndSHAPE3D
$EndMODULE  r_2010
$MODULE r_2512
Po 0 0 0 15 4E8C5616 00000000 ~~
Li r_2512
Cd SMT resistor, 2512
Sc 00000000
AR
Op 0 0 0
T0 0 -950 197 197 0 47 N V 21 N "r_2512"
T1 0 50 197 197 0 47 N I 21 N "R***"
DS -1700 750 1700 750 79 21
DS 1700 750 1700 -750 79 21
DS 1700 -750 -1700 -750 79 21
DS -1700 -750 -1700 750 79 21
$PAD
Sh "1" R 630 1250 0 0 0
Dr 0 0 0
At SMD N 00888000
Ne 0 ""
Po 1255 0
$EndPAD
$PAD
Sh "2" R 630 1250 0 0 0
Dr 0 0 0
At SMD N 00888000
Ne 0 ""
Po -1255 0
$EndPAD
$SHAPE3D
Na "walter\\smd_resistors\\r_2512.wrl"
Sc 1.000000 1.000000 1.000000
Of 0.000000 0.000000 0.000000
Ro 0.000000 0.000000 0.000000
$EndSHAPE3D
$EndMODULE  r_2512
$MODULE c_1206
Po 0 0 0 15 4EB2749B 00000000 ~~
Li c_1206
Cd SMT capacitor, 1206
Sc 00000000
AR 
Op 0 0 0
T0 39 -748 315 315 0 59 N V 21 N "c_1206"
T1 0 787 315 315 0 59 N I 21 N "C***"
DS -984 -472 984 -472 79 21
DS 984 -472 984 472 79 21
DS 984 472 -984 472 79 21
DS -984 472 -984 -472 79 21
$PAD
Sh "1" R 630 710 0 0 0
Dr 0 0 0
At SMD N 00888000
Ne 0 ""
Po 550 0
$EndPAD
$PAD
Sh "2" R 630 710 0 0 0
Dr 0 0 0
At SMD N 00888000
Ne 0 ""
Po -550 0
$EndPAD
$SHAPE3D
Na "walter\\smd_cap\\c_1206.wrl"
Sc 1.000000 1.000000 1.000000
Of 0.000000 0.000000 0.000000
Ro 0.000000 0.000000 0.000000
$EndSHAPE3D
$EndMODULE  c_1206
$EndLIBRARY
