#VRML V2.0 utf8
#kicad StepUp wrl exported

Shape {
    appearance Appearance {material DEF PIN-01 Material {
        ambientIntensity 0.271
        diffuseColor 0.824 0.820 0.781
        specularColor 0.328 0.258 0.172
        emissiveColor 0.0 0.0 0.0
        shininess 0.70
        transparency 0.0
        }
    }
}
Shape {
    appearance Appearance {material DEF MET-01 Material {
        ambientIntensity 0.249999
        diffuseColor 0.298 0.298 0.298
        specularColor 0.398 0.398 0.398
        emissiveColor 0.0 0.0 0.0
        shininess 0.056122
        transparency 0.0
        }
    }
}
Shape {
    appearance Appearance {material DEF PIN-02 Material {
        ambientIntensity 0.379
        diffuseColor 0.859 0.738 0.496
        specularColor 0.137 0.145 0.184
        emissiveColor 0.0 0.0 0.0
        shininess 0.40
        transparency 0.0
        }
    }
}
Shape {
    appearance Appearance {material DEF IC-BODY-EPOXY-04 Material {
        ambientIntensity 0.293
        diffuseColor 0.148 0.145 0.145
        specularColor 0.180 0.168 0.160
        emissiveColor 0.0 0.0 0.0
        shininess 0.35
        transparency 0.0
        }
    }
}
Shape {
    appearance Appearance {material DEF RES-SMD-01 Material {
        diffuseColor 0.082 0.086 0.094
        emissiveColor 0.000 0.000 0.000
        specularColor 0.066 0.063 0.063
        ambientIntensity 0.638
        transparency 0.0
        shininess 0.3
        }
    }
}
Shape {
    appearance Appearance {material DEF IC-BODY-EPOXY-01 Material {
        ambientIntensity 0.117
        diffuseColor 0.250 0.262 0.281
        specularColor 0.316 0.281 0.176
        emissiveColor 0.0 0.0 0.0
        shininess 0.25
        transparency 0.0
        }
    }
}
Shape {
    appearance Appearance {material DEF CAP-CERAMIC-05 Material {
        ambientIntensity 0.179
        diffuseColor 0.273 0.273 0.273
        specularColor 0.203 0.188 0.176
        emissiveColor 0.0 0.0 0.0
        shininess 0.15
        transparency 0.0
        }
    }
}
Shape {
    appearance Appearance {material DEF CAP-CERAMIC-06 Material {
        ambientIntensity 0.453
        diffuseColor 0.379 0.270 0.215
        specularColor 0.223 0.223 0.223
        emissiveColor 0.0 0.0 0.0
        shininess 0.15
        transparency 0.0
        }
    }
}
Shape {
    appearance Appearance {material DEF RES-THT-01 Material {
        ambientIntensity 0.149
        diffuseColor 0.883 0.711 0.492
        specularColor 0.043 0.121 0.281
        emissiveColor 0.0 0.0 0.0
        shininess 0.40
        transparency 0.0
        }
    }
}
Shape {
    appearance Appearance {material DEF PLASTIC-BLUE-01 Material {
        ambientIntensity 0.565
        diffuseColor 0.137 0.402 0.727
        specularColor 0.359 0.379 0.270
        emissiveColor 0.0 0.0 0.0
        shininess 0.25
        transparency 0.0
        }
    }
}
Shape {
    appearance Appearance {material DEF PLASTIC-GREEN-01 Material {
        ambientIntensity 0.315
        diffuseColor 0.340 0.680 0.445
        specularColor 0.176 0.105 0.195
        emissiveColor 0.0 0.0 0.0
        shininess 0.25
        transparency 0.0
        }
    }
}
Shape {
    appearance Appearance {material DEF PLASTIC-ORANGE-01 Material {
        ambientIntensity 0.284
        diffuseColor 0.809 0.426 0.148
        specularColor 0.039 0.102 0.145
        emissiveColor 0.0 0.0 0.0
        shininess 0.25
        transparency 0.0
        }
    }
}
Shape {
    appearance Appearance {material DEF RED-BODY Material {
        ambientIntensity 0.683
        diffuseColor 0.700 0.100 0.050
        emissiveColor 0.000 0.000 0.000
        specularColor 0.300 0.400 0.150
        shininess 0.25
        transparency 0.0
        }
    }
}
Shape {
    appearance Appearance {material DEF CAP-CERAMIC-02 Material {
        ambientIntensity 0.683
        diffuseColor 0.578 0.336 0.352
        specularColor 0.105 0.273 0.270
        emissiveColor 0.0 0.0 0.0
        shininess 0.25
        transparency 0.0
        }
    }
}
Shape {
    appearance Appearance {material DEF PLASTIC-YELLOW-01 Material {
        ambientIntensity 0.522
        diffuseColor 0.832 0.680 0.066
        specularColor 0.160 0.203 0.320
        emissiveColor 0.0 0.0 0.0
        shininess 0.25
        transparency 0.0
        }
    }
}
Shape {
    appearance Appearance {material DEF PLASTIC-WHITE-01 Material {
        ambientIntensity 0.494
        diffuseColor 0.895 0.891 0.813
        specularColor 0.047 0.055 0.109
        emissiveColor 0.0 0.0 0.0
        shininess 0.25
        transparency 0.0
        }
    }
}
Shape {
    appearance Appearance {material DEF IC-LABEL-01 Material {
        ambientIntensity 0.082
        diffuseColor 0.691 0.664 0.598
        specularColor 0.000 0.000 0.000
        emissiveColor 0.0 0.0 0.0
        shininess 0.01
        transparency 0.0
        }
    }
}
Shape {
    appearance Appearance {material DEF LED-RED Material {
        ambientIntensity 0.789
        diffuseColor 0.700 0.100 0.050
        emissiveColor 0.000 0.000 0.000
        specularColor 0.300 0.400 0.150
        shininess 0.125
        transparency 0.10
        }
    }
}
Shape {
    appearance Appearance {material DEF LED-GREEN Material {
        ambientIntensity 0.789
        diffuseColor 0.400 0.700 0.150
        emissiveColor 0.000 0.000 0.000
        specularColor 0.600 0.300 0.100
        shininess 0.05
        transparency 0.10
        }
    }
}
Shape {
    appearance Appearance {material DEF LED-BLUE Material {
        ambientIntensity 0.789
        diffuseColor 0.100 0.250 0.700
        emissiveColor 0.000 0.000 0.000
        specularColor 0.500 0.600 0.300
        shininess 0.125
        transparency 0.10
        }
    }
}
Shape {
    appearance Appearance {material DEF LED-YELLOW Material {
        ambientIntensity 0.522
        diffuseColor 0.98 0.840 0.066
        specularColor 0.160 0.203 0.320
        emissiveColor 0.0 0.0 0.0
        shininess 0.125
        transparency 0.10
        }
    }
}
Shape {
    appearance Appearance {material DEF LED-WHITE Material {
        ambientIntensity 0.494
        diffuseColor 0.895 0.891 0.813
        specularColor 0.047 0.055 0.109
        emissiveColor 0.0 0.0 0.0
        shininess 0.125
        transparency 0.10
        }
    }
}
Shape {
    appearance Appearance {material DEF LED-GREY Material {
        ambientIntensity 0.494
        diffuseColor 0.27 0.25 0.27
        specularColor 0.5 0.5 0.6
        emissiveColor 0.0 0.0 0.0
        shininess 0.35
        transparency 0.10
        }
    }
}
Shape {
    appearance Appearance {material DEF LED-BLACK Material {
        ambientIntensity 0.494
        diffuseColor 0.1 0.05 0.1
        specularColor 0.6 0.5 0.6
        emissiveColor 0.0 0.0 0.0
        shininess 0.5
        transparency 0.0
        }
    }
}
Shape {
    appearance Appearance {material DEF GLASS-19 Material {
        ambientIntensity 2.018212
        diffuseColor 0.400769 0.441922 0.459091
        specularColor 0.573887 0.649271 0.810811
        emissiveColor 0.000000 0.000000 0.000000
        shininess 0.127273
        transparency 0.37
        }
    }
}
Shape {
    appearance Appearance {material DEF GLASS-29 Material {
        ambientIntensity 0.234375
        diffuseColor 0.566681 0.580872 0.580874
        specularColor 0.617761 0.429816 0.400140
        emissiveColor 0.000000 0.000000 0.000000
        shininess 0.072727
        transparency 0.38
        }
    }
}
Shape {
    appearance Appearance {material DEF GLASS-13 Material {
        ambientIntensity 0.250000
        diffuseColor 0.000000 0.631244 0.748016
        specularColor 0.915152 0.915152 0.915152
        emissiveColor 0.000000 0.000000 0.000000
        shininess 0.642424
        transparency 0.39
        }
    }
}
Shape {
    appearance Appearance {material DEF GLASS-GREEN Material {
        ambientIntensity 0.250000
        diffuseColor 0.000000 0.75 0.44
        specularColor 0.915152 0.915152 0.915152
        emissiveColor 0.000000 0.000000 0.000000
        shininess 0.642424
        transparency 0.39
        }
    }
}
Shape {
    appearance Appearance {material DEF GLASS-ORANGE Material {
        ambientIntensity 0.250000
        diffuseColor 0.75 0.44 0.000000
        specularColor 0.915152 0.915152 0.915152
        emissiveColor 0.000000 0.000000 0.000000
        shininess 0.642424
        transparency 0.39
        }
    }
}
Shape {
    appearance Appearance {material DEF BOARD-GREEN-02 Material {
        ambientIntensity 1
        diffuseColor 0.07 0.3 0.12
        specularColor 0.07 0.3 0.12
        emissiveColor 0.0 0.0 0.0
        shininess 0.40
        transparency 0.0
        }
    }
}
Shape {
    appearance Appearance {material DEF BOARD-BLUE-01 Material {
        ambientIntensity 1
        diffuseColor 0.07 0.12 0.3
        specularColor 0.07 0.12 0.3
        emissiveColor 0.0 0.0 0.0
        shininess 0.40
        transparency 0.0
        }
    }
}
Shape {
    appearance Appearance {material DEF BOARD-BLACK-03 Material {
        ambientIntensity 1
        diffuseColor 0.16 0.16 0.16
        specularColor 0.16 0.16 0.16
        emissiveColor 0.0 0.0 0.0
        shininess 0.40
        transparency 0.0
        }
    }
}
Shape {
    appearance Appearance {material DEF MET-ALUMINUM Material {
        ambientIntensity 0.256000
        diffuseColor 0.372322 0.371574 0.373173
        specularColor 0.556122 0.554201 0.556122
        emissiveColor 0.0 0.0 0.0
        shininess 0.127551
        transparency 0.0
        }
    }
}
Shape {
    appearance Appearance {material DEF MET-BRONZE Material {
        ambientIntensity 0.022727
        diffuseColor 0.714 0.4284 0.18144
        specularColor 0.393548 0.271906 0.166721
        emissiveColor 0.000000 0.000000 0.000000
        shininess 0.2
        transparency 0.0
        }
    }
}
Shape {
    appearance Appearance {material DEF MET-SILVER Material {
        ambientIntensity 0.022727
        diffuseColor 0.50754 0.50754 0.50754
        specularColor 0.508273 0.508273 0.508273
        emissiveColor 0.000000 0.000000 0.000000
        shininess 0.4
        transparency 0.0
        }
    }
}
Shape {
    appearance Appearance {material DEF MET-COPPER Material {
        ambientIntensity 0.022727
        diffuseColor 0.7038 0.27048 0.0828
        specularColor 0.780612 0.37 0.000000
        emissiveColor 0.000000 0.000000 0.000000
        shininess 0.2
        transparency 0.0
        }
    }
}
Shape { geometry IndexedFaceSet 
{ creaseAngle 0.50 coordIndex [0,1,2,-1,2,1,3,-1]
coord Coordinate { point [4.94743 0.15748 1.94736,0.73077 0.15748 1.94736,4.94743 -0.15748 1.94736,0.73077 -0.15748 1.94736]
}}
appearance Appearance{material Material{diffuseColor 0.8 0.8 0.8
transparency 0}}}
Shape { geometry IndexedFaceSet 
{ creaseAngle 0.50 coordIndex [0,1,2,-1,0,2,3,-1,0,3,4,-1,0,4,5,-1,6,7,8,-1,0,5,9,-1,0,9,10,-1,0,10,11,-1,0,11,12,-1,0,12,13,-1,0,13,14,-1,1,15,16,-1,16,15,17,-1,18,6,8,-1,17,15,19,-1,20,21,22,-1,14,20,6,-1,14,6,18,-1,15,21,20,-1,15,20,14,-1,19,15,23,-1,24,23,15,-1,25,24,15,-1,26,25,15,-1,27,26,15,-1,28,27,15,-1,29,15,14,-1,29,28,15,-1,30,29,14,-1,13,30,14,-1,1,16,31,-1,1,31,32,-1,1,32,33,-1,1,33,34,-1,1,34,35,-1,36,1,35,-1,2,1,36,-1]
coord Coordinate { point [4.94743 0.15748 1.94736,4.94743 0.15748 0.852385,4.4685 0.15748 1.41732,4.46106 0.15748 1.47856,4.43918 0.15748 1.53624,4.40414 0.15748 1.58702,0.22786 0.15748 -0.000803148,0.22786 0.15748 -1.1811,-0.23622 0.15748 -1.1811,4.35796 0.15748 1.62793,4.30334 0.15748 1.6566,4.24344 0.15748 1.67136,4.18174 0.15748 1.67136,4.12184 0.15748 1.6566,0.73077 0.15748 1.94736,2.19327 0.15748 0.852385,4.18174 0.15748 1.16328,4.12184 0.15748 1.17804,-0.23622 0.15748 0.970638,4.06722 0.15748 1.20671,1.72812 0.15748 -0.000803148,2.19327 0.15748 -1.1811,1.72812 0.15748 -1.1811,4.02104 0.15748 1.24762,3.986 0.15748 1.2984,3.96412 0.15748 1.35608,3.95669 0.15748 1.41732,3.96412 0.15748 1.47856,3.986 0.15748 1.53624,4.02104 0.15748 1.58702,4.06722 0.15748 1.62793,4.24344 0.15748 1.16328,4.30334 0.15748 1.17804,4.35796 0.15748 1.20671,4.40414 0.15748 1.24762,4.43918 0.15748 1.2984,4.46106 0.15748 1.35608]
}}
appearance Appearance{material Material{diffuseColor 0.8 0.8 0.8
transparency 0}}}
Shape { geometry IndexedFaceSet 
{ creaseAngle 0.50 coordIndex [0,1,2,-1,3,1,0,-1]
coord Coordinate { point [4.94743 -0.15748 1.94736,5.06554 0.03937 1.82925,4.94743 0.15748 1.94736,5.06554 -0.03937 1.82925]
}}
appearance Appearance{material Material{diffuseColor 0.8 0.8 0.8
transparency 0}}}
Shape { geometry IndexedFaceSet 
{ creaseAngle 0.50 coordIndex [0,1,2,-1,2,1,3,-1]
coord Coordinate { point [0.73077 0.15748 1.94736,-0.23622 0.15748 0.970638,0.73077 -0.15748 1.94736,-0.23622 -0.15748 0.970638]
}}
appearance Appearance{material Material{diffuseColor 0.8 0.8 0.8
transparency 0}}}
Shape { geometry IndexedFaceSet 
{ creaseAngle 0.50 coordIndex [0,1,2,-1,2,1,3,-1,3,1,4,-1,5,6,7,-1,4,1,8,-1,8,1,9,-1,9,1,10,-1,10,1,11,-1,11,1,12,-1,12,1,13,-1,13,1,14,-1,15,0,16,-1,6,17,7,-1,15,16,18,-1,15,18,19,-1,20,21,22,-1,21,14,6,-1,6,14,17,-1,20,15,21,-1,21,15,14,-1,15,19,23,-1,23,24,15,-1,24,25,15,-1,25,26,15,-1,26,27,15,-1,27,28,15,-1,15,29,14,-1,28,29,15,-1,29,30,14,-1,30,13,14,-1,16,0,31,-1,31,0,32,-1,32,0,33,-1,33,0,34,-1,34,0,35,-1,0,36,35,-1,0,2,36,-1]
coord Coordinate { point [4.94743 -0.15748 0.852385,4.94743 -0.15748 1.94736,4.4685 -0.15748 1.41732,4.46106 -0.15748 1.47856,4.43918 -0.15748 1.53624,0.22786 -0.15748 -1.1811,0.22786 -0.15748 -0.000803148,-0.23622 -0.15748 -1.1811,4.40414 -0.15748 1.58702,4.35796 -0.15748 1.62793,4.30334 -0.15748 1.6566,4.24344 -0.15748 1.67136,4.18174 -0.15748 1.67136,4.12184 -0.15748 1.6566,0.73077 -0.15748 1.94736,2.19327 -0.15748 0.852385,4.18174 -0.15748 1.16328,-0.23622 -0.15748 0.970638,4.12184 -0.15748 1.17804,4.06722 -0.15748 1.20671,2.19327 -0.15748 -1.1811,1.72812 -0.15748 -0.000803148,1.72812 -0.15748 -1.1811,4.02104 -0.15748 1.24762,3.986 -0.15748 1.2984,3.96412 -0.15748 1.35608,3.95669 -0.15748 1.41732,3.96412 -0.15748 1.47856,3.986 -0.15748 1.53624,4.02104 -0.15748 1.58702,4.06722 -0.15748 1.62793,4.24344 -0.15748 1.16328,4.30334 -0.15748 1.17804,4.35796 -0.15748 1.20671,4.40414 -0.15748 1.24762,4.43918 -0.15748 1.2984,4.46106 -0.15748 1.35608]
}}
appearance Appearance{material Material{diffuseColor 0.8 0.8 0.8
transparency 0}}}
Shape { geometry IndexedFaceSet 
{ creaseAngle 0.50 coordIndex [0,1,2,-1,2,1,3,-1]
coord Coordinate { point [4.94743 0.15748 0.852385,4.94743 0.15748 1.94736,5.06554 0.03937 0.970495,5.06554 0.03937 1.82925]
}}
appearance Appearance{material Material{diffuseColor 0.8 0.8 0.8
transparency 0}}}
Shape { geometry IndexedFaceSet 
{ creaseAngle 0.50 coordIndex [0,1,2,-1,2,1,3,-1]
coord Coordinate { point [2.19327 0.15748 0.852385,4.94743 0.15748 0.852385,2.19327 -0.15748 0.852385,4.94743 -0.15748 0.852385]
}}
appearance Appearance{material Material{diffuseColor 0.8 0.8 0.8
transparency 0}}}
Shape { geometry IndexedFaceSet 
{ creaseAngle 0.50 coordIndex [0,1,2,-1,0,2,3,-1]
coord Coordinate { point [-0.23622 0.15748 0.970638,-0.23622 0.15748 -1.1811,-0.23622 -0.15748 -1.1811,-0.23622 -0.15748 0.970638]
}}
appearance Appearance{material Material{diffuseColor 0.8 0.8 0.8
transparency 0}}}
Shape { geometry IndexedFaceSet 
{ creaseAngle 0.50 coordIndex [0,1,2,-1,2,1,3,-1]
coord Coordinate { point [2.19327 0.15748 -1.1811,2.19327 0.15748 0.852385,2.19327 -0.15748 -1.1811,2.19327 -0.15748 0.852385]
}}
appearance Appearance{material Material{diffuseColor 0.8 0.8 0.8
transparency 0}}}
Shape { geometry IndexedFaceSet 
{ creaseAngle 0.50 coordIndex [0,1,2,-1,2,1,3,-1]
coord Coordinate { point [-0.23622 0.15748 -1.1811,0.22786 0.15748 -1.1811,-0.23622 -0.15748 -1.1811,0.22786 -0.15748 -1.1811]
}}
appearance Appearance{material Material{diffuseColor 0.8 0.8 0.8
transparency 0}}}
Shape { geometry IndexedFaceSet 
{ creaseAngle 0.50 coordIndex [0,1,2,-1,2,1,3,-1]
coord Coordinate { point [1.72812 0.15748 -1.1811,2.19327 0.15748 -1.1811,1.72812 -0.15748 -1.1811,2.19327 -0.15748 -1.1811]
}}
appearance Appearance{material Material{diffuseColor 0.8 0.8 0.8
transparency 0}}}
Shape { geometry IndexedFaceSet 
{ creaseAngle 0.50 coordIndex [0,1,2,-1,2,1,3,-1]
coord Coordinate { point [0.22786 0.15748 -1.1811,0.22786 0.15748 -0.000803148,0.22786 -0.15748 -1.1811,0.22786 -0.15748 -0.000803148]
}}
appearance Appearance{material Material{diffuseColor 0.8 0.8 0.8
transparency 0}}}
Shape { geometry IndexedFaceSet 
{ creaseAngle 0.50 coordIndex [0,1,2,-1,2,1,3,-1]
coord Coordinate { point [1.72812 0.15748 -0.000803148,1.72812 0.15748 -1.1811,1.72812 -0.15748 -0.000803148,1.72812 -0.15748 -1.1811]
}}
appearance Appearance{material Material{diffuseColor 0.8 0.8 0.8
transparency 0}}}
Shape { geometry IndexedFaceSet 
{ creaseAngle 0.50 coordIndex [0,1,2,-1,2,1,3,-1]
coord Coordinate { point [0.22786 0.15748 -0.000803148,1.72812 0.15748 -0.000803148,0.22786 -0.15748 -0.000803148,1.72812 -0.15748 -0.000803148]
}}
appearance Appearance{material Material{diffuseColor 0.8 0.8 0.8
transparency 0}}}
Shape { geometry IndexedFaceSet 
{ creaseAngle 0.50 coordIndex [0,1,2,-1,2,1,3,-1,1,4,3,-1,3,4,5,-1,6,7,8,-1,4,9,5,-1,10,7,6,-1,5,9,11,-1,9,12,11,-1,8,13,14,-1,11,12,15,-1,7,13,8,-1,12,16,15,-1,15,16,17,-1,14,18,19,-1,13,18,14,-1,16,20,17,-1,17,20,21,-1,19,22,23,-1,18,22,19,-1,21,24,25,-1,20,24,21,-1,23,26,27,-1,25,10,6,-1,22,26,23,-1,24,10,25,-1,27,28,29,-1,26,28,27,-1,29,30,31,-1,28,30,29,-1,31,32,33,-1,30,32,31,-1,33,34,35,-1,32,34,33,-1,35,36,37,-1,34,36,35,-1,36,38,37,-1,37,38,39,-1,38,40,39,-1,39,40,41,-1,40,42,41,-1,41,42,43,-1,42,44,43,-1,43,44,45,-1,44,46,45,-1,45,46,47,-1,46,48,47,-1,47,48,49,-1,48,50,49,-1,49,50,51,-1,50,0,51,-1,51,0,2,-1]
coord Coordinate { point [4.12184 -0.15748 1.17804,4.18174 -0.15748 1.16328,4.12184 0.15748 1.17804,4.18174 0.15748 1.16328,4.24344 -0.15748 1.16328,4.24344 0.15748 1.16328,4.4685 0.15748 1.41732,4.46106 -0.15748 1.47856,4.46106 0.15748 1.47856,4.30334 -0.15748 1.17804,4.4685 -0.15748 1.41732,4.30334 0.15748 1.17804,4.35796 -0.15748 1.20671,4.43918 -0.15748 1.53624,4.43918 0.15748 1.53624,4.35796 0.15748 1.20671,4.40414 -0.15748 1.24762,4.40414 0.15748 1.24762,4.40414 -0.15748 1.58702,4.40414 0.15748 1.58702,4.43918 -0.15748 1.2984,4.43918 0.15748 1.2984,4.35796 -0.15748 1.62793,4.35796 0.15748 1.62793,4.46106 -0.15748 1.35608,4.46106 0.15748 1.35608,4.30334 -0.15748 1.6566,4.30334 0.15748 1.6566,4.24344 -0.15748 1.67136,4.24344 0.15748 1.67136,4.18174 -0.15748 1.67136,4.18174 0.15748 1.67136,4.12184 -0.15748 1.6566,4.12184 0.15748 1.6566,4.06722 -0.15748 1.62793,4.06722 0.15748 1.62793,4.02104 -0.15748 1.58702,4.02104 0.15748 1.58702,3.986 -0.15748 1.53624,3.986 0.15748 1.53624,3.96412 -0.15748 1.47856,3.96412 0.15748 1.47856,3.95669 -0.15748 1.41732,3.95669 0.15748 1.41732,3.96412 -0.15748 1.35608,3.96412 0.15748 1.35608,3.986 -0.15748 1.2984,3.986 0.15748 1.2984,4.02104 -0.15748 1.24762,4.02104 0.15748 1.24762,4.06722 -0.15748 1.20671,4.06722 0.15748 1.20671]
}}
appearance Appearance{material Material{diffuseColor 0.8 0.8 0.8
transparency 0}}}
Shape { geometry IndexedFaceSet 
{ creaseAngle 0.50 coordIndex [0,1,2,-1,0,3,1,-1]
coord Coordinate { point [5.06554 0.03937 0.970495,5.06554 -0.03937 1.82925,5.06554 -0.03937 0.970495,5.06554 0.03937 1.82925]
}}
appearance Appearance{material Material{diffuseColor 0.8 0.8 0.8
transparency 0}}}
Shape { geometry IndexedFaceSet 
{ creaseAngle 0.50 coordIndex [0,1,2,-1,3,1,0,-1]
coord Coordinate { point [5.06554 -0.03937 1.82925,4.94743 -0.15748 0.852385,5.06554 -0.03937 0.970495,4.94743 -0.15748 1.94736]
}}
appearance Appearance{material Material{diffuseColor 0.8 0.8 0.8
transparency 0}}}
Shape { geometry IndexedFaceSet 
{ creaseAngle 0.50 coordIndex [0,1,2,-1,0,2,3,-1]
coord Coordinate { point [4.94743 -0.15748 0.852385,4.94743 0.15748 0.852385,5.06554 0.03937 0.970495,5.06554 -0.03937 0.970495]
}}
appearance Appearance{material Material{diffuseColor 0.8 0.8 0.8
transparency 0}}}
