PCBNEW-LibModule-V1  ven 05 mar 2010 11:08:12 CET
$INDEX
AMP-MODU-2
AMP-MODU-4
AMP-MODU-6
AMP-MODU-8
AMP-MODU-9
AMP-MODU-10
AMP-MODU-12
AMP-MODU-15
AMP-MODU-22
$EndINDEX
$MODULE AMP-MODU-2
Po 0 0 0 15 4B90D729 00000000 ~~
Li AMP-MODU-2
Cd AMP modu 2 pins
Kw CONN DEV AMP MODU
Sc 00000000
AR
Op 0 0 0
T0 0 -1299 400 400 0 80 N V 21 N"AMP-MODU-2"
T1 0 1378 400 350 0 80 N I 21 N"JP***"
DS 512 -827 1535 -827 120 21
DS -512 -827 -1535 -827 120 21
DS 1693 984 -1693 984 120 21
DS -1693 -984 1693 -984 120 21
DS -1063 827 -1535 827 120 21
DS 1535 827 1063 827 120 21
DS -512 -827 512 -827 120 21
DS 1535 827 1535 -827 120 21
DS 1063 984 1063 827 120 21
DS -1063 827 -1063 984 120 21
DS -1535 -827 -1535 827 120 21
DS 512 -984 512 -827 120 21
DS -512 -827 -512 -984 120 21
DS 1693 -984 1693 984 120 21
DS -1693 984 -1693 -984 120 21
$PAD
Sh "1" R 591 866 0 0 0
Dr 394 0 0
At STD N 00E0FFFF
Ne 0 ""
Po -500 0
$EndPAD
$PAD
Sh "2" O 591 866 0 0 0
Dr 394 0 0
At STD N 00E0FFFF
Ne 0 ""
Po 500 0
$EndPAD
$SHAPE3D
Na "walter\conn_modu\AMP_MODU_2.wrl"
Sc 1.000000 1.000000 1.000000
Of 0.000000 0.000000 0.000000
Ro 0.000000 0.000000 0.000000
$EndSHAPE3D
$EndMODULE  AMP-MODU-2
$MODULE AMP-MODU-4
Po 0 0 0 15 4B90D738 00000000 ~~
Li AMP-MODU-4
Cd AMP modu 4 pins
Kw CONN DEV AMP MODU
Sc 00000000
AR
Op 0 0 0
T0 0 -1299 400 400 0 80 N V 21 N"AMP-MODU-4"
T1 0 1378 400 350 0 80 N I 21 N"JP***"
DS -512 -827 -2362 -827 120 21
DS 2362 -827 512 -827 120 21
DS -2520 -984 2520 -984 120 21
DS 2520 984 -2520 984 120 21
DS -1889 827 -2361 827 120 21
DS 2362 827 1890 827 120 21
DS -512 -827 512 -827 120 21
DS 2362 827 2362 -827 120 21
DS 1890 984 1890 827 120 21
DS -1890 827 -1890 984 120 21
DS -2362 -827 -2362 827 120 21
DS 512 -984 512 -827 120 21
DS -512 -827 -512 -984 120 21
DS 2520 -984 2520 984 120 21
DS -2520 984 -2520 -984 120 21
$PAD
Sh "2" O 591 866 0 0 0
Dr 394 0 0
At STD N 00E0FFFF
Ne 0 ""
Po -500 0
$EndPAD
$PAD
Sh "3" O 591 866 0 0 0
Dr 394 0 0
At STD N 00E0FFFF
Ne 0 ""
Po 500 0
$EndPAD
$PAD
Sh "1" R 591 866 0 0 0
Dr 394 0 0
At STD N 00E0FFFF
Ne 0 ""
Po -1500 0
$EndPAD
$PAD
Sh "4" O 591 866 0 0 0
Dr 394 0 0
At STD N 00E0FFFF
Ne 0 ""
Po 1500 0
$EndPAD
$SHAPE3D
Na "walter\conn_modu\AMP_MODU_4.wrl"
Sc 1.000000 1.000000 1.000000
Of 0.000000 0.000000 0.000000
Ro 0.000000 0.000000 0.000000
$EndSHAPE3D
$EndMODULE  AMP-MODU-4
$MODULE AMP-MODU-6
Po 0 0 0 15 4B90D746 00000000 ~~
Li AMP-MODU-6
Cd AMP modu 6 pins
Kw CONN DEV AMP MODU
Sc 00000000
AR
Op 0 0 0
T0 0 -1299 400 400 0 80 N V 21 N"AMP-MODU-6"
T1 0 1378 400 350 0 80 N I 21 N"JP***"
DS -2874 827 -3346 827 120 21
DS 3346 827 2874 827 120 21
DS 3346 -827 512 -827 120 21
DS -512 -827 -3346 -827 120 21
DS -512 -827 512 -827 120 21
DS 3346 827 3346 -827 120 21
DS 2874 984 2874 827 120 21
DS -2874 827 -2874 984 120 21
DS -3346 -827 -3346 827 120 21
DS 512 -984 512 -827 120 21
DS -512 -827 -512 -984 120 21
DS 3504 -984 3504 984 120 21
DS 3504 984 -3504 984 120 21
DS -3504 984 -3504 -984 120 21
DS 3504 -984 -3504 -984 120 21
$PAD
Sh "1" R 591 866 0 0 0
Dr 394 0 0
At STD N 00E0FFFF
Ne 0 ""
Po -2500 0
$EndPAD
$PAD
Sh "2" O 591 866 0 0 0
Dr 394 0 0
At STD N 00E0FFFF
Ne 0 ""
Po -1500 0
$EndPAD
$PAD
Sh "3" O 591 866 0 0 0
Dr 394 0 0
At STD N 00E0FFFF
Ne 0 ""
Po -500 0
$EndPAD
$PAD
Sh "4" O 591 866 0 0 0
Dr 394 0 0
At STD N 00E0FFFF
Ne 0 ""
Po 500 0
$EndPAD
$PAD
Sh "5" O 591 866 0 0 0
Dr 394 0 0
At STD N 00E0FFFF
Ne 0 ""
Po 1500 0
$EndPAD
$PAD
Sh "6" O 591 866 0 0 0
Dr 394 0 0
At STD N 00E0FFFF
Ne 0 ""
Po 2500 0
$EndPAD
$SHAPE3D
Na "walter\conn_modu\AMP_MODU_6.wrl"
Sc 1.000000 1.000000 1.000000
Of 0.000000 0.000000 0.000000
Ro 0.000000 0.000000 0.000000
$EndSHAPE3D
$EndMODULE  AMP-MODU-6
$MODULE AMP-MODU-8
Po 0 0 0 15 4B90D762 00000000 ~~
Li AMP-MODU-8
Cd AMP modu 8 pins
Kw CONN DEV AMP MODU
Sc 00000000
AR
Op 0 0 0
T0 0 -1299 400 400 0 80 N V 21 N"AMP-MODU-8"
T1 0 1378 400 350 0 80 N I 21 N"JP***"
DS -512 -827 -4370 -827 120 21
DS 4370 -827 512 -827 120 21
DS 4528 984 -4528 984 120 21
DS -4528 -984 4528 -984 120 21
DS -3896 827 -4368 827 120 21
DS 4370 827 3898 827 120 21
DS -512 -827 512 -827 120 21
DS 4370 827 4370 -827 120 21
DS 3898 984 3898 827 120 21
DS -3897 827 -3897 984 120 21
DS -4369 -827 -4369 827 120 21
DS 512 -984 512 -827 120 21
DS -512 -827 -512 -984 120 21
DS 4528 -984 4528 984 120 21
DS -4527 984 -4527 -984 120 21
$PAD
Sh "4" O 591 866 0 0 0
Dr 394 0 0
At STD N 00E0FFFF
Ne 0 ""
Po -500 0
$EndPAD
$PAD
Sh "5" O 591 866 0 0 0
Dr 394 0 0
At STD N 00E0FFFF
Ne 0 ""
Po 500 0
$EndPAD
$PAD
Sh "3" O 591 866 0 0 0
Dr 394 0 0
At STD N 00E0FFFF
Ne 0 ""
Po -1500 0
$EndPAD
$PAD
Sh "6" O 591 866 0 0 0
Dr 394 0 0
At STD N 00E0FFFF
Ne 0 ""
Po 1500 0
$EndPAD
$PAD
Sh "7" O 591 866 0 0 0
Dr 394 0 0
At STD N 00E0FFFF
Ne 0 ""
Po 2500 0
$EndPAD
$PAD
Sh "8" O 591 866 0 0 0
Dr 394 0 0
At STD N 00E0FFFF
Ne 0 ""
Po 3500 0
$EndPAD
$PAD
Sh "1" R 591 866 0 0 0
Dr 394 0 0
At STD N 00E0FFFF
Ne 0 ""
Po -3500 0
$EndPAD
$PAD
Sh "2" O 591 866 0 0 0
Dr 394 0 0
At STD N 00E0FFFF
Ne 0 ""
Po -2500 0
$EndPAD
$SHAPE3D
Na "walter\conn_modu\AMP_MODU_8.wrl"
Sc 1.000000 1.000000 1.000000
Of 0.000000 0.000000 0.000000
Ro 0.000000 0.000000 0.000000
$EndSHAPE3D
$EndMODULE  AMP-MODU-8
$MODULE AMP-MODU-22
Po 0 0 0 15 4B90D78A 00000000 ~~
Li AMP-MODU-22
Cd AMP modu 22 pins
Kw CONN DEV AMP MODU
Sc 00000000
AR
Op 0 0 0
T0 0 -1299 400 400 0 80 N V 21 N"AMP-MODU-22"
T1 0 1378 400 350 0 80 N I 21 N"JP***"
DS 11378 -827 -11378 -827 120 21
DS -11535 -984 11535 -984 120 21
DS -11535 984 11535 984 120 21
DS -10905 827 -11377 827 120 21
DS 11378 827 10906 827 120 21
DS 11378 827 11378 -827 120 21
DS 10906 984 10906 827 120 21
DS -10906 827 -10906 984 120 21
DS -11378 -827 -11378 827 120 21
DS 512 -984 512 -827 120 21
DS -512 -827 -512 -984 120 21
DS 11536 -984 11536 984 120 21
DS -11536 984 -11536 -984 120 21
$PAD
Sh "4" O 591 866 0 0 0
Dr 394 0 0
At STD N 00E0FFFF
Ne 0 ""
Po -7500 0
$EndPAD
$PAD
Sh "5" O 591 866 0 0 0
Dr 394 0 0
At STD N 00E0FFFF
Ne 0 ""
Po -6500 0
$EndPAD
$PAD
Sh "3" O 591 866 0 0 0
Dr 394 0 0
At STD N 00E0FFFF
Ne 0 ""
Po -8500 0
$EndPAD
$PAD
Sh "6" O 591 866 0 0 0
Dr 394 0 0
At STD N 00E0FFFF
Ne 0 ""
Po -5500 0
$EndPAD
$PAD
Sh "7" O 591 866 0 0 0
Dr 394 0 0
At STD N 00E0FFFF
Ne 0 ""
Po -4500 0
$EndPAD
$PAD
Sh "8" O 591 866 0 0 0
Dr 394 0 0
At STD N 00E0FFFF
Ne 0 ""
Po -3500 0
$EndPAD
$PAD
Sh "1" R 591 866 0 0 0
Dr 394 0 0
At STD N 00E0FFFF
Ne 0 ""
Po -10500 0
$EndPAD
$PAD
Sh "2" O 591 866 0 0 0
Dr 394 0 0
At STD N 00E0FFFF
Ne 0 ""
Po -9500 0
$EndPAD
$PAD
Sh "9" O 591 866 0 0 0
Dr 394 0 0
At STD N 00E0FFFF
Ne 0 ""
Po -2500 0
$EndPAD
$PAD
Sh "10" O 591 866 0 0 0
Dr 394 0 0
At STD N 00E0FFFF
Ne 0 ""
Po -1500 0
$EndPAD
$PAD
Sh "11" O 591 866 0 0 0
Dr 394 0 0
At STD N 00E0FFFF
Ne 0 ""
Po -500 0
$EndPAD
$PAD
Sh "12" O 591 866 0 0 0
Dr 394 0 0
At STD N 00E0FFFF
Ne 0 ""
Po 500 0
$EndPAD
$PAD
Sh "13" O 591 866 0 0 0
Dr 394 0 0
At STD N 00E0FFFF
Ne 0 ""
Po 1500 0
$EndPAD
$PAD
Sh "14" O 591 866 0 0 0
Dr 394 0 0
At STD N 00E0FFFF
Ne 0 ""
Po 2500 0
$EndPAD
$PAD
Sh "15" O 591 866 0 0 0
Dr 394 0 0
At STD N 00E0FFFF
Ne 0 ""
Po 3500 0
$EndPAD
$PAD
Sh "16" O 591 866 0 0 0
Dr 394 0 0
At STD N 00E0FFFF
Ne 0 ""
Po 4500 0
$EndPAD
$PAD
Sh "17" O 591 866 0 0 0
Dr 394 0 0
At STD N 00E0FFFF
Ne 0 ""
Po 5500 0
$EndPAD
$PAD
Sh "18" O 591 866 0 0 0
Dr 394 0 0
At STD N 00E0FFFF
Ne 0 ""
Po 6500 0
$EndPAD
$PAD
Sh "19" O 591 866 0 0 0
Dr 394 0 0
At STD N 00E0FFFF
Ne 0 ""
Po 7500 0
$EndPAD
$PAD
Sh "20" O 591 866 0 0 0
Dr 394 0 0
At STD N 00E0FFFF
Ne 0 ""
Po 8500 0
$EndPAD
$PAD
Sh "21" O 591 866 0 0 0
Dr 394 0 0
At STD N 00E0FFFF
Ne 0 ""
Po 9500 0
$EndPAD
$PAD
Sh "22" O 591 866 0 0 0
Dr 394 0 0
At STD N 00E0FFFF
Ne 0 ""
Po 10500 0
$EndPAD
$SHAPE3D
Na "walter\conn_modu\AMP_MODU_22.wrl"
Sc 1.000000 1.000000 1.000000
Of 0.000000 0.000000 0.000000
Ro 0.000000 0.000000 0.000000
$EndSHAPE3D
$EndMODULE  AMP-MODU-22
$MODULE AMP-MODU-15
Po 0 0 0 15 4B90D7B4 00000000 ~~
Li AMP-MODU-15
Cd AMP modu 15 pins
Kw CONN DEV AMP MODU
Sc 00000000
AR
Op 0 0 0
T0 0 -1299 400 400 0 80 N V 21 N"AMP-MODU-15"
T1 0 1378 400 350 0 80 N I 21 N"JP***"
DS -8031 984 8031 984 120 21
DS 7874 -827 -7874 -827 120 21
DS -8031 -984 8031 -984 120 21
DS -7401 827 -7873 827 120 21
DS 7874 827 7402 827 120 21
DS 7874 827 7874 -827 120 21
DS 7402 984 7402 827 120 21
DS -7402 827 -7402 984 120 21
DS -7874 -827 -7874 827 120 21
DS 512 -984 512 -827 120 21
DS -512 -827 -512 -984 120 21
DS 8032 -984 8032 984 120 21
DS -8032 984 -8032 -984 120 21
$PAD
Sh "4" O 591 866 0 0 0
Dr 394 0 0
At STD N 00E0FFFF
Ne 0 ""
Po -4000 0
$EndPAD
$PAD
Sh "5" O 591 866 0 0 0
Dr 394 0 0
At STD N 00E0FFFF
Ne 0 ""
Po -3000 0
$EndPAD
$PAD
Sh "3" O 591 866 0 0 0
Dr 394 0 0
At STD N 00E0FFFF
Ne 0 ""
Po -5000 0
$EndPAD
$PAD
Sh "6" O 591 866 0 0 0
Dr 394 0 0
At STD N 00E0FFFF
Ne 0 ""
Po -2000 0
$EndPAD
$PAD
Sh "7" O 591 866 0 0 0
Dr 394 0 0
At STD N 00E0FFFF
Ne 0 ""
Po -1000 0
$EndPAD
$PAD
Sh "8" O 591 866 0 0 0
Dr 394 0 0
At STD N 00E0FFFF
Ne 0 ""
Po 0 0
$EndPAD
$PAD
Sh "1" R 591 866 0 0 0
Dr 394 0 0
At STD N 00E0FFFF
Ne 0 ""
Po -7000 0
$EndPAD
$PAD
Sh "2" O 591 866 0 0 0
Dr 394 0 0
At STD N 00E0FFFF
Ne 0 ""
Po -6000 0
$EndPAD
$PAD
Sh "9" O 591 866 0 0 0
Dr 394 0 0
At STD N 00E0FFFF
Ne 0 ""
Po 1000 0
$EndPAD
$PAD
Sh "10" O 591 866 0 0 0
Dr 394 0 0
At STD N 00E0FFFF
Ne 0 ""
Po 2000 0
$EndPAD
$PAD
Sh "11" O 591 866 0 0 0
Dr 394 0 0
At STD N 00E0FFFF
Ne 0 ""
Po 3000 0
$EndPAD
$PAD
Sh "12" O 591 866 0 0 0
Dr 394 0 0
At STD N 00E0FFFF
Ne 0 ""
Po 4000 0
$EndPAD
$PAD
Sh "13" O 591 866 0 0 0
Dr 394 0 0
At STD N 00E0FFFF
Ne 0 ""
Po 5000 0
$EndPAD
$PAD
Sh "14" O 591 866 0 0 0
Dr 394 0 0
At STD N 00E0FFFF
Ne 0 ""
Po 6000 0
$EndPAD
$PAD
Sh "15" O 591 866 0 0 0
Dr 394 0 0
At STD N 00E0FFFF
Ne 0 ""
Po 7000 0
$EndPAD
$SHAPE3D
Na "walter\conn_modu\AMP_MODU_15.wrl"
Sc 1.000000 1.000000 1.000000
Of 0.000000 0.000000 0.000000
Ro 0.000000 0.000000 0.000000
$EndSHAPE3D
$EndMODULE  AMP-MODU-15
$MODULE AMP-MODU-12
Po 0 0 0 15 4B90D7D1 00000000 ~~
Li AMP-MODU-12
Cd AMP modu 12 pins
Kw CONN DEV AMP MODU
Sc 00000000
AR
Op 0 0 0
T0 0 -1299 400 400 0 80 N V 21 N"AMP-MODU-12"
T1 0 1378 400 350 0 80 N I 21 N"JP***"
DS -6378 -827 6378 -827 120 21
DS 6535 984 -6535 984 120 21
DS -6535 -984 6535 -984 120 21
DS -5905 827 -6377 827 120 21
DS 6378 827 5906 827 120 21
DS 6378 827 6378 -827 120 21
DS 5906 984 5906 827 120 21
DS -5906 827 -5906 984 120 21
DS -6378 -827 -6378 827 120 21
DS 512 -984 512 -827 120 21
DS -512 -827 -512 -984 120 21
DS 6536 -984 6536 984 120 21
DS -6536 984 -6536 -984 120 21
$PAD
Sh "4" O 591 866 0 0 0
Dr 394 0 0
At STD N 00E0FFFF
Ne 0 ""
Po -2500 0
$EndPAD
$PAD
Sh "5" O 591 866 0 0 0
Dr 394 0 0
At STD N 00E0FFFF
Ne 0 ""
Po -1500 0
$EndPAD
$PAD
Sh "3" O 591 866 0 0 0
Dr 394 0 0
At STD N 00E0FFFF
Ne 0 ""
Po -3500 0
$EndPAD
$PAD
Sh "6" O 591 866 0 0 0
Dr 394 0 0
At STD N 00E0FFFF
Ne 0 ""
Po -500 0
$EndPAD
$PAD
Sh "7" O 591 866 0 0 0
Dr 394 0 0
At STD N 00E0FFFF
Ne 0 ""
Po 500 0
$EndPAD
$PAD
Sh "8" O 591 866 0 0 0
Dr 394 0 0
At STD N 00E0FFFF
Ne 0 ""
Po 1500 0
$EndPAD
$PAD
Sh "1" R 591 866 0 0 0
Dr 394 0 0
At STD N 00E0FFFF
Ne 0 ""
Po -5500 0
$EndPAD
$PAD
Sh "2" O 591 866 0 0 0
Dr 394 0 0
At STD N 00E0FFFF
Ne 0 ""
Po -4500 0
$EndPAD
$PAD
Sh "9" O 591 866 0 0 0
Dr 394 0 0
At STD N 00E0FFFF
Ne 0 ""
Po 2500 0
$EndPAD
$PAD
Sh "10" O 591 866 0 0 0
Dr 394 0 0
At STD N 00E0FFFF
Ne 0 ""
Po 3500 0
$EndPAD
$PAD
Sh "11" O 591 866 0 0 0
Dr 394 0 0
At STD N 00E0FFFF
Ne 0 ""
Po 4500 0
$EndPAD
$PAD
Sh "12" O 591 866 0 0 0
Dr 394 0 0
At STD N 00E0FFFF
Ne 0 ""
Po 5500 0
$EndPAD
$SHAPE3D
Na "walter\conn_modu\AMP_MODU_12.wrl"
Sc 1.000000 1.000000 1.000000
Of 0.000000 0.000000 0.000000
Ro 0.000000 0.000000 0.000000
$EndSHAPE3D
$EndMODULE  AMP-MODU-12
$MODULE AMP-MODU-10
Po 0 0 0 15 4B90D7EF 00000000 ~~
Li AMP-MODU-10
Cd AMP modu 10 pins
Kw CONN DEV AMP MODU
Sc 00000000
AR
Op 0 0 0
T0 0 -1299 400 400 0 80 N V 21 N"AMP-MODU-10"
T1 0 1378 400 350 0 80 N I 21 N"JP***"
DS -5354 -827 5354 -827 120 21
DS 5512 984 -5512 984 120 21
DS -5512 -984 5512 -984 120 21
DS -4881 827 -5353 827 120 21
DS 5354 827 4882 827 120 21
DS 5354 827 5354 -827 120 21
DS 4882 984 4882 827 120 21
DS -4882 827 -4882 984 120 21
DS -5354 -827 -5354 827 120 21
DS 512 -984 512 -827 120 21
DS -512 -827 -512 -984 120 21
DS 5512 -984 5512 984 120 21
DS -5512 984 -5512 -984 120 21
$PAD
Sh "4" O 591 866 0 0 0
Dr 394 0 0
At STD N 00E0FFFF
Ne 0 ""
Po -1500 0
$EndPAD
$PAD
Sh "5" O 591 866 0 0 0
Dr 394 0 0
At STD N 00E0FFFF
Ne 0 ""
Po -500 0
$EndPAD
$PAD
Sh "3" O 591 866 0 0 0
Dr 394 0 0
At STD N 00E0FFFF
Ne 0 ""
Po -2500 0
$EndPAD
$PAD
Sh "6" O 591 866 0 0 0
Dr 394 0 0
At STD N 00E0FFFF
Ne 0 ""
Po 500 0
$EndPAD
$PAD
Sh "7" O 591 866 0 0 0
Dr 394 0 0
At STD N 00E0FFFF
Ne 0 ""
Po 1500 0
$EndPAD
$PAD
Sh "8" O 591 866 0 0 0
Dr 394 0 0
At STD N 00E0FFFF
Ne 0 ""
Po 2500 0
$EndPAD
$PAD
Sh "1" R 591 866 0 0 0
Dr 394 0 0
At STD N 00E0FFFF
Ne 0 ""
Po -4500 0
$EndPAD
$PAD
Sh "2" O 591 866 0 0 0
Dr 394 0 0
At STD N 00E0FFFF
Ne 0 ""
Po -3500 0
$EndPAD
$PAD
Sh "9" O 591 866 0 0 0
Dr 394 0 0
At STD N 00E0FFFF
Ne 0 ""
Po 3500 0
$EndPAD
$PAD
Sh "10" O 591 866 0 0 0
Dr 394 0 0
At STD N 00E0FFFF
Ne 0 ""
Po 4500 0
$EndPAD
$SHAPE3D
Na "walter\conn_modu\AMP_MODU_10.wrl"
Sc 1.000000 1.000000 1.000000
Of 0.000000 0.000000 0.000000
Ro 0.000000 0.000000 0.000000
$EndSHAPE3D
$EndMODULE  AMP-MODU-10
$MODULE AMP-MODU-9
Po 0 0 0 15 4B90D80A 00000000 ~~
Li AMP-MODU-9
Cd AMP modu 9 pins
Kw CONN DEV AMP MODU
Sc 00000000
AR 
Op 0 0 0
T0 0 -1299 400 400 0 80 N V 21 N"AMP-MODU-9"
T1 0 1378 400 350 0 80 N I 21 N"JP***"
DS -4843 -827 4843 -827 120 21
DS 5000 984 -5000 984 120 21
DS -5000 -984 5000 -984 120 21
DS -4369 827 -4841 827 120 21
DS 4842 827 4370 827 120 21
DS 4842 827 4842 -827 120 21
DS 4370 984 4370 827 120 21
DS -4370 827 -4370 984 120 21
DS -4842 -827 -4842 827 120 21
DS 512 -984 512 -827 120 21
DS -512 -827 -512 -984 120 21
DS 5000 -984 5000 984 120 21
DS -5000 984 -5000 -984 120 21
$PAD
Sh "4" O 591 866 0 0 0
Dr 394 0 0
At STD N 00E0FFFF
Ne 0 ""
Po -1000 0
$EndPAD
$PAD
Sh "5" O 591 866 0 0 0
Dr 394 0 0
At STD N 00E0FFFF
Ne 0 ""
Po 0 0
$EndPAD
$PAD
Sh "3" O 591 866 0 0 0
Dr 394 0 0
At STD N 00E0FFFF
Ne 0 ""
Po -2000 0
$EndPAD
$PAD
Sh "6" O 591 866 0 0 0
Dr 394 0 0
At STD N 00E0FFFF
Ne 0 ""
Po 1000 0
$EndPAD
$PAD
Sh "7" O 591 866 0 0 0
Dr 394 0 0
At STD N 00E0FFFF
Ne 0 ""
Po 2000 0
$EndPAD
$PAD
Sh "8" O 591 866 0 0 0
Dr 394 0 0
At STD N 00E0FFFF
Ne 0 ""
Po 3000 0
$EndPAD
$PAD
Sh "1" R 591 866 0 0 0
Dr 394 0 0
At STD N 00E0FFFF
Ne 0 ""
Po -4000 0
$EndPAD
$PAD
Sh "2" O 591 866 0 0 0
Dr 394 0 0
At STD N 00E0FFFF
Ne 0 ""
Po -3000 0
$EndPAD
$PAD
Sh "9" O 591 866 0 0 0
Dr 394 0 0
At STD N 00E0FFFF
Ne 0 ""
Po 4000 0
$EndPAD
$SHAPE3D
Na "walter\conn_modu\AMP_MODU_9.wrl"
Sc 1.000000 1.000000 1.000000
Of 0.000000 0.000000 0.000000
Ro 0.000000 0.000000 0.000000
$EndSHAPE3D
$EndMODULE  AMP-MODU-9
$EndLIBRARY
