PCBNEW-LibModule-V1  31.8.2012 10:16:06
# encoding utf-8
Units deci-mils
$INDEX
CDRH6D28
DE0704
PM3700
SMT43
SMT54
SMT73
$EndINDEX
$MODULE CDRH6D28
Po 0 0 0 15 4FD65173 00000000 ~~
Li CDRH6D28
Sc 0
AR 
Op 0 0 0
T0 0 -2400 393 393 0 78 N V 21 N "CDRH6D28"
T1 200 2400 393 393 0 78 N I 21 N "Value"
DS -1600 -1800 1600 -1800 60 21
DS 1600 -1800 1600 1800 60 21
DS 1600 1800 -1600 1800 60 21
DS -1600 1800 -1600 -1800 60 21
$PAD
Sh "1" R 2874 1043 0 0 0
Dr 0 0 0
At SMD N 00888000
Ne 0 ""
Po 0 900
$EndPAD
$PAD
Sh "2" R 2874 1043 0 0 0
Dr 0 0 0
At SMD N 00888000
Ne 0 ""
Po 0 -900
$EndPAD
$EndMODULE CDRH6D28
$MODULE DE0704
Po 0 0 0 15 504072BA 00000000 ~~
Li DE0704
Sc 0
AR 
Op 0 0 0
T0 0 -1811 393 393 0 78 N V 21 N "DE0704"
T1 0 0 393 393 0 78 N I 21 N "Value"
DA 20 20 1044 650 900 79 21
DA 20 20 650 1044 900 79 21
DA 0 0 -630 -1024 900 79 21
DA 0 0 -1024 -630 900 79 21
DS 1458 1457 1458 591 79 21
DS -1456 1457 -1456 591 79 21
DS 1458 1457 -1456 1457 79 21
DS -1457 -1457 1457 -1457 79 21
DS 1457 -1457 1457 -591 79 21
DS -1457 -1457 -1457 -591 79 21
$PAD
Sh "1" R 590 866 0 0 0
Dr 0 0 0
At SMD N 00888000
Ne 0 ""
Po -1240 0
$EndPAD
$PAD
Sh "2" R 589 865 0 0 0
Dr 0 0 0
At SMD N 00888000
Ne 0 ""
Po 1240 0
$EndPAD
$EndMODULE DE0704
$MODULE PM3700
Po 0 0 0 15 4FD65481 00000000 ~~
Li PM3700
Sc 0
AR 
Op 0 0 0
T0 2500 -3750 393 393 0 78 N V 21 N "PM3700"
T1 0 0 393 393 0 78 N I 21 N "Value"
DC -1250 3750 -1000 3750 150 21
DC 0 0 -3500 0 150 21
$PAD
Sh "1" R 1252 1252 0 0 0
Dr 0 0 0
At SMD N 00888000
Ne 1 "1"
Po 0 3650
$EndPAD
$PAD
Sh "2" R 1252 1252 0 0 0
Dr 0 0 0
At SMD N 00888000
Ne 0 ""
Po 3650 0
$EndPAD
$PAD
Sh "3" R 1252 1252 0 0 0
Dr 0 0 0
At SMD N 00888000
Ne 0 ""
Po 0 -3650
$EndPAD
$PAD
Sh "4" R 1252 1252 0 0 0
Dr 0 0 0
At SMD N 00888000
Ne 0 ""
Po -3650 0
$EndPAD
$EndMODULE PM3700
$MODULE SMT43
Po 0 0 0 15 4FB13FF9 4FB13F9C ~~
Li SMT43
Sc 4FB13F9C
AR 
Op 0 0 0
T0 0 -1378 394 394 0 79 N V 21 N "SMT43"
T1 0 1378 394 394 0 79 N I 21 N "VAL**"
DC 0 0 689 492 150 21
$PAD
Sh "1" R 787 1693 0 0 0
Dr 0 0 0
At SMD N 00888000
Ne 0 ""
Po -600 0
$EndPAD
$PAD
Sh "2" R 787 1693 0 0 0
Dr 0 0 0
At SMD N 00888000
Ne 0 ""
Po 600 0
$EndPAD
$SHAPE3D
Na "Inductor\\SMT43.wrl"
Sc 1 1 1
Of 0 0 0
Ro 0 0 0
$EndSHAPE3D
$EndMODULE SMT43
$MODULE SMT54
Po 0 0 0 15 4FB140CD 00000000 ~~
Li SMT54
Sc 0
AR 
Op 0 0 0
T0 0 -1476 394 394 0 79 N V 21 N "SMT54"
T1 0 1575 394 394 0 79 N I 21 N "VAL**"
DC 0 0 984 98 150 21
$PAD
Sh "1" R 984 2165 0 0 0
Dr 0 0 0
At SMD N 00888000
Ne 0 ""
Po -840 0
$EndPAD
$PAD
Sh "2" R 984 2165 0 0 0
Dr 0 0 0
At SMD N 00888000
Ne 0 ""
Po 840 0
$EndPAD
$SHAPE3D
Na "Inductor\\SMT54.wrl"
Sc 1 1 1
Of 0 0 0
Ro 0 0 0
$EndSHAPE3D
$EndMODULE SMT54
$MODULE SMT73
Po 0 0 0 15 4FB1419C 00000000 ~~
Li SMT73
Sc 0
AR 
Op 0 0 0
T0 0 -1870 394 394 0 79 N V 21 N "SMT73"
T1 0 1969 394 394 0 79 N I 21 N "VAL**"
DC 0 0 1378 0 150 21
$PAD
Sh "1" R 1181 2854 0 0 0
Dr 0 0 0
At SMD N 00888000
Ne 0 ""
Po -1000 0
$EndPAD
$PAD
Sh "2" R 1181 2854 0 0 0
Dr 0 0 0
At SMD N 00888000
Ne 0 ""
Po 1000 0
$EndPAD
$SHAPE3D
Na "Inductor\\SMT73.wrl"
Sc 1 1 1
Of 0 0 0
Ro 0 0 0
$EndSHAPE3D
$EndMODULE SMT73
$EndLIBRARY
