PCBNEW-LibModule-V1  2.11.2011 21:04:21
# encoding utf-8
$INDEX
PSH02-02P
PSH02-02W
PSH02-03P
PSH02-03W
PSH02-04P
PSH02-04W
PSH02-05P
PSH02-05W
PSH02-06P
PSH02-06W
PSH02-07P
PSH02-07W
PSH02-08P
PSH02-08W
PSH02-09P
PSH02-09W
$EndINDEX
$MODULE PSH02-02P
Po 0 0 0 15 4EA02474 00000000 ~~
Li PSH02-02P
Sc 00000000
AR PSH02-02P
Op 0 0 0
T0 0 -2000 472 472 0 79 N V 21 N "J*"
T1 0 2000 472 472 0 79 N I 21 N "Value"
DS 1130 -1500 1130 -1510 70 21
DS 1130 -1510 1190 -1570 70 21
DS 1130 -1500 1130 -1510 70 26
DS 1130 -1510 1190 -1570 70 26
DS 1130 -750 -1120 -750 70 21
DS 1130 -750 -1120 -750 70 26
DS -1120 -1500 1130 -1500 70 21
DS 1130 -1500 1130 1500 70 21
DS 1130 1500 -1120 1500 70 21
DS -1120 1500 -1120 -1500 70 21
DS -1120 -1500 1130 -1500 70 26
DS 1130 -1500 1130 1500 70 26
DS 1130 1500 -1120 1500 70 26
DS -1120 1500 -1120 -1500 70 26
$PAD
Sh "1" R 580 1180 0 0 0
Dr 380 0 0
At STD N 00E0FFFF
Ne 0 ""
Po -500 0
$EndPAD
$PAD
Sh "2" O 580 1180 0 0 0
Dr 380 0 0
At STD N 00E0FFFF
Ne 0 ""
Po 500 0
$EndPAD
$SHAPE3D
Na "Vlastni\\PSH02-02PG.wrl"
Sc 1.000000 1.000000 1.000000
Of 0.000000 0.000000 0.000000
Ro 0.000000 0.000000 0.000000
$EndSHAPE3D
$EndMODULE  PSH02-02P
$MODULE PSH02-02W
Po 0 0 0 15 4EA0204C 00000000 ~~
Li PSH02-02W
Sc 00000000
AR
Op 0 0 0
T0 500 -4750 472 472 0 79 N V 21 N "J*"
T1 500 1250 472 472 0 79 N I 21 N "Value"
DS 500 -1750 500 -4250 70 21
DS 500 -1750 500 -4250 70 26
DS -500 -1750 -500 -4250 70 21
DS -500 -1750 -500 -4250 70 26
DS 1050 -1700 1050 -700 70 21
DS 1050 -700 -1050 -700 70 21
DS -1050 -700 -1050 -1700 70 21
DS -1050 -1700 -500 -1700 70 21
DS -500 -1700 1050 -1700 70 21
DS 1050 -1700 1050 -700 70 26
DS 1050 -700 -1050 -700 70 26
DS -1050 -700 -1050 -1700 70 26
DS -1050 -1700 -500 -1700 70 26
DS -500 -1700 1050 -1700 70 26
$PAD
Sh "1" R 580 1180 0 0 0
Dr 380 0 0
At STD N 00E0FFFF
Ne 0 ""
Po -500 0
$EndPAD
$PAD
Sh "2" O 580 1180 0 0 0
Dr 380 0 0
At STD N 00E0FFFF
Ne 0 ""
Po 500 0
$EndPAD
$SHAPE3D
Na "Vlastni\\PSH02-02WG.wrl"
Sc 1.000000 1.000000 1.000000
Of 0.000000 0.000000 0.000000
Ro 0.000000 0.000000 0.000000
$EndSHAPE3D
$EndMODULE  PSH02-02W
$MODULE PSH02-03P
Po 0 0 0 15 4EA020A3 00000000 ~~
Li PSH02-03P
Sc 00000000
AR
Op 0 0 0
T0 0 -2000 472 472 0 79 N V 21 N "J*"
T1 0 2000 472 472 0 79 N I 21 N "Value"
DS 1630 -1500 1630 -1510 70 21
DS 1630 -1510 1690 -1570 70 21
DS 1630 -1500 1630 -1510 70 26
DS 1630 -1510 1690 -1570 70 26
DS 1630 -750 -1620 -750 70 21
DS 1630 -750 -1620 -750 70 26
DS 1630 1500 1630 -1500 70 21
DS 1630 -1500 -1620 -1500 70 21
DS -1620 -1500 -1620 1500 70 21
DS -1620 1500 1630 1500 70 21
DS 1630 1500 1630 -1500 70 26
DS 1630 -1500 -1620 -1500 70 26
DS -1620 -1500 -1620 1500 70 26
DS -1620 1500 1630 1500 70 26
$PAD
Sh "1" R 580 1180 0 0 0
Dr 380 0 0
At STD N 00E0FFFF
Ne 0 ""
Po -1000 0
$EndPAD
$PAD
Sh "2" O 580 1180 0 0 0
Dr 380 0 0
At STD N 00E0FFFF
Ne 0 ""
Po 0 0
$EndPAD
$PAD
Sh "3" O 580 1180 0 0 0
Dr 380 0 0
At STD N 00E0FFFF
Ne 0 ""
Po 1000 0
$EndPAD
$SHAPE3D
Na "Vlastni\\PSH02-03PG.wrl"
Sc 1.000000 1.000000 1.000000
Of 0.000000 0.000000 0.000000
Ro 0.000000 0.000000 0.000000
$EndSHAPE3D
$EndMODULE  PSH02-03P
$MODULE PSH02-03W
Po 0 0 0 15 4EA020BA 00000000 ~~
Li PSH02-03W
Sc 00000000
AR
Op 0 0 0
T0 0 -5000 472 472 0 79 N V 21 N "J*"
T1 0 1500 472 472 0 79 N I 21 N "Value"
DS 1000 -1750 1000 -4250 70 21
DS 1000 -1750 1000 -4250 70 26
DS -1000 -1750 -1000 -4250 70 21
DS -1000 -1750 -1000 -4250 70 26
DS 1550 -1700 1550 -700 70 21
DS 1550 -700 1550 -700 70 21
DS 1550 -700 -1550 -700 70 21
DS -1550 -700 -1550 -1700 70 21
DS -1550 -1700 -1000 -1700 70 21
DS -1000 -1700 1000 -1700 70 21
DS 1000 -1700 1550 -1700 70 21
DS 1550 -1700 1550 -700 70 26
DS 1550 -700 1550 -700 70 26
DS 1550 -700 -1550 -700 70 26
DS -1550 -700 -1550 -1700 70 26
DS -1550 -1700 -1000 -1700 70 26
DS -1000 -1700 1000 -1700 70 26
DS 1000 -1700 1550 -1700 70 26
$PAD
Sh "1" R 580 1180 0 0 0
Dr 380 0 0
At STD N 00E0FFFF
Ne 0 ""
Po -1000 0
$EndPAD
$PAD
Sh "2" O 580 1180 0 0 0
Dr 380 0 0
At STD N 00E0FFFF
Ne 0 ""
Po 0 0
$EndPAD
$PAD
Sh "3" O 580 1180 0 0 0
Dr 380 0 0
At STD N 00E0FFFF
Ne 0 ""
Po 1000 0
$EndPAD
$SHAPE3D
Na "Vlastni\\PSH02-03WG.wrl"
Sc 1.000000 1.000000 1.000000
Of 0.000000 0.000000 0.000000
Ro 0.000000 0.000000 0.000000
$EndSHAPE3D
$EndMODULE  PSH02-03W
$MODULE PSH02-04W
Po 0 0 0 15 4EA02117 00000000 ~~
Li PSH02-04W
Sc 00000000
AR
Op 0 0 0
T0 0 -5000 472 472 0 79 N V 21 N "J*"
T1 0 1500 472 472 0 79 N I 21 N "Value"
DS 1500 -1750 1500 -4250 70 21
DS 1500 -1750 1500 -4250 70 26
DS -1500 -1750 -1500 -4250 70 21
DS -1500 -1750 -1500 -4250 70 26
DS 2050 -1700 2050 -700 70 21
DS 2050 -700 2050 -700 70 21
DS 2050 -700 -2050 -700 70 21
DS -2050 -700 -2050 -1700 70 21
DS -2050 -1700 -1500 -1700 70 21
DS -1500 -1700 500 -1700 70 21
DS 500 -1700 2050 -1700 70 21
DS 2050 -1700 2050 -700 70 26
DS 2050 -700 2050 -700 70 26
DS 2050 -700 -2050 -700 70 26
DS -2050 -700 -2050 -1700 70 26
DS -2050 -1700 -1500 -1700 70 26
DS -1500 -1700 500 -1700 70 26
DS 500 -1700 2050 -1700 70 26
$PAD
Sh "1" R 580 1180 0 0 0
Dr 380 0 0
At STD N 00E0FFFF
Ne 0 ""
Po -1500 0
$EndPAD
$PAD
Sh "2" O 580 1180 0 0 0
Dr 380 0 0
At STD N 00E0FFFF
Ne 0 ""
Po -500 0
$EndPAD
$PAD
Sh "3" O 580 1180 0 0 0
Dr 380 0 0
At STD N 00E0FFFF
Ne 0 ""
Po 500 0
$EndPAD
$PAD
Sh "4" O 580 1180 0 0 0
Dr 380 0 0
At STD N 00E0FFFF
Ne 0 ""
Po 1500 0
$EndPAD
$SHAPE3D
Na "Vlastni\\PSH02-04WG.wrl"
Sc 1.000000 1.000000 1.000000
Of 0.000000 0.000000 0.000000
Ro 0.000000 0.000000 0.000000
$EndSHAPE3D
$EndMODULE  PSH02-04W
$MODULE PSH02-05W
Po 0 0 0 15 4EA02175 00000000 ~~
Li PSH02-05W
Sc 00000000
AR
Op 0 0 0
T0 0 -5000 472 472 0 79 N V 21 N "J*"
T1 0 1500 472 472 0 79 N I 21 N "Value"
DS 2000 -2000 2000 -4500 70 21
DS 2000 -2000 2000 -4500 70 26
DS 0 -2000 0 -4500 70 21
DS 0 -2000 0 -4500 70 26
DS -2000 -2000 -2000 -4500 70 21
DS -2000 -2000 -2000 -4500 70 26
DS 2550 -1950 2550 -950 70 21
DS 2550 -950 2550 -950 70 21
DS 2550 -950 -2550 -950 70 21
DS -2550 -950 -2550 -1950 70 21
DS -2550 -1950 -2000 -1950 70 21
DS -2000 -1950 0 -1950 70 21
DS 0 -1950 2000 -1950 70 21
DS 2000 -1950 2550 -1950 70 21
DS 2550 -1950 2550 -950 70 26
DS 2550 -950 2550 -950 70 26
DS 2550 -950 -2550 -950 70 26
DS -2550 -950 -2550 -1950 70 26
DS -2550 -1950 -2000 -1950 70 26
DS -2000 -1950 0 -1950 70 26
DS 0 -1950 2000 -1950 70 26
DS 2000 -1950 2550 -1950 70 26
$PAD
Sh "1" R 580 1180 0 0 0
Dr 380 0 0
At STD N 00E0FFFF
Ne 0 ""
Po -2000 0
$EndPAD
$PAD
Sh "2" O 580 1180 0 0 0
Dr 380 0 0
At STD N 00E0FFFF
Ne 0 ""
Po -1000 0
$EndPAD
$PAD
Sh "3" O 580 1180 0 0 0
Dr 380 0 0
At STD N 00E0FFFF
Ne 0 ""
Po 0 0
$EndPAD
$PAD
Sh "4" O 580 1180 0 0 0
Dr 380 0 0
At STD N 00E0FFFF
Ne 0 ""
Po 1000 0
$EndPAD
$PAD
Sh "5" O 580 1180 0 0 0
Dr 380 0 0
At STD N 00E0FFFF
Ne 0 ""
Po 2000 0
$EndPAD
$SHAPE3D
Na "Vlastni\\PSH02-05WG.wrl"
Sc 1.000000 1.000000 1.000000
Of 0.000000 0.000000 0.000000
Ro 0.000000 0.000000 0.000000
$EndSHAPE3D
$EndMODULE  PSH02-05W
$MODULE PSH02-06W
Po 0 0 0 15 4EA021EE 00000000 ~~
Li PSH02-06W
Sc 00000000
AR
Op 0 0 0
T0 0 -5000 472 472 0 79 N V 21 N "J*"
T1 0 1500 472 472 0 79 N I 21 N "Value"
DS 2500 -1750 2500 -4250 70 21
DS 2500 -1750 2500 -4250 70 26
DS 500 -1750 500 -4250 70 21
DS 500 -1750 500 -4250 70 26
DS -500 -1750 -500 -4250 70 21
DS -500 -1750 -500 -4250 70 26
DS -2500 -1750 -2500 -4250 70 21
DS -2500 -1750 -2500 -4250 70 26
DS 3050 -1700 3050 -700 70 21
DS 3050 -700 3050 -700 70 21
DS 3050 -700 -3050 -700 70 21
DS -3050 -700 -3050 -1700 70 21
DS -3050 -1700 -2500 -1700 70 21
DS -2500 -1700 -500 -1700 70 21
DS -500 -1700 1500 -1700 70 21
DS 1500 -1700 3050 -1700 70 21
DS 3050 -1700 3050 -700 70 26
DS 3050 -700 3050 -700 70 26
DS 3050 -700 -3050 -700 70 26
DS -3050 -700 -3050 -1700 70 26
DS -3050 -1700 -2500 -1700 70 26
DS -2500 -1700 -500 -1700 70 26
DS -500 -1700 1500 -1700 70 26
DS 1500 -1700 3050 -1700 70 26
$PAD
Sh "1" R 580 1180 0 0 0
Dr 380 0 0
At STD N 00E0FFFF
Ne 0 ""
Po -2500 0
$EndPAD
$PAD
Sh "2" O 580 1180 0 0 0
Dr 380 0 0
At STD N 00E0FFFF
Ne 0 ""
Po -1500 0
$EndPAD
$PAD
Sh "3" O 580 1180 0 0 0
Dr 380 0 0
At STD N 00E0FFFF
Ne 0 ""
Po -500 0
$EndPAD
$PAD
Sh "4" O 580 1180 0 0 0
Dr 380 0 0
At STD N 00E0FFFF
Ne 0 ""
Po 500 0
$EndPAD
$PAD
Sh "5" O 580 1180 0 0 0
Dr 380 0 0
At STD N 00E0FFFF
Ne 0 ""
Po 1500 0
$EndPAD
$PAD
Sh "6" O 580 1180 0 0 0
Dr 380 0 0
At STD N 00E0FFFF
Ne 0 ""
Po 2500 0
$EndPAD
$SHAPE3D
Na "Vlastni\\PSH02-06WG.wrl"
Sc 1.000000 1.000000 1.000000
Of 0.000000 0.000000 0.000000
Ro 0.000000 0.000000 0.000000
$EndSHAPE3D
$EndMODULE  PSH02-06W
$MODULE PSH02-07W
Po 0 0 0 15 4EA0225A 00000000 ~~
Li PSH02-07W
Sc 00000000
AR
Op 0 0 0
T0 0 -5000 472 472 0 79 N V 21 N "J*"
T1 0 1500 472 472 0 79 N I 21 N "Value"
DS 3000 -1750 3000 -4250 70 26
DS 3000 -1750 3000 -4250 70 21
DS -3000 -1750 -3000 -4250 70 21
DS -3000 -1750 -3000 -4250 70 26
DS 3550 -1700 3550 -700 70 21
DS 3550 -700 3550 -700 70 21
DS 3550 -700 -3550 -700 70 21
DS -3550 -700 -3550 -1700 70 21
DS -3550 -1700 -3000 -1700 70 21
DS -3000 -1700 -1000 -1700 70 21
DS -1000 -1700 1000 -1700 70 21
DS 1000 -1700 3000 -1700 70 21
DS 3000 -1700 3550 -1700 70 21
DS 3550 -1700 3550 -700 70 26
DS 3550 -700 3550 -700 70 26
DS 3550 -700 -3550 -700 70 26
DS -3550 -700 -3550 -1700 70 26
DS -3550 -1700 -3000 -1700 70 26
DS -3000 -1700 -1000 -1700 70 26
DS -1000 -1700 1000 -1700 70 26
DS 1000 -1700 3000 -1700 70 26
DS 3000 -1700 3550 -1700 70 26
DS 1000 -1750 1000 -4250 70 21
DS 1000 -1750 1000 -4250 70 26
DS -1000 -1750 -1000 -4250 70 21
DS -1000 -1750 -1000 -4250 70 26
$PAD
Sh "1" R 580 1180 0 0 0
Dr 380 0 0
At STD N 00E0FFFF
Ne 0 ""
Po -3000 0
$EndPAD
$PAD
Sh "2" O 580 1180 0 0 0
Dr 380 0 0
At STD N 00E0FFFF
Ne 0 ""
Po -2000 0
$EndPAD
$PAD
Sh "3" O 580 1180 0 0 0
Dr 380 0 0
At STD N 00E0FFFF
Ne 0 ""
Po -1000 0
$EndPAD
$PAD
Sh "4" O 580 1180 0 0 0
Dr 380 0 0
At STD N 00E0FFFF
Ne 0 ""
Po 0 0
$EndPAD
$PAD
Sh "5" O 580 1180 0 0 0
Dr 380 0 0
At STD N 00E0FFFF
Ne 0 ""
Po 1000 0
$EndPAD
$PAD
Sh "6" O 580 1180 0 0 0
Dr 380 0 0
At STD N 00E0FFFF
Ne 0 ""
Po 2000 0
$EndPAD
$PAD
Sh "7" O 580 1180 0 0 0
Dr 380 0 0
At STD N 00E0FFFF
Ne 0 ""
Po 3000 0
$EndPAD
$SHAPE3D
Na "Vlastni\\PSH02-07WG.wrl"
Sc 1.000000 1.000000 1.000000
Of 0.000000 0.000000 0.000000
Ro 0.000000 0.000000 0.000000
$EndSHAPE3D
$EndMODULE  PSH02-07W
$MODULE PSH02-08W
Po 0 0 0 15 4EA022B5 00000000 ~~
Li PSH02-08W
Sc 00000000
AR
Op 0 0 0
T0 0 -5000 472 472 0 79 N V 21 N "J*"
T1 0 1500 472 472 0 79 N I 21 N "Value"
DS 3500 -1750 3500 -4250 70 21
DS 3500 -1750 3500 -4250 70 26
DS 1500 -1750 1500 -4250 70 21
DS 1500 -1750 1500 -4250 70 26
DS -1500 -1750 -1500 -4250 70 21
DS -1500 -1750 -1500 -4250 70 26
DS -3500 -1750 -3500 -4250 70 21
DS -3500 -1750 -3500 -4250 70 26
DS 4050 -1700 4050 -700 70 21
DS 4050 -700 4050 -700 70 21
DS 4050 -700 -4050 -700 70 21
DS -4050 -700 -4050 -1700 70 21
DS -4050 -1700 -3500 -1700 70 21
DS -3500 -1700 -1500 -1700 70 21
DS -1500 -1700 500 -1700 70 21
DS 500 -1700 2500 -1700 70 21
DS 2500 -1700 4050 -1700 70 21
DS 4050 -1700 4050 -700 70 26
DS 4050 -700 4050 -700 70 26
DS 4050 -700 -4050 -700 70 26
DS -4050 -700 -4050 -1700 70 26
DS -4050 -1700 -3500 -1700 70 26
DS -3500 -1700 -1500 -1700 70 26
DS -1500 -1700 500 -1700 70 26
DS 500 -1700 2500 -1700 70 26
DS 2500 -1700 4050 -1700 70 26
$PAD
Sh "1" R 580 1180 0 0 0
Dr 380 0 0
At STD N 00E0FFFF
Ne 0 ""
Po -3500 0
$EndPAD
$PAD
Sh "2" O 580 1180 0 0 0
Dr 380 0 0
At STD N 00E0FFFF
Ne 0 ""
Po -2500 0
$EndPAD
$PAD
Sh "3" O 580 1180 0 0 0
Dr 380 0 0
At STD N 00E0FFFF
Ne 0 ""
Po -1500 0
$EndPAD
$PAD
Sh "4" O 580 1180 0 0 0
Dr 380 0 0
At STD N 00E0FFFF
Ne 0 ""
Po -500 0
$EndPAD
$PAD
Sh "5" O 580 1180 0 0 0
Dr 380 0 0
At STD N 00E0FFFF
Ne 0 ""
Po 500 0
$EndPAD
$PAD
Sh "6" O 580 1180 0 0 0
Dr 380 0 0
At STD N 00E0FFFF
Ne 0 ""
Po 1500 0
$EndPAD
$PAD
Sh "7" O 580 1180 0 0 0
Dr 380 0 0
At STD N 00E0FFFF
Ne 0 ""
Po 2500 0
$EndPAD
$PAD
Sh "8" O 580 1180 0 0 0
Dr 380 0 0
At STD N 00E0FFFF
Ne 0 ""
Po 3500 0
$EndPAD
$SHAPE3D
Na "Vlastni\\PSH02-08WG.wrl"
Sc 1.000000 1.000000 1.000000
Of 0.000000 0.000000 0.000000
Ro 0.000000 0.000000 0.000000
$EndSHAPE3D
$EndMODULE  PSH02-08W
$MODULE PSH02-09W
Po 0 0 0 15 4EA02314 00000000 ~~
Li PSH02-09W
Sc 00000000
AR
Op 0 0 0
T0 0 -5000 472 472 0 79 N V 21 N "J*"
T1 0 1500 472 472 0 79 N I 21 N "Value"
DS 4000 -1750 4000 -4250 70 21
DS 4000 -1750 4000 -4250 70 26
DS 2000 -1750 2000 -4250 70 21
DS 2000 -1750 2000 -4250 70 26
DS 0 -4250 0 -1750 70 21
DS 0 -4250 0 -1750 70 26
DS -2000 -1750 -2000 -4250 70 21
DS -2000 -1750 -2000 -4250 70 26
DS -4000 -1750 -4000 -4250 70 21
DS -4000 -1750 -4000 -4250 70 26
DS 4550 -1700 4550 -700 70 21
DS 4550 -700 4550 -700 70 21
DS 4550 -700 -4550 -700 70 21
DS -4550 -700 -4550 -1700 70 21
DS -4550 -1700 -4000 -1700 70 21
DS -4000 -1700 -2000 -1700 70 21
DS -2000 -1700 0 -1700 70 21
DS 0 -1700 2000 -1700 70 21
DS 2000 -1700 3950 -1700 70 21
DS 3950 -1700 4550 -1700 70 21
DS 4550 -1700 4550 -700 70 26
DS 4550 -700 4550 -700 70 26
DS 4550 -700 -4550 -700 70 26
DS -4550 -700 -4550 -1700 70 26
DS -4550 -1700 -4000 -1700 70 26
DS -4000 -1700 -2000 -1700 70 26
DS -2000 -1700 0 -1700 70 26
DS 0 -1700 2000 -1700 70 26
DS 2000 -1700 3950 -1700 70 26
DS 3950 -1700 4550 -1700 70 26
$PAD
Sh "1" R 580 1180 0 0 0
Dr 380 0 0
At STD N 00E0FFFF
Ne 0 ""
Po -4000 0
$EndPAD
$PAD
Sh "2" O 580 1180 0 0 0
Dr 380 0 0
At STD N 00E0FFFF
Ne 0 ""
Po -3000 0
$EndPAD
$PAD
Sh "3" O 580 1180 0 0 0
Dr 380 0 0
At STD N 00E0FFFF
Ne 0 ""
Po -2000 0
$EndPAD
$PAD
Sh "4" O 580 1180 0 0 0
Dr 380 0 0
At STD N 00E0FFFF
Ne 0 ""
Po -1000 0
$EndPAD
$PAD
Sh "5" O 580 1180 0 0 0
Dr 380 0 0
At STD N 00E0FFFF
Ne 0 ""
Po 0 0
$EndPAD
$PAD
Sh "6" O 580 1180 0 0 0
Dr 380 0 0
At STD N 00E0FFFF
Ne 0 ""
Po 1000 0
$EndPAD
$PAD
Sh "7" O 580 1180 0 0 0
Dr 380 0 0
At STD N 00E0FFFF
Ne 0 ""
Po 2000 0
$EndPAD
$PAD
Sh "8" O 580 1180 0 0 0
Dr 380 0 0
At STD N 00E0FFFF
Ne 0 ""
Po 3000 0
$EndPAD
$PAD
Sh "9" O 580 1180 0 0 0
Dr 380 0 0
At STD N 00E0FFFF
Ne 0 ""
Po 4000 0
$EndPAD
$SHAPE3D
Na "Vlastni\\PSH02-09WG.wrl"
Sc 1.000000 1.000000 1.000000
Of 0.000000 0.000000 0.000000
Ro 0.000000 0.000000 0.000000
$EndSHAPE3D
$EndMODULE  PSH02-09W
$MODULE PSH02-04P
Po 0 0 0 15 4EA020FC 00000000 ~~
Li PSH02-04P
Sc 00000000
AR
Op 0 0 0
T0 0 -2000 472 472 0 79 N V 21 N "J*"
T1 0 2000 472 472 0 79 N I 21 N "Value"
DS 2130 -1500 2130 -1510 70 21
DS 2130 -1510 2190 -1570 70 21
DS 2130 -1500 2130 -1510 70 26
DS 2130 -1510 2190 -1570 70 26
DS 2130 -750 -2120 -750 70 21
DS 2130 -750 -2120 -750 70 26
DS 2130 1500 2130 -1500 70 21
DS 2130 -1500 -2120 -1500 70 21
DS -2120 -1500 -2120 1500 70 21
DS -2120 1500 2130 1500 70 21
DS 2130 1500 2130 -1500 70 26
DS 2130 -1500 -2120 -1500 70 26
DS -2120 -1500 -2120 1500 70 26
DS -2120 1500 2130 1500 70 26
$PAD
Sh "1" R 580 1180 0 0 0
Dr 380 0 0
At STD N 00E0FFFF
Ne 0 ""
Po -1500 0
$EndPAD
$PAD
Sh "2" O 580 1180 0 0 0
Dr 380 0 0
At STD N 00E0FFFF
Ne 0 ""
Po -500 0
$EndPAD
$PAD
Sh "3" O 580 1180 0 0 0
Dr 380 0 0
At STD N 00E0FFFF
Ne 0 ""
Po 500 0
$EndPAD
$PAD
Sh "4" O 580 1180 0 0 0
Dr 380 0 0
At STD N 00E0FFFF
Ne 0 ""
Po 1500 0
$EndPAD
$SHAPE3D
Na "Vlastni\\PSH02-04PG.wrl"
Sc 1.000000 1.000000 1.000000
Of 0.000000 0.000000 0.000000
Ro 0.000000 0.000000 0.000000
$EndSHAPE3D
$EndMODULE  PSH02-04P
$MODULE PSH02-05P
Po 0 0 0 15 4EA02159 00000000 ~~
Li PSH02-05P
Sc 00000000
AR
Op 0 0 0
T0 0 -2000 472 472 0 79 N V 21 N "J1"
T1 0 2000 472 472 0 79 N I 21 N "Value"
DS 2630 -1500 2630 -1510 70 21
DS 2630 -1510 2690 -1570 70 21
DS 2630 -1500 2630 -1510 70 26
DS 2630 -1510 2690 -1570 70 26
DS 2630 -750 -2620 -750 70 21
DS 2630 -750 -2620 -750 70 26
DS 2630 1500 2630 -1500 70 21
DS 2630 -1500 -2620 -1500 70 21
DS -2620 -1500 -2620 1500 70 21
DS -2620 1500 2630 1500 70 21
DS 2630 1500 2630 -1500 70 26
DS 2630 -1500 -2620 -1500 70 26
DS -2620 -1500 -2620 1500 70 26
DS -2620 1500 2630 1500 70 26
$PAD
Sh "1" R 580 1180 0 0 0
Dr 380 0 0
At STD N 00E0FFFF
Ne 0 ""
Po -2000 0
$EndPAD
$PAD
Sh "2" O 580 1180 0 0 0
Dr 380 0 0
At STD N 00E0FFFF
Ne 0 ""
Po -1000 0
$EndPAD
$PAD
Sh "3" O 580 1180 0 0 0
Dr 380 0 0
At STD N 00E0FFFF
Ne 0 ""
Po 0 0
$EndPAD
$PAD
Sh "4" O 580 1180 0 0 0
Dr 380 0 0
At STD N 00E0FFFF
Ne 0 ""
Po 1000 0
$EndPAD
$PAD
Sh "5" O 580 1180 0 0 0
Dr 380 0 0
At STD N 00E0FFFF
Ne 0 ""
Po 2000 0
$EndPAD
$SHAPE3D
Na "Vlastni\\PSH02-05PG.wrl"
Sc 1.000000 1.000000 1.000000
Of 0.000000 0.000000 0.000000
Ro 0.000000 0.000000 0.000000
$EndSHAPE3D
$EndMODULE  PSH02-05P
$MODULE PSH02-06P
Po 0 0 0 15 4EA021B8 00000000 ~~
Li PSH02-06P
Sc 00000000
AR
Op 0 0 0
T0 0 -2000 472 472 0 79 N V 21 N "J*"
T1 0 2000 472 472 0 79 N I 21 N "Value"
DS 3130 -1500 3130 -1510 70 21
DS 3130 -1510 3190 -1570 70 21
DS 3130 -1500 3130 -1510 70 26
DS 3130 -1510 3190 -1570 70 26
DS 3130 -750 -3120 -750 70 21
DS 3130 -750 -3120 -750 70 26
DS 3130 1500 3130 -1500 70 21
DS 3130 -1500 -3120 -1500 70 21
DS -3120 -1500 -3120 1500 70 21
DS -3120 1500 3130 1500 70 21
DS 3130 1500 3130 -1500 70 26
DS 3130 -1500 -3120 -1500 70 26
DS -3120 -1500 -3120 1500 70 26
DS -3120 1500 3130 1500 70 26
$PAD
Sh "1" R 580 1180 0 0 0
Dr 380 0 0
At STD N 00E0FFFF
Ne 0 ""
Po -2500 0
$EndPAD
$PAD
Sh "2" O 580 1180 0 0 0
Dr 380 0 0
At STD N 00E0FFFF
Ne 0 ""
Po -1500 0
$EndPAD
$PAD
Sh "3" O 580 1180 0 0 0
Dr 380 0 0
At STD N 00E0FFFF
Ne 0 ""
Po -500 0
$EndPAD
$PAD
Sh "4" O 580 1180 0 0 0
Dr 380 0 0
At STD N 00E0FFFF
Ne 0 ""
Po 500 0
$EndPAD
$PAD
Sh "5" O 580 1180 0 0 0
Dr 380 0 0
At STD N 00E0FFFF
Ne 0 ""
Po 1500 0
$EndPAD
$PAD
Sh "6" O 580 1180 0 0 0
Dr 380 0 0
At STD N 00E0FFFF
Ne 0 ""
Po 2500 0
$EndPAD
$SHAPE3D
Na "Vlastni\\PSH02-06PG.wrl"
Sc 1.000000 1.000000 1.000000
Of 0.000000 0.000000 0.000000
Ro 0.000000 0.000000 0.000000
$EndSHAPE3D
$EndMODULE  PSH02-06P
$MODULE PSH02-07P
Po 0 0 0 15 4EA0222F 00000000 ~~
Li PSH02-07P
Sc 00000000
AR
Op 0 0 0
T0 0 -2000 472 472 0 79 N V 21 N "J*"
T1 0 2000 472 472 0 79 N I 21 N "Value"
DS 3630 -1500 3630 -1510 70 21
DS 3630 -1510 3690 -1570 70 21
DS 3630 -1500 3630 -1510 70 26
DS 3630 -1510 3690 -1570 70 26
DS 3630 -750 -3620 -750 70 21
DS 3630 -750 -3620 -750 70 26
DS 3630 1500 3630 -1500 70 21
DS 3630 -1500 -3620 -1500 70 21
DS -3620 -1500 -3620 1500 70 21
DS -3620 1500 3630 1500 70 21
DS 3630 1500 3630 -1500 70 26
DS 3630 -1500 -3620 -1500 70 26
DS -3620 -1500 -3620 1500 70 26
DS -3620 1500 3630 1500 70 26
$PAD
Sh "1" R 580 1180 0 0 0
Dr 380 0 0
At STD N 00E0FFFF
Ne 0 ""
Po -3000 0
$EndPAD
$PAD
Sh "2" O 580 1180 0 0 0
Dr 380 0 0
At STD N 00E0FFFF
Ne 0 ""
Po -2000 0
$EndPAD
$PAD
Sh "3" O 580 1180 0 0 0
Dr 380 0 0
At STD N 00E0FFFF
Ne 0 ""
Po -1000 0
$EndPAD
$PAD
Sh "4" O 580 1180 0 0 0
Dr 380 0 0
At STD N 00E0FFFF
Ne 0 ""
Po 0 0
$EndPAD
$PAD
Sh "5" O 580 1180 0 0 0
Dr 380 0 0
At STD N 00E0FFFF
Ne 0 ""
Po 1000 0
$EndPAD
$PAD
Sh "6" O 580 1180 0 0 0
Dr 380 0 0
At STD N 00E0FFFF
Ne 0 ""
Po 2000 0
$EndPAD
$PAD
Sh "7" O 580 1180 0 0 0
Dr 380 0 0
At STD N 00E0FFFF
Ne 0 ""
Po 3000 0
$EndPAD
$SHAPE3D
Na "Vlastni\\PSH02-07PG.wrl"
Sc 1.000000 1.000000 1.000000
Of 0.000000 0.000000 0.000000
Ro 0.000000 0.000000 0.000000
$EndSHAPE3D
$EndMODULE  PSH02-07P
$MODULE PSH02-08P
Po 0 0 0 15 4EA02295 00000000 ~~
Li PSH02-08P
Sc 00000000
AR
Op 0 0 0
T0 0 -2000 472 472 0 79 N V 21 N "J*"
T1 0 2000 472 472 0 79 N I 21 N "Value"
DS 4130 -750 -4120 -750 70 26
DS 4130 1500 4130 -1500 70 21
DS 4130 -1500 -4120 -1500 70 21
DS -4120 -1500 -4120 1500 70 21
DS -4120 1500 4130 1500 70 21
DS 4130 1500 4130 -1500 70 26
DS 4130 -1500 -4120 -1500 70 26
DS -4120 -1500 -4120 1500 70 26
DS -4120 1500 4130 1500 70 26
DS 4130 -1500 4130 -1510 70 26
DS 4130 -1510 4190 -1570 70 26
DS 4130 -750 -4120 -750 70 21
DS 4130 -1500 4130 -1510 70 21
DS 4130 -1510 4190 -1570 70 21
$PAD
Sh "1" R 580 1180 0 0 0
Dr 380 0 0
At STD N 00E0FFFF
Ne 0 ""
Po -3500 0
$EndPAD
$PAD
Sh "2" O 580 1180 0 0 0
Dr 380 0 0
At STD N 00E0FFFF
Ne 0 ""
Po -2500 0
$EndPAD
$PAD
Sh "3" O 580 1180 0 0 0
Dr 380 0 0
At STD N 00E0FFFF
Ne 0 ""
Po -1500 0
$EndPAD
$PAD
Sh "4" O 580 1180 0 0 0
Dr 380 0 0
At STD N 00E0FFFF
Ne 0 ""
Po -500 0
$EndPAD
$PAD
Sh "5" O 580 1180 0 0 0
Dr 380 0 0
At STD N 00E0FFFF
Ne 0 ""
Po 500 0
$EndPAD
$PAD
Sh "6" O 580 1180 0 0 0
Dr 380 0 0
At STD N 00E0FFFF
Ne 0 ""
Po 1500 0
$EndPAD
$PAD
Sh "7" O 580 1180 0 0 0
Dr 380 0 0
At STD N 00E0FFFF
Ne 0 ""
Po 2500 0
$EndPAD
$PAD
Sh "8" O 580 1180 0 0 0
Dr 380 0 0
At STD N 00E0FFFF
Ne 0 ""
Po 3500 0
$EndPAD
$SHAPE3D
Na "Vlastni\\PSH02-08PG.wrl"
Sc 1.000000 1.000000 1.000000
Of 0.000000 0.000000 0.000000
Ro 0.000000 0.000000 0.000000
$EndSHAPE3D
$EndMODULE  PSH02-08P
$MODULE PSH02-09P
Po 0 0 0 15 4EA022E5 00000000 ~~
Li PSH02-09P
Sc 00000000
AR 
Op 0 0 0
T0 0 -2000 472 472 0 79 N V 21 N "J*"
T1 0 2000 472 472 0 79 N I 21 N "Value"
DS 4630 -1500 4630 -1510 70 26
DS 4630 -1510 4690 -1570 70 26
DS 4630 -750 -4620 -750 70 21
DS 4630 -750 -4620 -750 70 26
DS 4630 1500 4630 -1500 70 21
DS 4630 -1500 -4620 -1500 70 21
DS -4620 -1500 -4620 1500 70 21
DS -4620 1500 4630 1500 70 21
DS 4630 1500 4630 -1500 70 26
DS 4630 -1500 -4620 -1500 70 26
DS -4620 -1500 -4620 1500 70 26
DS -4620 1500 4630 1500 70 26
DS 4630 -1500 4630 -1510 70 21
DS 4630 -1510 4690 -1570 70 21
$PAD
Sh "1" R 580 1180 0 0 0
Dr 380 0 0
At STD N 00E0FFFF
Ne 0 ""
Po -4000 0
$EndPAD
$PAD
Sh "2" O 580 1180 0 0 0
Dr 380 0 0
At STD N 00E0FFFF
Ne 0 ""
Po -3000 0
$EndPAD
$PAD
Sh "3" O 580 1180 0 0 0
Dr 380 0 0
At STD N 00E0FFFF
Ne 0 ""
Po -2000 0
$EndPAD
$PAD
Sh "4" O 580 1180 0 0 0
Dr 380 0 0
At STD N 00E0FFFF
Ne 0 ""
Po -1000 0
$EndPAD
$PAD
Sh "5" O 580 1180 0 0 0
Dr 380 0 0
At STD N 00E0FFFF
Ne 0 ""
Po 0 0
$EndPAD
$PAD
Sh "6" O 580 1180 0 0 0
Dr 380 0 0
At STD N 00E0FFFF
Ne 0 ""
Po 1000 0
$EndPAD
$PAD
Sh "7" O 580 1180 0 0 0
Dr 380 0 0
At STD N 00E0FFFF
Ne 0 ""
Po 2000 0
$EndPAD
$PAD
Sh "8" O 580 1180 0 0 0
Dr 380 0 0
At STD N 00E0FFFF
Ne 0 ""
Po 3000 0
$EndPAD
$PAD
Sh "9" O 580 1180 0 0 0
Dr 380 0 0
At STD N 00E0FFFF
Ne 0 ""
Po 4000 0
$EndPAD
$SHAPE3D
Na "Vlastni\\PSH02-09PG.wrl"
Sc 1.000000 1.000000 1.000000
Of 0.000000 0.000000 0.000000
Ro 0.000000 0.000000 0.000000
$EndSHAPE3D
$EndMODULE  PSH02-09P
$EndLIBRARY
