PCBNEW-LibModule-V1  Út 26. červen 2012, 23:07:07 CEST
# encoding utf-8
Units deci-mils
$INDEX
Lista10
Lista2
Lista3
Lista4
Lista5
Lista6
Lista7
Lista8
Lista9
$EndINDEX
$MODULE Lista10
Po 0 0 0 15 4FEA2479 00000000 ~~
Li Lista10
Sc 0
AR 
Op 0 0 0
T0 0 -1000 392 392 0 77 N V 21 N "Lista10"
T1 0 1000 392 392 0 77 N I 21 N "Value"
DS -5100 600 5000 600 150 21
DS 5000 600 5000 -600 150 21
DS 5000 -600 -5100 -600 150 21
DS -5100 -600 -5100 600 150 21
DS -5000 -600 -5000 600 150 21
T2 -5400 0 393 393 0 78 N V 21 N "1"
$PAD
Sh "1" R 590 825 0 0 0
Dr 392 0 0
At STD N 00E0FFFF
Ne 0 ""
Po -4500 0
$EndPAD
$PAD
Sh "2" O 590 825 0 0 0
Dr 392 0 0
At STD N 00E0FFFF
Ne 0 ""
Po -3500 0
$EndPAD
$PAD
Sh "3" O 590 825 0 0 0
Dr 392 0 0
At STD N 00E0FFFF
Ne 0 ""
Po -2500 0
$EndPAD
$PAD
Sh "4" O 590 825 0 0 0
Dr 392 0 0
At STD N 00E0FFFF
Ne 0 ""
Po -1500 0
$EndPAD
$PAD
Sh "5" O 590 825 0 0 0
Dr 392 0 0
At STD N 00E0FFFF
Ne 0 ""
Po -500 0
$EndPAD
$PAD
Sh "6" O 590 825 0 0 0
Dr 392 0 0
At STD N 00E0FFFF
Ne 0 ""
Po 500 0
$EndPAD
$PAD
Sh "7" O 590 825 0 0 0
Dr 392 0 0
At STD N 00E0FFFF
Ne 0 ""
Po 1500 0
$EndPAD
$PAD
Sh "8" O 590 825 0 0 0
Dr 392 0 0
At STD N 00E0FFFF
Ne 0 ""
Po 2500 0
$EndPAD
$PAD
Sh "9" O 590 825 0 0 0
Dr 392 0 0
At STD N 00E0FFFF
Ne 0 ""
Po 3500 0
$EndPAD
$PAD
Sh "10" O 590 825 0 0 0
Dr 392 0 0
At STD N 00E0FFFF
Ne 0 ""
Po 4500 0
$EndPAD
$SHAPE3D
Na "walter/pin_strip/pin_strip_10.wrl"
Sc 1 1 1
Of 0 0 0
Ro 0 0 0
$EndSHAPE3D
$EndMODULE Lista10
$MODULE Lista2
Po 0 0 0 15 4FEA2401 00000000 ~~
Li Lista2
Sc 0
AR 
Op 0 0 0
T0 0 -1000 393 393 0 78 N V 21 N "Lista2"
T1 0 1100 392 392 0 77 N I 21 N "Value"
DS -1000 -600 -1000 600 150 21
DS -1100 -600 1100 -600 150 21
DS 1100 -600 1100 600 150 21
DS 1100 600 -1100 600 150 21
DS -1100 600 -1100 -600 150 21
T2 -1400 0 393 393 0 78 N V 21 N "1"
$PAD
Sh "1" R 590 825 0 0 0
Dr 392 0 0
At STD N 00E0FFFF
Ne 0 ""
Po -500 0
$EndPAD
$PAD
Sh "2" O 590 825 0 0 0
Dr 392 0 0
At STD N 00E0FFFF
Ne 0 ""
Po 500 0
$EndPAD
$SHAPE3D
Na "walter/pin_strip/pin_strip_2.wrl"
Sc 1 1 1
Of 0 0 0
Ro 0 0 0
$EndSHAPE3D
$EndMODULE Lista2
$MODULE Lista3
Po 0 0 0 15 4FEA2417 00000000 ~~
Li Lista3
Sc 0
AR 
Op 0 0 0
T0 0 -1000 392 392 0 77 N V 21 N "Lista3"
T1 0 1100 392 392 0 77 N I 21 N "Value"
DS -1500 -600 -1500 600 150 21
DS -1600 600 1500 600 150 21
DS 1500 600 1500 -600 150 21
DS 1500 -600 -1600 -600 150 21
DS -1600 600 -1600 -600 150 21
T2 -1900 0 393 393 0 78 N V 21 N "1"
$PAD
Sh "1" R 590 825 0 0 0
Dr 392 0 0
At STD N 00E0FFFF
Ne 0 ""
Po -1000 0
$EndPAD
$PAD
Sh "2" O 590 825 0 0 0
Dr 392 0 0
At STD N 00E0FFFF
Ne 0 ""
Po 0 0
$EndPAD
$PAD
Sh "3" O 590 825 0 0 0
Dr 392 0 0
At STD N 00E0FFFF
Ne 0 ""
Po 1000 0
$EndPAD
$SHAPE3D
Na "walter/pin_strip/pin_strip_3.wrl"
Sc 1 1 1
Of 0 0 0
Ro 0 0 0
$EndSHAPE3D
$EndMODULE Lista3
$MODULE Lista4
Po 0 0 0 15 4FEA2424 00000000 ~~
Li Lista4
Sc 0
AR 
Op 0 0 0
T0 0 -1000 392 392 0 77 N V 21 N "Lista4"
T1 0 1000 392 392 0 77 N I 21 N "Value"
DS -2000 600 -2000 -600 150 21
DS -2100 -600 2000 -600 150 21
DS 2000 -600 2000 600 150 21
DS 2000 600 -2100 600 150 21
DS -2100 600 -2100 -600 150 21
T2 -2400 0 393 393 0 78 N V 21 N "1"
$PAD
Sh "1" R 590 825 0 0 0
Dr 392 0 0
At STD N 00E0FFFF
Ne 0 ""
Po -1500 0
$EndPAD
$PAD
Sh "2" O 590 825 0 0 0
Dr 392 0 0
At STD N 00E0FFFF
Ne 0 ""
Po -500 0
$EndPAD
$PAD
Sh "3" O 590 825 0 0 0
Dr 392 0 0
At STD N 00E0FFFF
Ne 0 ""
Po 500 0
$EndPAD
$PAD
Sh "4" O 590 825 0 0 0
Dr 392 0 0
At STD N 00E0FFFF
Ne 0 ""
Po 1500 0
$EndPAD
$SHAPE3D
Na "walter/pin_strip/pin_strip_4.wrl"
Sc 1 1 1
Of 0 0 0
Ro 0 0 0
$EndSHAPE3D
$EndMODULE Lista4
$MODULE Lista5
Po 0 0 0 15 4FEA2433 00000000 ~~
Li Lista5
Sc 0
AR 
Op 0 0 0
T0 0 -1000 392 392 0 77 N V 21 N "Lista5"
T1 0 1000 392 392 0 77 N I 21 N "Value"
DS 2500 -600 -2600 -600 150 21
DS -2600 -600 -2600 600 150 21
DS -2600 600 2500 600 150 21
DS -2500 -600 -2500 600 150 21
DS 2500 600 2500 -600 150 21
T2 -2900 0 393 393 0 78 N V 21 N "1"
$PAD
Sh "1" R 590 825 0 0 0
Dr 392 0 0
At STD N 00E0FFFF
Ne 0 ""
Po -2000 0
$EndPAD
$PAD
Sh "2" O 590 825 0 0 0
Dr 392 0 0
At STD N 00E0FFFF
Ne 0 ""
Po -1000 0
$EndPAD
$PAD
Sh "3" O 590 825 0 0 0
Dr 392 0 0
At STD N 00E0FFFF
Ne 0 ""
Po 0 0
$EndPAD
$PAD
Sh "4" O 590 825 0 0 0
Dr 392 0 0
At STD N 00E0FFFF
Ne 0 ""
Po 1000 0
$EndPAD
$PAD
Sh "5" O 590 825 0 0 0
Dr 392 0 0
At STD N 00E0FFFF
Ne 0 ""
Po 2000 0
$EndPAD
$SHAPE3D
Na "walter/pin_strip/pin_strip_5.wrl"
Sc 1 1 1
Of 0 0 0
Ro 0 0 0
$EndSHAPE3D
$EndMODULE Lista5
$MODULE Lista6
Po 0 0 0 15 4FEA2445 00000000 ~~
Li Lista6
Sc 0
AR 
Op 0 0 0
T0 0 -1000 392 392 0 77 N V 21 N "Lista6"
T1 0 1000 392 392 0 77 N I 21 N "Value"
DS -3100 -600 3000 -600 150 21
DS 3000 -600 3000 600 150 21
DS 3000 600 -3100 600 150 21
DS -3100 -600 -3100 600 150 21
DS -3000 -600 -3000 600 150 21
T2 -3400 0 393 393 0 78 N V 21 N "1"
$PAD
Sh "1" R 590 825 0 0 0
Dr 392 0 0
At STD N 00E0FFFF
Ne 0 ""
Po -2500 0
$EndPAD
$PAD
Sh "2" O 590 825 0 0 0
Dr 392 0 0
At STD N 00E0FFFF
Ne 0 ""
Po -1500 0
$EndPAD
$PAD
Sh "3" O 590 825 0 0 0
Dr 392 0 0
At STD N 00E0FFFF
Ne 0 ""
Po -500 0
$EndPAD
$PAD
Sh "4" O 590 825 0 0 0
Dr 392 0 0
At STD N 00E0FFFF
Ne 0 ""
Po 500 0
$EndPAD
$PAD
Sh "5" O 590 825 0 0 0
Dr 392 0 0
At STD N 00E0FFFF
Ne 0 ""
Po 1500 0
$EndPAD
$PAD
Sh "6" O 590 825 0 0 0
Dr 392 0 0
At STD N 00E0FFFF
Ne 0 ""
Po 2500 0
$EndPAD
$SHAPE3D
Na "walter/pin_strip/pin_strip_6.wrl"
Sc 1 1 1
Of 0 0 0
Ro 0 0 0
$EndSHAPE3D
$EndMODULE Lista6
$MODULE Lista7
Po 0 0 0 15 4FEA2451 00000000 ~~
Li Lista7
Sc 0
AR 
Op 0 0 0
T0 0 -1000 392 392 0 77 N V 21 N "Lista7"
T1 0 1000 392 392 0 77 N I 21 N "Value"
DS 3500 -600 -3600 -600 150 21
DS -3600 600 3500 600 150 21
DS 3500 600 3500 -600 150 21
DS -3600 -600 -3600 600 150 21
DS -3500 -600 -3500 600 150 21
T2 -3900 0 393 393 0 78 N V 21 N "1"
$PAD
Sh "1" R 590 825 0 0 0
Dr 392 0 0
At STD N 00E0FFFF
Ne 0 ""
Po -3000 0
$EndPAD
$PAD
Sh "2" O 590 825 0 0 0
Dr 392 0 0
At STD N 00E0FFFF
Ne 0 ""
Po -2000 0
$EndPAD
$PAD
Sh "3" O 590 825 0 0 0
Dr 392 0 0
At STD N 00E0FFFF
Ne 0 ""
Po -1000 0
$EndPAD
$PAD
Sh "4" O 590 825 0 0 0
Dr 392 0 0
At STD N 00E0FFFF
Ne 0 ""
Po 0 0
$EndPAD
$PAD
Sh "5" O 590 825 0 0 0
Dr 392 0 0
At STD N 00E0FFFF
Ne 0 ""
Po 1000 0
$EndPAD
$PAD
Sh "6" O 590 825 0 0 0
Dr 392 0 0
At STD N 00E0FFFF
Ne 0 ""
Po 2000 0
$EndPAD
$PAD
Sh "7" O 590 825 0 0 0
Dr 392 0 0
At STD N 00E0FFFF
Ne 0 ""
Po 3000 0
$EndPAD
$SHAPE3D
Na "walter/pin_strip/pin_strip_7.wrl"
Sc 1 1 1
Of 0 0 0
Ro 0 0 0
$EndSHAPE3D
$EndMODULE Lista7
$MODULE Lista8
Po 0 0 0 15 4FEA245E 00000000 ~~
Li Lista8
Sc 0
AR 
Op 0 0 0
T0 0 -1000 392 392 0 77 N V 21 N "Lista8"
T1 0 1000 392 392 0 77 N I 21 N "Value"
DS -4100 600 4000 600 150 21
DS 4000 600 4000 -600 150 21
DS 4000 -600 -4100 -600 150 21
DS -4100 -600 -4100 600 150 21
DS -4000 -600 -4000 600 150 21
T2 -4400 0 393 393 0 78 N V 21 N "1"
$PAD
Sh "1" R 590 825 0 0 0
Dr 392 0 0
At STD N 00E0FFFF
Ne 0 ""
Po -3500 0
$EndPAD
$PAD
Sh "2" O 590 825 0 0 0
Dr 392 0 0
At STD N 00E0FFFF
Ne 0 ""
Po -2500 0
$EndPAD
$PAD
Sh "3" O 590 825 0 0 0
Dr 392 0 0
At STD N 00E0FFFF
Ne 0 ""
Po -1500 0
$EndPAD
$PAD
Sh "4" O 590 825 0 0 0
Dr 392 0 0
At STD N 00E0FFFF
Ne 0 ""
Po -500 0
$EndPAD
$PAD
Sh "5" O 590 825 0 0 0
Dr 392 0 0
At STD N 00E0FFFF
Ne 0 ""
Po 500 0
$EndPAD
$PAD
Sh "6" O 590 825 0 0 0
Dr 392 0 0
At STD N 00E0FFFF
Ne 0 ""
Po 1500 0
$EndPAD
$PAD
Sh "7" O 590 825 0 0 0
Dr 392 0 0
At STD N 00E0FFFF
Ne 0 ""
Po 2500 0
$EndPAD
$PAD
Sh "8" O 590 825 0 0 0
Dr 392 0 0
At STD N 00E0FFFF
Ne 0 ""
Po 3500 0
$EndPAD
$SHAPE3D
Na "walter/pin_strip/pin_strip_8.wrl"
Sc 1 1 1
Of 0 0 0
Ro 0 0 0
$EndSHAPE3D
$EndMODULE Lista8
$MODULE Lista9
Po 0 0 0 15 4FEA246A 00000000 ~~
Li Lista9
Sc 0
AR 
Op 0 0 0
T0 0 -1000 392 392 0 77 N V 21 N "Lista9"
T1 0 1000 392 392 0 77 N I 21 N "Value"
DS -4600 600 4500 600 150 21
DS 4500 600 4500 -600 150 21
DS 4500 -600 -4600 -600 150 21
DS -4600 -600 -4600 600 150 21
DS -4500 -600 -4500 600 150 21
T2 -4900 0 393 393 0 78 N V 21 N "1"
$PAD
Sh "1" R 590 825 0 0 0
Dr 392 0 0
At STD N 00E0FFFF
Ne 0 ""
Po -4000 0
$EndPAD
$PAD
Sh "2" O 590 825 0 0 0
Dr 392 0 0
At STD N 00E0FFFF
Ne 0 ""
Po -3000 0
$EndPAD
$PAD
Sh "3" O 590 825 0 0 0
Dr 392 0 0
At STD N 00E0FFFF
Ne 0 ""
Po -2000 0
$EndPAD
$PAD
Sh "4" O 590 825 0 0 0
Dr 392 0 0
At STD N 00E0FFFF
Ne 0 ""
Po -1000 0
$EndPAD
$PAD
Sh "5" O 590 825 0 0 0
Dr 392 0 0
At STD N 00E0FFFF
Ne 0 ""
Po 0 0
$EndPAD
$PAD
Sh "6" O 590 825 0 0 0
Dr 392 0 0
At STD N 00E0FFFF
Ne 0 ""
Po 1000 0
$EndPAD
$PAD
Sh "7" O 590 825 0 0 0
Dr 392 0 0
At STD N 00E0FFFF
Ne 0 ""
Po 2000 0
$EndPAD
$PAD
Sh "8" O 590 825 0 0 0
Dr 392 0 0
At STD N 00E0FFFF
Ne 0 ""
Po 3000 0
$EndPAD
$PAD
Sh "9" O 590 825 0 0 0
Dr 392 0 0
At STD N 00E0FFFF
Ne 0 ""
Po 4000 0
$EndPAD
$SHAPE3D
Na "walter/pin_strip/pin_strip_9.wrl"
Sc 1 1 1
Of 0 0 0
Ro 0 0 0
$EndSHAPE3D
$EndMODULE Lista9
$EndLIBRARY
