PCBNEW-LibModule-V1  21.6.2012 22:55:55
# encoding utf-8
$INDEX
4403
6DIP-ELL300G
LLP_SQA16A
LQFP64
QFN24
QFN28
QFP52
SOIC8_150mil
SOIC8_208mil
SOL18_P_300_1_27
SSOP16
TQFP32_08
TQFP44_08
TQFP48
TQFP64_08
TSSOIC28
VDFN8
$EndINDEX
$MODULE LLP_SQA16A
Po 0 0 0 15 4FC47149 00000000 ~~
Li LLP_SQA16A
Sc 0
AR LLP_SQA16A
Op 0 0 0
.LocalClearance 79
T0 0 -1181 394 394 0 79 N V 21 N "LLP_SQA16A"
T1 0 1378 394 394 0 79 N I 21 N "Value"
DS -815 805 -815 -825 45 21
DS -815 -825 805 -825 45 21
DS 805 -810 805 805 45 21
DS -810 805 790 805 45 21
DC -635 615 -585 685 45 21
$PAD
Sh "2" R 98 197 0 0 0
Dr 0 0 0
At SMD N 00888000
Ne 0 ""
Po -100 650
$EndPAD
$PAD
Sh "14" R 197 98 0 0 0
Dr 0 0 0
At SMD N 00888000
Ne 0 ""
Po -650 -95
$EndPAD
$PAD
Sh "13" R 197 98 0 0 0
Dr 0 0 0
At SMD N 00888000
Ne 0 ""
Po -650 -295
$EndPAD
$PAD
Sh "4" R 98 197 0 0 0
Dr 0 0 0
At SMD N 00888000
Ne 0 ""
Po 295 650
$EndPAD
$PAD
Sh "3" R 98 197 0 0 0
Dr 0 0 0
At SMD N 00888000
Ne 0 ""
Po 95 650
$EndPAD
$PAD
Sh "16" R 197 98 0 0 0
Dr 0 0 0
At SMD N 00888000
Ne 0 ""
Po -650 295
$EndPAD
$PAD
Sh "15" R 197 98 0 0 0
Dr 0 0 0
At SMD N 00888000
Ne 0 ""
Po -650 100
$EndPAD
$PAD
Sh "1" R 98 197 0 0 0
Dr 0 0 0
At SMD N 00888000
Ne 0 ""
Po -295 650
$EndPAD
$PAD
Sh "6" R 197 98 0 0 0
Dr 0 0 0
At SMD N 00888000
Ne 0 ""
Po 650 100
$EndPAD
$PAD
Sh "10" R 98 197 0 0 0
Dr 0 0 0
At SMD N 00888000
Ne 0 ""
Po 100 -655
$EndPAD
$PAD
Sh "8" R 197 98 0 0 0
Dr 0 0 0
At SMD N 00888000
Ne 0 ""
Po 650 -295
$EndPAD
$PAD
Sh "12" R 98 197 0 0 0
Dr 0 0 0
At SMD N 00888000
Ne 0 ""
Po -295 -655
$EndPAD
$PAD
Sh "11" R 98 197 0 0 0
Dr 0 0 0
At SMD N 00888000
Ne 0 ""
Po -95 -655
$EndPAD
$PAD
Sh "7" R 197 98 0 0 0
Dr 0 0 0
At SMD N 00888000
Ne 0 ""
Po 650 -95
$EndPAD
$PAD
Sh "9" R 98 197 0 0 0
Dr 0 0 0
At SMD N 00888000
Ne 0 ""
Po 295 -655
$EndPAD
$PAD
Sh "5" R 197 98 0 0 0
Dr 0 0 0
At SMD N 00888000
Ne 0 ""
Po 650 295
$EndPAD
$PAD
Sh "17" R 866 866 0 0 0
Dr 0 0 0
At SMD N 00888000
Ne 0 ""
Po 0 0
$EndPAD
$EndMODULE LLP_SQA16A
$MODULE LQFP64
Po 0 0 0 15 4FE3836E 00000000 ~~
Li LQFP64
Cd LQFP64
Kw ARM
Sc 0
AR
Op 0 0 0
.LocalClearance 59
T0 0 -3100 394 394 0 70 N V 21 N "LQFP64"
T1 0 0 394 394 0 67 N I 21 N "Value"
DS -1969 -1772 -1969 1969 150 21
DS 1969 -1969 -1772 -1969 150 21
DS -1772 -1969 -1969 -1772 150 21
DS 1969 1969 -1969 1969 150 21
DS 1969 -1969 1969 1969 150 21
DC -1581 -1569 -1421 -1469 120 21
$PAD
Sh "8" R 591 106 0 0 0
Dr 0 0 0
At SMD N 00888000
Ne 41 "P1.18_1"
Po -2362 -98
$EndPAD
$PAD
Sh "7" R 591 106 0 0 0
Dr 0 0 0
At SMD N 00888000
Ne 2 "+3.3V"
Po -2362 -295
$EndPAD
$PAD
Sh "6" R 591 106 0 0 0
Dr 0 0 0
At SMD N 00888000
Ne 5 "DGND"
Po -2362 -492
$EndPAD
$PAD
Sh "5" R 591 106 0 0 0
Dr 0 0 0
At SMD N 00888000
Ne 6 "N-000056"
Po -2362 -689
$EndPAD
$PAD
Sh "4" R 591 106 0 0 0
Dr 0 0 0
At SMD N 00888000
Ne 42 "P1.19_1"
Po -2362 -886
$EndPAD
$PAD
Sh "3" R 591 106 0 0 0
Dr 0 0 0
At SMD N 00888000
Ne 7 "N-000057"
Po -2362 -1083
$EndPAD
$PAD
Sh "2" R 591 106 0 0 0
Dr 0 0 0
At SMD N 00888000
Ne 32 "P0.22_1"
Po -2362 -1280
$EndPAD
$PAD
Sh "1" R 591 106 0 0 0
Dr 0 0 0
At SMD N 00888000
Ne 31 "P0.21_1"
Po -2362 -1476
$EndPAD
$PAD
Sh "16" R 591 106 0 0 0
Dr 0 0 0
At SMD N 00888000
Ne 39 "P1.16_1"
Po -2362 1476
$EndPAD
$PAD
Sh "33" R 591 106 0 0 0
Dr 0 0 0
At SMD N 00888000
Ne 18 "P0.08_1"
Po 2362 1476
$EndPAD
$PAD
Sh "48" R 591 106 0 0 0
Dr 0 0 0
At SMD N 00888000
Ne 43 "P1.20_1"
Po 2362 -1476
$EndPAD
$PAD
Sh "9" R 591 106 0 0 0
Dr 0 0 0
At SMD N 00888000
Ne 34 "P0.25_1"
Po -2362 98
$EndPAD
$PAD
Sh "10" R 591 106 0 0 0
Dr 0 0 0
At SMD N 00888000
Ne 3 "D+_1"
Po -2362 295
$EndPAD
$PAD
Sh "11" R 591 106 0 0 0
Dr 0 0 0
At SMD N 00888000
Ne 4 "D-_1"
Po -2362 492
$EndPAD
$PAD
Sh "12" R 591 106 0 0 0
Dr 0 0 0
At SMD N 00888000
Ne 40 "P1.17_1"
Po -2362 689
$EndPAD
$PAD
Sh "13" R 591 106 0 0 0
Dr 0 0 0
At SMD N 00888000
Ne 35 "P0.28_1"
Po -2362 886
$EndPAD
$PAD
Sh "14" R 591 106 0 0 0
Dr 0 0 0
At SMD N 00888000
Ne 36 "P0.29_1"
Po -2362 1083
$EndPAD
$PAD
Sh "15" R 591 106 0 0 0
Dr 0 0 0
At SMD N 00888000
Ne 37 "P0.30_1"
Po -2362 1280
$EndPAD
$PAD
Sh "34" R 591 106 0 0 0
Dr 0 0 0
At SMD N 00888000
Ne 19 "P0.09_1"
Po 2362 1280
$EndPAD
$PAD
Sh "35" R 591 106 0 0 0
Dr 0 0 0
At SMD N 00888000
Ne 20 "P0.10_1"
Po 2362 1083
$EndPAD
$PAD
Sh "36" R 591 106 0 0 0
Dr 0 0 0
At SMD N 00888000
Ne 46 "P1.23_1"
Po 2362 886
$EndPAD
$PAD
Sh "37" R 591 106 0 0 0
Dr 0 0 0
At SMD N 00888000
Ne 21 "P0.11_1"
Po 2362 689
$EndPAD
$PAD
Sh "38" R 591 106 0 0 0
Dr 0 0 0
At SMD N 00888000
Ne 22 "P0.12_1"
Po 2362 492
$EndPAD
$PAD
Sh "39" R 591 106 0 0 0
Dr 0 0 0
At SMD N 00888000
Ne 23 "P0.13_1"
Po 2362 295
$EndPAD
$PAD
Sh "40" R 591 106 0 0 0
Dr 0 0 0
At SMD N 00888000
Ne 45 "P1.22_1"
Po 2362 98
$EndPAD
$PAD
Sh "41" R 591 106 0 0 0
Dr 0 0 0
At SMD N 00888000
Ne 24 "P0.14_1"
Po 2362 -98
$EndPAD
$PAD
Sh "42" R 591 106 0 0 0
Dr 0 0 0
At SMD N 00888000
Ne 5 "DGND"
Po 2362 -295
$EndPAD
$PAD
Sh "43" R 591 106 0 0 0
Dr 0 0 0
At SMD N 00888000
Ne 2 "+3.3V"
Po 2362 -492
$EndPAD
$PAD
Sh "44" R 591 106 0 0 0
Dr 0 0 0
At SMD N 00888000
Ne 44 "P1.21_1"
Po 2362 -689
$EndPAD
$PAD
Sh "45" R 591 106 0 0 0
Dr 0 0 0
At SMD N 00888000
Ne 25 "P0.15_1"
Po 2362 -886
$EndPAD
$PAD
Sh "46" R 591 106 0 0 0
Dr 0 0 0
At SMD N 00888000
Ne 26 "P0.16_1"
Po 2362 -1083
$EndPAD
$PAD
Sh "47" R 591 106 0 0 0
Dr 0 0 0
At SMD N 00888000
Ne 27 "P0.17_1"
Po 2362 -1280
$EndPAD
$PAD
Sh "64" R 98 591 0 0 0
Dr 0 0 0
At SMD N 00888000
Ne 50 "P1.27_1"
Po -1476 -2362
$EndPAD
$PAD
Sh "63" R 98 591 0 0 0
Dr 0 0 0
At SMD N 00888000
Ne 56 "Vref_1"
Po -1280 -2362
$EndPAD
$PAD
Sh "62" R 98 591 0 0 0
Dr 0 0 0
At SMD N 00888000
Ne 9 "N-000059"
Po -1083 -2362
$EndPAD
$PAD
Sh "61" R 98 591 0 0 0
Dr 0 0 0
At SMD N 00888000
Ne 8 "N-000058"
Po -886 -2362
$EndPAD
$PAD
Sh "60" R 98 591 0 0 0
Dr 0 0 0
At SMD N 00888000
Ne 51 "P1.28_1"
Po -689 -2362
$EndPAD
$PAD
Sh "59" R 98 591 0 0 0
Dr 0 0 0
At SMD N 00888000
Ne 5 "DGND"
Po -492 -2362
$EndPAD
$PAD
Sh "56" R 98 591 0 0 0
Dr 0 0 0
At SMD N 00888000
Ne 52 "P1.29_1"
Po 98 -2362
$EndPAD
$PAD
Sh "54" R 98 591 0 0 0
Dr 0 0 0
At SMD N 00888000
Ne 29 "P0.19_1"
Po 492 -2362
$EndPAD
$PAD
Sh "53" R 98 591 0 0 0
Dr 0 0 0
At SMD N 00888000
Ne 28 "P0.18_1"
Po 689 -2362
$EndPAD
$PAD
Sh "58" R 98 591 0 0 0
Dr 0 0 0
At SMD N 00888000
Ne 33 "P0.23_1"
Po -295 -2362
$EndPAD
$PAD
Sh "57" R 98 591 0 0 0
Dr 0 0 0
At SMD N 00888000
Ne 1 "'RST_1"
Po -98 -2362
$EndPAD
$PAD
Sh "55" R 98 591 0 0 0
Dr 0 0 0
At SMD N 00888000
Ne 30 "P0.20_1"
Po 295 -2362
$EndPAD
$PAD
Sh "52" R 98 591 0 0 0
Dr 0 0 0
At SMD N 00888000
Ne 53 "P1.30_1"
Po 886 -2362
$EndPAD
$PAD
Sh "51" R 98 591 0 0 0
Dr 0 0 0
At SMD N 00888000
Ne 2 "+3.3V"
Po 1083 -2362
$EndPAD
$PAD
Sh "50" R 98 591 0 0 0
Dr 0 0 0
At SMD N 00888000
Ne 5 "DGND"
Po 1280 -2362
$EndPAD
$PAD
Sh "49" R 98 591 0 0 0
Dr 0 0 0
At SMD N 00888000
Ne 55 "Vbatt_1"
Po 1476 -2362
$EndPAD
$PAD
Sh "17" R 98 591 0 0 0
Dr 0 0 0
At SMD N 00888000
Ne 38 "P0.31_1"
Po -1476 2362
$EndPAD
$PAD
Sh "18" R 98 591 0 0 0
Dr 0 0 0
At SMD N 00888000
Ne 5 "DGND"
Po -1280 2362
$EndPAD
$PAD
Sh "19" R 98 591 0 0 0
Dr 0 0 0
At SMD N 00888000
Ne 10 "P0.00_1"
Po -1083 2362
$EndPAD
$PAD
Sh "20" R 98 591 0 0 0
Dr 0 0 0
At SMD N 00888000
Ne 54 "P1.31_1"
Po -886 2362
$EndPAD
$PAD
Sh "21" R 98 591 0 0 0
Dr 0 0 0
At SMD N 00888000
Ne 11 "P0.01_1"
Po -689 2362
$EndPAD
$PAD
Sh "22" R 98 591 0 0 0
Dr 0 0 0
At SMD N 00888000
Ne 12 "P0.02_1"
Po -492 2362
$EndPAD
$PAD
Sh "23" R 98 591 0 0 0
Dr 0 0 0
At SMD N 00888000
Ne 2 "+3.3V"
Po -295 2362
$EndPAD
$PAD
Sh "24" R 98 591 0 0 0
Dr 0 0 0
At SMD N 00888000
Ne 49 "P1.26_1"
Po -98 2362
$EndPAD
$PAD
Sh "25" R 98 591 0 0 0
Dr 0 0 0
At SMD N 00888000
Ne 5 "DGND"
Po 98 2362
$EndPAD
$PAD
Sh "26" R 98 591 0 0 0
Dr 0 0 0
At SMD N 00888000
Ne 13 "P0.03_1"
Po 295 2362
$EndPAD
$PAD
Sh "27" R 98 591 0 0 0
Dr 0 0 0
At SMD N 00888000
Ne 14 "P0.04_1"
Po 492 2362
$EndPAD
$PAD
Sh "28" R 98 591 0 0 0
Dr 0 0 0
At SMD N 00888000
Ne 48 "P1.25_1"
Po 689 2362
$EndPAD
$PAD
Sh "29" R 98 591 0 0 0
Dr 0 0 0
At SMD N 00888000
Ne 15 "P0.05_1"
Po 886 2362
$EndPAD
$PAD
Sh "30" R 98 591 0 0 0
Dr 0 0 0
At SMD N 00888000
Ne 16 "P0.06_1"
Po 1083 2362
$EndPAD
$PAD
Sh "31" R 98 591 0 0 0
Dr 0 0 0
At SMD N 00888000
Ne 17 "P0.07_1"
Po 1280 2362
$EndPAD
$PAD
Sh "32" R 98 591 0 0 0
Dr 0 0 0
At SMD N 00888000
Ne 47 "P1.24_1"
Po 1476 2362
$EndPAD
$SHAPE3D
Na "smd/vqfp64.wrl"
Sc 0.5 0.5 0.35
Of 0 0 0
Ro 0 0 90
$EndSHAPE3D
$EndMODULE LQFP64
$MODULE QFN24
Po 0 0 0 15 4FE380D4 00000000 ~~
Li QFN24
Sc 0
AR
Op 0 0 0
.LocalClearance 78
T0 0 -1500 394 394 0 78 N V 21 N "QFN24"
T1 0 1500 394 394 0 78 N I 21 N "Value"
DS -784 -980 980 -980 59 21
DS -980 -784 -980 980 59 21
DS -980 -784 -784 -980 59 21
DS -784 -686 -784 -784 79 21
DS -784 -784 -686 -784 79 21
DS -686 784 -784 784 79 21
DS -784 784 -784 686 79 21
DS 784 686 784 784 79 21
DS 784 784 686 784 79 21
DS 686 -784 784 -784 79 21
DS 784 -784 784 -686 79 21
DS 980 980 -980 980 59 21
DS 980 -980 980 980 59 21
$PAD
Sh "" R 984 984 0 0 2700
Dr 0 0 0
At SMD N 0088FFFF
Ne 0 ""
Po 0 0
$EndPAD
$PAD
Sh "1" O 315 98 0 0 0
Dr 0 0 0
At SMD N 00888000
Ne 0 ""
Po -787 -492
$EndPAD
$PAD
Sh "2" O 315 98 0 0 0
Dr 0 0 0
At SMD N 00888000
Ne 0 ""
Po -787 -295
$EndPAD
$PAD
Sh "3" O 315 98 0 0 0
Dr 0 0 0
At SMD N 00888000
Ne 0 ""
Po -787 -98
$EndPAD
$PAD
Sh "4" O 315 98 0 0 0
Dr 0 0 0
At SMD N 00888000
Ne 0 ""
Po -787 98
$EndPAD
$PAD
Sh "5" O 315 98 0 0 0
Dr 0 0 0
At SMD N 00888000
Ne 0 ""
Po -787 295
$EndPAD
$PAD
Sh "6" O 315 98 0 0 0
Dr 0 0 0
At SMD N 00888000
Ne 0 ""
Po -787 492
$EndPAD
$PAD
Sh "7" O 315 98 0 0 900
Dr 0 0 0
At SMD N 00888000
Ne 0 ""
Po -492 787
$EndPAD
$PAD
Sh "8" O 315 98 0 0 900
Dr 0 0 0
At SMD N 00888000
Ne 0 ""
Po -295 787
$EndPAD
$PAD
Sh "9" O 315 98 0 0 900
Dr 0 0 0
At SMD N 00888000
Ne 0 ""
Po -98 787
$EndPAD
$PAD
Sh "10" O 315 98 0 0 900
Dr 0 0 0
At SMD N 00888000
Ne 0 ""
Po 98 787
$EndPAD
$PAD
Sh "11" O 315 98 0 0 900
Dr 0 0 0
At SMD N 00888000
Ne 0 ""
Po 295 787
$EndPAD
$PAD
Sh "12" O 315 98 0 0 900
Dr 0 0 0
At SMD N 00888000
Ne 0 ""
Po 492 787
$EndPAD
$PAD
Sh "13" O 315 98 0 0 1800
Dr 0 0 0
At SMD N 00888000
Ne 0 ""
Po 787 492
$EndPAD
$PAD
Sh "14" O 315 98 0 0 1800
Dr 0 0 0
At SMD N 00888000
Ne 0 ""
Po 787 295
$EndPAD
$PAD
Sh "15" O 315 98 0 0 1800
Dr 0 0 0
At SMD N 00888000
Ne 0 ""
Po 787 98
$EndPAD
$PAD
Sh "16" O 315 98 0 0 1800
Dr 0 0 0
At SMD N 00888000
Ne 0 ""
Po 787 -98
$EndPAD
$PAD
Sh "17" O 315 98 0 0 1800
Dr 0 0 0
At SMD N 00888000
Ne 0 ""
Po 787 -295
$EndPAD
$PAD
Sh "18" O 315 98 0 0 1800
Dr 0 0 0
At SMD N 00888000
Ne 0 ""
Po 787 -492
$EndPAD
$PAD
Sh "19" O 315 98 0 0 2700
Dr 0 0 0
At SMD N 00888000
Ne 0 ""
Po 492 -787
$EndPAD
$PAD
Sh "20" O 315 98 0 0 2700
Dr 0 0 0
At SMD N 00888000
Ne 0 ""
Po 295 -787
$EndPAD
$PAD
Sh "21" O 315 98 0 0 2700
Dr 0 0 0
At SMD N 00888000
Ne 0 ""
Po 98 -787
$EndPAD
$PAD
Sh "22" O 315 98 0 0 2700
Dr 0 0 0
At SMD N 00888000
Ne 0 ""
Po -98 -787
$EndPAD
$PAD
Sh "23" O 315 98 0 0 2700
Dr 0 0 0
At SMD N 00888000
Ne 0 ""
Po -295 -787
$EndPAD
$PAD
Sh "24" O 315 98 0 0 2700
Dr 0 0 0
At SMD N 00888000
Ne 0 ""
Po -492 -787
$EndPAD
$PAD
Sh "" C 315 315 0 0 2700
Dr 315 0 0
At HOLE N 00F0FFFF
Ne 0 ""
Po 0 0
$EndPAD
$PAD
Sh "" C 315 315 0 0 2700
Dr 315 0 0
At HOLE N 00F0FFFF
Ne 0 ""
Po 300 -300
$EndPAD
$PAD
Sh "" C 315 315 0 0 2700
Dr 315 0 0
At HOLE N 00F0FFFF
Ne 0 ""
Po -300 -300
$EndPAD
$PAD
Sh "" C 315 315 0 0 2700
Dr 315 0 0
At HOLE N 00F0FFFF
Ne 0 ""
Po 300 300
$EndPAD
$PAD
Sh "" C 315 315 0 0 2700
Dr 315 0 0
At HOLE N 00F0FFFF
Ne 0 ""
Po -300 300
$EndPAD
$SHAPE3D
Na "LR/QFN24.wrl"
Sc 1 1 1
Of 0 0 0
Ro 0 0 0
$EndSHAPE3D
$EndMODULE QFN24
$MODULE QFN28
Po 0 0 0 15 4FE38122 00000000 ~~
Li QFN28
Sc 0
AR
Op 0 0 0
T0 0 -1654 394 394 0 78 N V 21 N "QFN28"
T1 0 1732 394 394 0 77 N I 21 N "Value"
DS -1260 1260 1260 1260 59 21
DS 1260 1260 1260 -1260 59 21
DS 1260 -1260 -866 -1260 59 21
DS -866 -1260 -1260 -866 59 21
DS -1260 -866 -1260 1260 59 21
DS -787 -984 -984 -984 79 21
DS -984 -984 -984 -787 79 21
DS 984 -787 984 -984 79 21
DS 984 -984 787 -984 79 21
DS 787 984 984 984 79 21
DS 984 984 984 787 79 21
DS -984 787 -984 984 79 21
DS -984 984 -787 984 79 21
$PAD
Sh "1" O 394 98 0 0 0
Dr 0 0 0
At SMD N 00888000
Ne 0 ""
Po -984 -591
$EndPAD
$PAD
Sh "2" O 394 98 0 0 0
Dr 0 0 0
At SMD N 00888000
Ne 0 ""
Po -984 -394
$EndPAD
$PAD
Sh "3" O 394 98 0 0 0
Dr 0 0 0
At SMD N 00888000
Ne 0 ""
Po -984 -197
$EndPAD
$PAD
Sh "4" O 394 98 0 0 0
Dr 0 0 0
At SMD N 00888000
Ne 0 ""
Po -984 0
$EndPAD
$PAD
Sh "5" O 394 98 0 0 0
Dr 0 0 0
At SMD N 00888000
Ne 0 ""
Po -984 197
$EndPAD
$PAD
Sh "6" O 394 98 0 0 0
Dr 0 0 0
At SMD N 00888000
Ne 0 ""
Po -984 394
$EndPAD
$PAD
Sh "7" O 394 98 0 0 0
Dr 0 0 0
At SMD N 00888000
Ne 0 ""
Po -984 591
$EndPAD
$PAD
Sh "8" O 394 98 0 0 900
Dr 0 0 0
At SMD N 00888000
Ne 0 ""
Po -591 984
$EndPAD
$PAD
Sh "9" O 394 98 0 0 900
Dr 0 0 0
At SMD N 00888000
Ne 0 ""
Po -394 984
$EndPAD
$PAD
Sh "10" O 394 98 0 0 900
Dr 0 0 0
At SMD N 00888000
Ne 0 ""
Po -197 984
$EndPAD
$PAD
Sh "11" O 394 98 0 0 900
Dr 0 0 0
At SMD N 00888000
Ne 0 ""
Po 0 984
$EndPAD
$PAD
Sh "12" O 394 98 0 0 900
Dr 0 0 0
At SMD N 00888000
Ne 0 ""
Po 197 984
$EndPAD
$PAD
Sh "13" O 394 98 0 0 900
Dr 0 0 0
At SMD N 00888000
Ne 0 ""
Po 394 984
$EndPAD
$PAD
Sh "14" O 394 98 0 0 900
Dr 0 0 0
At SMD N 00888000
Ne 0 ""
Po 591 984
$EndPAD
$PAD
Sh "15" O 394 98 0 0 1800
Dr 0 0 0
At SMD N 00888000
Ne 0 ""
Po 984 591
$EndPAD
$PAD
Sh "16" O 394 98 0 0 1800
Dr 0 0 0
At SMD N 00888000
Ne 0 ""
Po 984 394
$EndPAD
$PAD
Sh "17" O 394 98 0 0 1800
Dr 0 0 0
At SMD N 00888000
Ne 0 ""
Po 984 197
$EndPAD
$PAD
Sh "18" O 394 98 0 0 1800
Dr 0 0 0
At SMD N 00888000
Ne 0 ""
Po 984 0
$EndPAD
$PAD
Sh "19" O 394 98 0 0 1800
Dr 0 0 0
At SMD N 00888000
Ne 0 ""
Po 984 -197
$EndPAD
$PAD
Sh "20" O 394 98 0 0 1800
Dr 0 0 0
At SMD N 00888000
Ne 0 ""
Po 984 -394
$EndPAD
$PAD
Sh "21" O 394 98 0 0 1800
Dr 0 0 0
At SMD N 00888000
Ne 0 ""
Po 984 -591
$EndPAD
$PAD
Sh "22" O 394 98 0 0 2700
Dr 0 0 0
At SMD N 00888000
Ne 0 ""
Po 591 -984
$EndPAD
$PAD
Sh "23" O 394 98 0 0 2700
Dr 0 0 0
At SMD N 00888000
Ne 0 ""
Po 394 -984
$EndPAD
$PAD
Sh "24" O 394 98 0 0 2700
Dr 0 0 0
At SMD N 00888000
Ne 0 ""
Po 197 -984
$EndPAD
$PAD
Sh "25" O 394 98 0 0 2700
Dr 0 0 0
At SMD N 00888000
Ne 0 ""
Po 0 -984
$EndPAD
$PAD
Sh "26" O 394 98 0 0 2700
Dr 0 0 0
At SMD N 00888000
Ne 0 ""
Po -197 -984
$EndPAD
$PAD
Sh "27" O 394 98 0 0 2700
Dr 0 0 0
At SMD N 00888000
Ne 0 ""
Po -394 -984
$EndPAD
$PAD
Sh "28" O 394 98 0 0 2700
Dr 0 0 0
At SMD N 00888000
Ne 0 ""
Po -591 -984
$EndPAD
$PAD
Sh "" R 1181 1181 0 0 2700
Dr 0 0 0
At SMD N 0088FFFF
Ne 0 ""
Po 0 0
$EndPAD
$PAD
Sh "" C 433 433 0 0 2700
Dr 315 0 0
At HOLE N 00F0FFFF
Ne 0 ""
Po 300 300
$EndPAD
$PAD
Sh "" C 433 433 0 0 2700
Dr 315 0 0
At HOLE N 00F0FFFF
Ne 0 ""
Po 0 0
$EndPAD
$PAD
Sh "" C 433 433 0 0 2700
Dr 315 0 0
At HOLE N 00F0FFFF
Ne 0 ""
Po -300 -300
$EndPAD
$PAD
Sh "" C 433 433 0 0 2700
Dr 315 0 0
At HOLE N 00F0FFFF
Ne 0 ""
Po -300 300
$EndPAD
$PAD
Sh "" C 433 433 0 0 2700
Dr 315 0 0
At HOLE N 00F0FFFF
Ne 0 ""
Po 300 -300
$EndPAD
$SHAPE3D
Na "LR/QFN28.wrl"
Sc 1 1 1
Of 0 0 0
Ro 0 0 0
$EndSHAPE3D
$EndMODULE QFN28
$MODULE QFP52
Po 0 0 0 15 4FE383D4 00000000 ~~
Li QFP52
Sc 0
AR
Op 0 0 0
T0 0 -4700 393 393 0 78 N V 21 N "QFP52"
T1 0 0 392 392 0 77 N I 21 N "Value"
DC -2165 2165 -2362 1969 118 21
DS -2756 -2756 2756 -2756 118 21
DS 2756 -2756 2756 2756 118 21
DS 2756 2756 -2756 2756 118 21
DS -2756 2756 -2756 -2756 118 21
$PAD
Sh "1" R 197 984 0 0 0
Dr 0 0 0
At SMD N 00888000
Ne 12 "N-000028"
Po -2362 3642
$EndPAD
$PAD
Sh "2" R 197 984 0 0 0
Dr 0 0 0
At SMD N 00888000
Ne 0 ""
Po -1969 3642
$EndPAD
$PAD
Sh "3" R 197 984 0 0 0
Dr 0 0 0
At SMD N 00888000
Ne 8 "N-000024"
Po -1575 3642
$EndPAD
$PAD
Sh "4" R 197 984 0 0 0
Dr 0 0 0
At SMD N 00888000
Ne 11 "N-000027"
Po -1181 3642
$EndPAD
$PAD
Sh "5" R 197 984 0 0 0
Dr 0 0 0
At SMD N 00888000
Ne 9 "N-000025"
Po -787 3642
$EndPAD
$PAD
Sh "6" R 197 984 0 0 0
Dr 0 0 0
At SMD N 00888000
Ne 5 "GND"
Po -394 3642
$EndPAD
$PAD
Sh "7" R 197 984 0 0 0
Dr 0 0 0
At SMD N 00888000
Ne 48 "VDD"
Po 0 3642
$EndPAD
$PAD
Sh "8" R 197 984 0 0 0
Dr 0 0 0
At SMD N 00888000
Ne 6 "N-000010"
Po 394 3642
$EndPAD
$PAD
Sh "9" R 197 984 0 0 0
Dr 0 0 0
At SMD N 00888000
Ne 15 "N-000042"
Po 787 3642
$EndPAD
$PAD
Sh "10" R 197 984 0 0 0
Dr 0 0 0
At SMD N 00888000
Ne 7 "N-000011"
Po 1181 3642
$EndPAD
$PAD
Sh "11" R 197 984 0 0 0
Dr 0 0 0
At SMD N 00888000
Ne 13 "N-000040"
Po 1575 3642
$EndPAD
$PAD
Sh "12" R 197 984 0 0 0
Dr 0 0 0
At SMD N 00888000
Ne 14 "N-000041"
Po 1969 3642
$EndPAD
$PAD
Sh "13" R 197 984 0 0 0
Dr 0 0 0
At SMD N 00888000
Ne 0 ""
Po 2362 3642
$EndPAD
$PAD
Sh "14" R 197 984 0 0 900
Dr 0 0 0
At SMD N 00888000
Ne 0 ""
Po 3642 2362
$EndPAD
$PAD
Sh "15" R 197 984 0 0 900
Dr 0 0 0
At SMD N 00888000
Ne 1 "COMM0_1"
Po 3642 1969
$EndPAD
$PAD
Sh "16" R 197 984 0 0 900
Dr 0 0 0
At SMD N 00888000
Ne 2 "COMM1_1"
Po 3642 1575
$EndPAD
$PAD
Sh "17" R 197 984 0 0 900
Dr 0 0 0
At SMD N 00888000
Ne 3 "COMM2_1"
Po 3642 1181
$EndPAD
$PAD
Sh "18" R 197 984 0 0 900
Dr 0 0 0
At SMD N 00888000
Ne 4 "COMM3_1"
Po 3642 787
$EndPAD
$PAD
Sh "19" R 197 984 0 0 900
Dr 0 0 0
At SMD N 00888000
Ne 16 "S0_1"
Po 3642 394
$EndPAD
$PAD
Sh "20" R 197 984 0 0 900
Dr 0 0 0
At SMD N 00888000
Ne 27 "S1_1"
Po 3642 0
$EndPAD
$PAD
Sh "21" R 197 984 0 0 900
Dr 0 0 0
At SMD N 00888000
Ne 38 "S2_1"
Po 3642 -394
$EndPAD
$PAD
Sh "22" R 197 984 0 0 900
Dr 0 0 0
At SMD N 00888000
Ne 41 "S3_1"
Po 3642 -787
$EndPAD
$PAD
Sh "23" R 197 984 0 0 900
Dr 0 0 0
At SMD N 00888000
Ne 42 "S4_1"
Po 3642 -1181
$EndPAD
$PAD
Sh "24" R 197 984 0 0 900
Dr 0 0 0
At SMD N 00888000
Ne 43 "S5_1"
Po 3642 -1575
$EndPAD
$PAD
Sh "25" R 197 984 0 0 900
Dr 0 0 0
At SMD N 00888000
Ne 44 "S6_1"
Po 3642 -1969
$EndPAD
$PAD
Sh "26" R 197 984 0 0 900
Dr 0 0 0
At SMD N 00888000
Ne 45 "S7_1"
Po 3642 -2362
$EndPAD
$PAD
Sh "27" R 197 984 0 0 1800
Dr 0 0 0
At SMD N 00888000
Ne 46 "S8_1"
Po 2362 -3641
$EndPAD
$PAD
Sh "28" R 197 984 0 0 1800
Dr 0 0 0
At SMD N 00888000
Ne 47 "S9_1"
Po 1969 -3641
$EndPAD
$PAD
Sh "29" R 197 984 0 0 1800
Dr 0 0 0
At SMD N 00888000
Ne 17 "S10_1"
Po 1575 -3641
$EndPAD
$PAD
Sh "30" R 197 984 0 0 1800
Dr 0 0 0
At SMD N 00888000
Ne 18 "S11_1"
Po 1181 -3641
$EndPAD
$PAD
Sh "31" R 197 984 0 0 1800
Dr 0 0 0
At SMD N 00888000
Ne 19 "S12_1"
Po 787 -3641
$EndPAD
$PAD
Sh "32" R 197 984 0 0 1800
Dr 0 0 0
At SMD N 00888000
Ne 20 "S13_1"
Po 394 -3641
$EndPAD
$PAD
Sh "33" R 197 984 0 0 1800
Dr 0 0 0
At SMD N 00888000
Ne 48 "VDD"
Po 0 -3641
$EndPAD
$PAD
Sh "34" R 197 984 0 0 1800
Dr 0 0 0
At SMD N 00888000
Ne 21 "S14_1"
Po -394 -3641
$EndPAD
$PAD
Sh "35" R 197 984 0 0 1800
Dr 0 0 0
At SMD N 00888000
Ne 22 "S15_1"
Po -787 -3641
$EndPAD
$PAD
Sh "36" R 197 984 0 0 1800
Dr 0 0 0
At SMD N 00888000
Ne 23 "S16_1"
Po -1181 -3641
$EndPAD
$PAD
Sh "37" R 197 984 0 0 1800
Dr 0 0 0
At SMD N 00888000
Ne 24 "S17_1"
Po -1575 -3641
$EndPAD
$PAD
Sh "38" R 197 984 0 0 1800
Dr 0 0 0
At SMD N 00888000
Ne 25 "S18_1"
Po -1969 -3641
$EndPAD
$PAD
Sh "39" R 197 984 0 0 1800
Dr 0 0 0
At SMD N 00888000
Ne 26 "S19_1"
Po -2362 -3641
$EndPAD
$PAD
Sh "40" R 197 984 0 0 2700
Dr 0 0 0
At SMD N 00888000
Ne 28 "S20_1"
Po -3642 -2362
$EndPAD
$PAD
Sh "41" R 197 984 0 0 2700
Dr 0 0 0
At SMD N 00888000
Ne 29 "S21_1"
Po -3642 -1969
$EndPAD
$PAD
Sh "42" R 197 984 0 0 2700
Dr 0 0 0
At SMD N 00888000
Ne 30 "S22_1"
Po -3642 -1575
$EndPAD
$PAD
Sh "43" R 197 984 0 0 2700
Dr 0 0 0
At SMD N 00888000
Ne 31 "S23_1"
Po -3642 -1181
$EndPAD
$PAD
Sh "44" R 197 984 0 0 2700
Dr 0 0 0
At SMD N 00888000
Ne 32 "S24_1"
Po -3642 -787
$EndPAD
$PAD
Sh "45" R 197 984 0 0 2700
Dr 0 0 0
At SMD N 00888000
Ne 33 "S25_1"
Po -3642 -394
$EndPAD
$PAD
Sh "46" R 197 984 0 0 2700
Dr 0 0 0
At SMD N 00888000
Ne 34 "S26_1"
Po -3642 0
$EndPAD
$PAD
Sh "47" R 197 984 0 0 2700
Dr 0 0 0
At SMD N 00888000
Ne 35 "S27_1"
Po -3642 394
$EndPAD
$PAD
Sh "48" R 197 984 0 0 2700
Dr 0 0 0
At SMD N 00888000
Ne 36 "S28_1"
Po -3642 787
$EndPAD
$PAD
Sh "49" R 197 984 0 0 2700
Dr 0 0 0
At SMD N 00888000
Ne 37 "S29_1"
Po -3642 1181
$EndPAD
$PAD
Sh "50" R 197 984 0 0 2700
Dr 0 0 0
At SMD N 00888000
Ne 39 "S30_1"
Po -3642 1575
$EndPAD
$PAD
Sh "51" R 197 984 0 0 2700
Dr 0 0 0
At SMD N 00888000
Ne 40 "S31_1"
Po -3642 1969
$EndPAD
$PAD
Sh "52" R 197 984 0 0 2700
Dr 0 0 0
At SMD N 00888000
Ne 10 "N-000026"
Po -3642 2362
$EndPAD
$SHAPE3D
Na "LR/vqfp52.wrl"
Sc 0 1 1
Of 0 0 0
Ro 0 0 0
$EndSHAPE3D
$EndMODULE QFP52
$MODULE SOIC8_150mil
Po 0 0 0 15 4FE37C70 00000000 ~~
Li SOIC8_150mil
Sc 0
AR
Op 0 0 0
T0 -1457 0 394 394 900 79 N V 21 N "SOIC8_150mil"
T1 1500 0 394 394 900 79 N I 21 N "VAL**"
DS -1024 -118 -827 -118 100 21
DS -827 -118 -827 79 100 21
DS -827 79 -827 118 100 21
DS -827 118 -1024 118 100 21
DS -1024 -472 1024 -472 100 21
DS 1024 -472 1024 472 100 21
DS 1024 472 -1024 472 100 21
DS -1024 472 -1024 -472 100 21
DS -1142 -1378 1142 -1378 100 26
DS 1142 -1378 1142 1378 100 26
DS 1142 1378 -1142 1378 100 26
DS -1142 1378 -1142 -1378 100 26
DS -1024 -118 -827 -118 100 27
DS -827 -118 -827 118 100 27
DS -827 118 -1024 118 100 27
DS -1024 -787 1024 -787 100 27
DS 1024 -787 1024 787 100 27
DS 1024 787 -1024 787 100 27
DS -1024 787 -1024 -787 100 27
$PAD
Sh "1" R 201 630 0 0 0
Dr 0 0 0
At SMD N 00888000
Ne 0 ""
Po -756 945
$EndPAD
$PAD
Sh "2" R 201 630 0 0 0
Dr 0 0 0
At SMD N 00888000
Ne 0 ""
Po -256 945
$EndPAD
$PAD
Sh "3" R 201 630 0 0 0
Dr 0 0 0
At SMD N 00888000
Ne 0 ""
Po 256 945
$EndPAD
$PAD
Sh "4" R 201 630 0 0 0
Dr 0 0 0
At SMD N 00888000
Ne 0 ""
Po 756 945
$EndPAD
$PAD
Sh "5" R 201 630 0 0 0
Dr 0 0 0
At SMD N 00888000
Ne 0 ""
Po 756 -945
$EndPAD
$PAD
Sh "6" R 201 630 0 0 0
Dr 0 0 0
At SMD N 00888000
Ne 0 ""
Po 256 -945
$EndPAD
$PAD
Sh "7" R 201 630 0 0 0
Dr 0 0 0
At SMD N 00888000
Ne 0 ""
Po -256 -945
$EndPAD
$PAD
Sh "8" R 201 630 0 0 0
Dr 0 0 0
At SMD N 00888000
Ne 0 ""
Po -756 -945
$EndPAD
$EndMODULE SOIC8_150mil
$MODULE SOIC8_208mil
Po 0 0 0 15 4FE37C8C 00000000 ~~
Li SOIC8_208mil
Sc 0
AR
Op 0 0 0
T0 -1535 0 394 394 900 79 N V 21 N "SOIC8_208mil"
T1 1600 0 394 394 900 79 N I 21 N "VAL**"
DS -1063 -197 -906 -197 100 21
DS -906 -197 -906 197 100 21
DS -906 197 -1063 197 100 21
DS -1063 -787 1063 -787 100 21
DS 1063 -787 1063 787 100 21
DS 1063 787 -1063 787 100 21
DS -1063 787 -1063 -787 100 21
DS -1181 -1732 1181 -1732 100 26
DS 1181 -1732 1181 1732 100 26
DS 1181 1732 -1181 1732 100 26
DS -1181 1732 -1181 -1732 100 26
DS -1063 -197 -906 -197 100 27
DS -906 -197 -906 197 100 27
DS -906 197 -1063 197 100 27
DS -1063 -1063 1063 -1063 100 27
DS 1063 -1063 1063 1063 100 27
DS 1063 1063 -1063 1063 100 27
DS -1063 1063 -1063 -1063 100 27
$PAD
Sh "1" R 201 630 0 0 0
Dr 0 0 0
At SMD N 00888000
Ne 0 ""
Po -756 1299
$EndPAD
$PAD
Sh "2" R 201 630 0 0 0
Dr 0 0 0
At SMD N 00888000
Ne 0 ""
Po -256 1299
$EndPAD
$PAD
Sh "3" R 201 630 0 0 0
Dr 0 0 0
At SMD N 00888000
Ne 0 ""
Po 256 1299
$EndPAD
$PAD
Sh "4" R 201 630 0 0 0
Dr 0 0 0
At SMD N 00888000
Ne 0 ""
Po 756 1299
$EndPAD
$PAD
Sh "5" R 201 630 0 0 0
Dr 0 0 0
At SMD N 00888000
Ne 0 ""
Po 756 -1299
$EndPAD
$PAD
Sh "6" R 201 630 0 0 0
Dr 0 0 0
At SMD N 00888000
Ne 0 ""
Po 256 -1299
$EndPAD
$PAD
Sh "7" R 201 630 0 0 0
Dr 0 0 0
At SMD N 00888000
Ne 0 ""
Po -256 -1299
$EndPAD
$PAD
Sh "8" R 201 630 0 0 0
Dr 0 0 0
At SMD N 00888000
Ne 0 ""
Po -756 -1299
$EndPAD
$EndMODULE SOIC8_208mil
$MODULE SOL18_P_300_1_27
Po 0 0 0 15 4FE37CE1 00000000 ~~
Li SOL18_P_300_1_27
Sc 0
AR
Op 0 0 0
T0 -2874 0 393 393 900 78 N V 21 N "SOL18_P_300_1_27"
T1 0 0 393 393 0 78 N I 21 N "VAL**"
DS -2441 -2441 2441 -2441 100 26
DS 2441 -2441 2441 2441 100 26
DS 2441 2441 -2441 2441 100 26
DS -2441 2441 -2441 -2441 100 26
DS -2283 -197 -2087 -197 100 21
DS -2087 -197 -2087 197 100 21
DS -2087 197 -2283 197 100 21
DS -2283 -1496 2283 -1496 100 21
DS 2283 -1496 2283 1496 100 21
DS 2283 1496 -2283 1496 100 21
DS -2283 1496 -2283 -1496 100 21
DS -2283 -197 -2087 -197 100 27
DS -2087 -197 -2087 197 100 27
DS -2087 197 -2283 197 100 27
DS -2283 1496 2283 1496 100 27
DS 2283 1496 2283 -1496 100 27
DS 2283 -1496 -2283 -1496 100 27
DS -2283 -1496 -2283 1496 100 27
$PAD
Sh "1" R 201 512 0 0 0
Dr 0 0 0
At SMD N 00888000
Ne 0 ""
Po -2000 2028
$EndPAD
$PAD
Sh "2" R 201 512 0 0 0
Dr 0 0 0
At SMD N 00888000
Ne 0 ""
Po -1500 2028
$EndPAD
$PAD
Sh "3" R 201 512 0 0 0
Dr 0 0 0
At SMD N 00888000
Ne 0 ""
Po -1000 2028
$EndPAD
$PAD
Sh "4" R 201 512 0 0 0
Dr 0 0 0
At SMD N 00888000
Ne 0 ""
Po -500 2028
$EndPAD
$PAD
Sh "5" R 201 512 0 0 0
Dr 0 0 0
At SMD N 00888000
Ne 0 ""
Po 0 2028
$EndPAD
$PAD
Sh "6" R 201 512 0 0 0
Dr 0 0 0
At SMD N 00888000
Ne 0 ""
Po 500 2028
$EndPAD
$PAD
Sh "7" R 201 512 0 0 0
Dr 0 0 0
At SMD N 00888000
Ne 0 ""
Po 1000 2028
$EndPAD
$PAD
Sh "8" R 201 512 0 0 0
Dr 0 0 0
At SMD N 00888000
Ne 0 ""
Po 1500 2028
$EndPAD
$PAD
Sh "9" R 201 512 0 0 0
Dr 0 0 0
At SMD N 00888000
Ne 0 ""
Po 2000 2028
$EndPAD
$PAD
Sh "10" R 201 512 0 0 0
Dr 0 0 0
At SMD N 00888000
Ne 0 ""
Po 2000 -2028
$EndPAD
$PAD
Sh "11" R 201 512 0 0 0
Dr 0 0 0
At SMD N 00888000
Ne 0 ""
Po 1500 -2028
$EndPAD
$PAD
Sh "12" R 201 512 0 0 0
Dr 0 0 0
At SMD N 00888000
Ne 0 ""
Po 1000 -2028
$EndPAD
$PAD
Sh "13" R 201 512 0 0 0
Dr 0 0 0
At SMD N 00888000
Ne 0 ""
Po 500 -2028
$EndPAD
$PAD
Sh "14" R 201 512 0 0 0
Dr 0 0 0
At SMD N 00888000
Ne 0 ""
Po 0 -2028
$EndPAD
$PAD
Sh "15" R 201 512 0 0 0
Dr 0 0 0
At SMD N 00888000
Ne 0 ""
Po -500 -2028
$EndPAD
$PAD
Sh "16" R 201 512 0 0 0
Dr 0 0 0
At SMD N 00888000
Ne 0 ""
Po -1000 -2028
$EndPAD
$PAD
Sh "17" R 201 512 0 0 0
Dr 0 0 0
At SMD N 00888000
Ne 0 ""
Po -1500 -2028
$EndPAD
$PAD
Sh "18" R 201 512 0 0 0
Dr 0 0 0
At SMD N 00888000
Ne 0 ""
Po -2000 -2028
$EndPAD
$EndMODULE SOL18_P_300_1_27
$MODULE SSOP16
Po 0 0 0 15 4FE37DB4 00000000 ~~
Li SSOP16
Cd SSOP 28 pins
Kw CMS SSOP SMD
Sc 0
AR
Op 0 0 0
.LocalClearance 59
At SMD
T0 -1850 0 472 472 900 100 N V 21 N "SSOP16"
T1 1800 0 472 472 900 100 N I 21 N "Val**"
DS -1299 -197 -1063 -197 100 21
DS -1063 -197 -1063 197 100 21
DS -1063 197 -1299 197 100 21
DS -1299 -945 1299 -945 100 21
DS 1299 -945 1299 945 100 21
DS 1299 945 -1299 945 100 21
DS -1299 945 -1299 -945 100 21
$PAD
Sh "1" R 160 500 0 0 0
Dr 0 0 0
At SMD N 00888000
Ne 0 ""
Po -875 1400
$EndPAD
$PAD
Sh "2" R 160 500 0 0 0
Dr 0 0 0
At SMD N 00888000
Ne 0 ""
Po -625 1400
$EndPAD
$PAD
Sh "3" R 160 500 0 0 0
Dr 0 0 0
At SMD N 00888000
Ne 0 ""
Po -375 1400
$EndPAD
$PAD
Sh "4" R 160 500 0 0 0
Dr 0 0 0
At SMD N 00888000
Ne 0 ""
Po -125 1400
$EndPAD
$PAD
Sh "5" R 160 500 0 0 0
Dr 0 0 0
At SMD N 00888000
Ne 0 ""
Po 125 1400
$EndPAD
$PAD
Sh "6" R 160 500 0 0 0
Dr 0 0 0
At SMD N 00888000
Ne 0 ""
Po 375 1400
$EndPAD
$PAD
Sh "7" R 160 500 0 0 0
Dr 0 0 0
At SMD N 00888000
Ne 0 ""
Po 625 1400
$EndPAD
$PAD
Sh "8" R 160 500 0 0 0
Dr 0 0 0
At SMD N 00888000
Ne 0 ""
Po 875 1400
$EndPAD
$PAD
Sh "9" R 160 500 0 0 0
Dr 0 0 0
At SMD N 00888000
Ne 0 ""
Po 875 -1400
$EndPAD
$PAD
Sh "10" R 160 500 0 0 0
Dr 0 0 0
At SMD N 00888000
Ne 0 ""
Po 625 -1400
$EndPAD
$PAD
Sh "11" R 160 500 0 0 0
Dr 0 0 0
At SMD N 00888000
Ne 0 ""
Po 375 -1400
$EndPAD
$PAD
Sh "12" R 160 500 0 0 0
Dr 0 0 0
At SMD N 00888000
Ne 0 ""
Po 125 -1400
$EndPAD
$PAD
Sh "13" R 160 500 0 0 0
Dr 0 0 0
At SMD N 00888000
Ne 0 ""
Po -125 -1400
$EndPAD
$PAD
Sh "14" R 160 500 0 0 0
Dr 0 0 0
At SMD N 00888000
Ne 0 ""
Po -375 -1400
$EndPAD
$PAD
Sh "15" R 160 500 0 0 0
Dr 0 0 0
At SMD N 00888000
Ne 0 ""
Po -625 -1400
$EndPAD
$PAD
Sh "16" R 160 500 0 0 0
Dr 0 0 0
At SMD N 00888000
Ne 0 ""
Po -875 -1400
$EndPAD
$EndMODULE SSOP16
$MODULE TQFP32_08
Po 0 0 0 15 4FE38594 00000000 ~~
Li TQFP32_08
Sc 0
AR
Op 0 0 0
T0 -1230 -4020 393 393 0 80 N V 21 N "TQFP32_08"
T1 -1200 1500 392 392 0 80 N I 21 N "Value"
DS -2780 -2540 -2780 290 120 21
DS -2530 -2780 250 -2780 120 21
DS 270 300 270 -2740 120 21
DS -2780 300 220 300 120 21
DS -2776 -2550 -2546 -2780 120 21
DC -2368 -2376 -2208 -2276 120 21
$PAD
Sh "8" R 787 177 0 0 0
Dr 0 0 0
At SMD N 00888000
Ne 0 ""
Po -3146 -157
$EndPAD
$PAD
Sh "7" R 787 177 0 0 0
Dr 0 0 0
At SMD N 00888000
Ne 0 ""
Po -3146 -472
$EndPAD
$PAD
Sh "6" R 787 177 0 0 0
Dr 0 0 0
At SMD N 00888000
Ne 0 ""
Po -3146 -787
$EndPAD
$PAD
Sh "5" R 787 177 0 0 0
Dr 0 0 0
At SMD N 00888000
Ne 0 ""
Po -3146 -1102
$EndPAD
$PAD
Sh "4" R 787 177 0 0 0
Dr 0 0 0
At SMD N 00888000
Ne 0 ""
Po -3146 -1417
$EndPAD
$PAD
Sh "3" R 787 177 0 0 0
Dr 0 0 0
At SMD N 00888000
Ne 0 ""
Po -3146 -1732
$EndPAD
$PAD
Sh "2" R 787 177 0 0 0
Dr 0 0 0
At SMD N 00888000
Ne 0 ""
Po -3146 -2047
$EndPAD
$PAD
Sh "1" R 787 177 0 0 0
Dr 0 0 0
At SMD N 00888000
Ne 0 ""
Po -3146 -2362
$EndPAD
$PAD
Sh "24" R 787 177 0 0 0
Dr 0 0 0
At SMD N 00888000
Ne 0 ""
Po 620 -2360
$EndPAD
$PAD
Sh "17" R 787 177 0 0 0
Dr 0 0 0
At SMD N 00888000
Ne 0 ""
Po 620 -150
$EndPAD
$PAD
Sh "18" R 787 177 0 0 0
Dr 0 0 0
At SMD N 00888000
Ne 0 ""
Po 620 -470
$EndPAD
$PAD
Sh "19" R 787 177 0 0 0
Dr 0 0 0
At SMD N 00888000
Ne 0 ""
Po 620 -790
$EndPAD
$PAD
Sh "20" R 787 177 0 0 0
Dr 0 0 0
At SMD N 00888000
Ne 0 ""
Po 620 -1100
$EndPAD
$PAD
Sh "21" R 787 177 0 0 0
Dr 0 0 0
At SMD N 00888000
Ne 0 ""
Po 620 -1420
$EndPAD
$PAD
Sh "22" R 787 177 0 0 0
Dr 0 0 0
At SMD N 00888000
Ne 0 ""
Po 620 -1730
$EndPAD
$PAD
Sh "23" R 787 177 0 0 0
Dr 0 0 0
At SMD N 00888000
Ne 0 ""
Po 620 -2050
$EndPAD
$PAD
Sh "32" R 177 787 0 0 0
Dr 0 0 0
At SMD N 00888000
Ne 0 ""
Po -2362 -3150
$EndPAD
$PAD
Sh "31" R 177 787 0 0 0
Dr 0 0 0
At SMD N 00888000
Ne 0 ""
Po -2048 -3150
$EndPAD
$PAD
Sh "30" R 177 787 0 0 0
Dr 0 0 0
At SMD N 00888000
Ne 0 ""
Po -1732 -3150
$EndPAD
$PAD
Sh "29" R 177 787 0 0 0
Dr 0 0 0
At SMD N 00888000
Ne 0 ""
Po -1418 -3150
$EndPAD
$PAD
Sh "28" R 177 787 0 0 0
Dr 0 0 0
At SMD N 00888000
Ne 0 ""
Po -1102 -3150
$EndPAD
$PAD
Sh "27" R 177 787 0 0 0
Dr 0 0 0
At SMD N 00888000
Ne 0 ""
Po -788 -3150
$EndPAD
$PAD
Sh "26" R 177 787 0 0 0
Dr 0 0 0
At SMD N 00888000
Ne 0 ""
Po -472 -3150
$EndPAD
$PAD
Sh "25" R 177 787 0 0 0
Dr 0 0 0
At SMD N 00888000
Ne 0 ""
Po -158 -3150
$EndPAD
$PAD
Sh "9" R 177 787 0 0 0
Dr 0 0 0
At SMD N 00888000
Ne 0 ""
Po -2360 630
$EndPAD
$PAD
Sh "10" R 177 787 0 0 0
Dr 0 0 0
At SMD N 00888000
Ne 0 ""
Po -2050 630
$EndPAD
$PAD
Sh "11" R 177 787 0 0 0
Dr 0 0 0
At SMD N 00888000
Ne 0 ""
Po -1730 630
$EndPAD
$PAD
Sh "12" R 177 787 0 0 0
Dr 0 0 0
At SMD N 00888000
Ne 0 ""
Po -1420 630
$EndPAD
$PAD
Sh "13" R 177 787 0 0 0
Dr 0 0 0
At SMD N 00888000
Ne 0 ""
Po -1110 630
$EndPAD
$PAD
Sh "14" R 177 787 0 0 0
Dr 0 0 0
At SMD N 00888000
Ne 0 ""
Po -790 630
$EndPAD
$PAD
Sh "15" R 177 787 0 0 0
Dr 0 0 0
At SMD N 00888000
Ne 0 ""
Po -470 630
$EndPAD
$PAD
Sh "16" R 177 787 0 0 0
Dr 0 0 0
At SMD N 00888000
Ne 0 ""
Po -150 630
$EndPAD
$EndMODULE TQFP32_08
$MODULE TQFP44_08
Po 0 0 0 15 4FE385D0 00000000 ~~
Li TQFP44_08
Sc 0
AR
Op 0 0 0
T0 0 -3200 393 393 0 80 N V 21 N "TQFP44_08"
T1 0 0 392 392 0 80 N I 21 N "Value"
DS -2010 1940 1980 1940 120 21
DS -2000 -1780 -2000 1930 120 21
DS 1990 -1980 1990 1910 120 21
DS -1750 -1990 1980 -1990 120 21
DS -1996 -1770 -1766 -2000 120 21
DC -1588 -1596 -1428 -1496 120 21
$PAD
Sh "8" R 787 177 0 0 0
Dr 0 0 0
At SMD N 00888000
Ne 0 ""
Po -2366 623
$EndPAD
$PAD
Sh "7" R 787 177 0 0 0
Dr 0 0 0
At SMD N 00888000
Ne 0 ""
Po -2366 308
$EndPAD
$PAD
Sh "6" R 787 177 0 0 0
Dr 0 0 0
At SMD N 00888000
Ne 0 ""
Po -2366 -7
$EndPAD
$PAD
Sh "5" R 787 177 0 0 0
Dr 0 0 0
At SMD N 00888000
Ne 0 ""
Po -2366 -322
$EndPAD
$PAD
Sh "4" R 787 177 0 0 0
Dr 0 0 0
At SMD N 00888000
Ne 0 ""
Po -2366 -637
$EndPAD
$PAD
Sh "3" R 787 177 0 0 0
Dr 0 0 0
At SMD N 00888000
Ne 0 ""
Po -2366 -952
$EndPAD
$PAD
Sh "2" R 787 177 0 0 0
Dr 0 0 0
At SMD N 00888000
Ne 0 ""
Po -2366 -1267
$EndPAD
$PAD
Sh "1" R 787 177 0 0 0
Dr 0 0 0
At SMD N 00888000
Ne 0 ""
Po -2366 -1582
$EndPAD
$PAD
Sh "33" R 787 177 0 0 0
Dr 0 0 0
At SMD N 00888000
Ne 0 ""
Po 2380 -1582
$EndPAD
$PAD
Sh "9" R 787 177 0 0 0
Dr 0 0 0
At SMD N 00888000
Ne 0 ""
Po -2366 941
$EndPAD
$PAD
Sh "10" R 787 177 0 0 0
Dr 0 0 0
At SMD N 00888000
Ne 0 ""
Po -2366 1256
$EndPAD
$PAD
Sh "11" R 787 177 0 0 0
Dr 0 0 0
At SMD N 00888000
Ne 0 ""
Po -2366 1571
$EndPAD
$PAD
Sh "23" R 787 177 0 0 0
Dr 0 0 0
At SMD N 00888000
Ne 0 ""
Po 2380 1571
$EndPAD
$PAD
Sh "24" R 787 177 0 0 0
Dr 0 0 0
At SMD N 00888000
Ne 0 ""
Po 2380 1256
$EndPAD
$PAD
Sh "25" R 787 177 0 0 0
Dr 0 0 0
At SMD N 00888000
Ne 0 ""
Po 2380 941
$EndPAD
$PAD
Sh "26" R 787 177 0 0 0
Dr 0 0 0
At SMD N 00888000
Ne 0 ""
Po 2380 623
$EndPAD
$PAD
Sh "27" R 787 177 0 0 0
Dr 0 0 0
At SMD N 00888000
Ne 0 ""
Po 2380 308
$EndPAD
$PAD
Sh "28" R 787 177 0 0 0
Dr 0 0 0
At SMD N 00888000
Ne 0 ""
Po 2380 -7
$EndPAD
$PAD
Sh "29" R 787 177 0 0 0
Dr 0 0 0
At SMD N 00888000
Ne 0 ""
Po 2380 -322
$EndPAD
$PAD
Sh "30" R 787 177 0 0 0
Dr 0 0 0
At SMD N 00888000
Ne 0 ""
Po 2380 -637
$EndPAD
$PAD
Sh "31" R 787 177 0 0 0
Dr 0 0 0
At SMD N 00888000
Ne 0 ""
Po 2380 -952
$EndPAD
$PAD
Sh "32" R 787 177 0 0 0
Dr 0 0 0
At SMD N 00888000
Ne 0 ""
Po 2380 -1267
$EndPAD
$PAD
Sh "44" R 177 787 0 0 0
Dr 0 0 0
At SMD N 00888000
Ne 0 ""
Po -1582 -2370
$EndPAD
$PAD
Sh "43" R 177 787 0 0 0
Dr 0 0 0
At SMD N 00888000
Ne 0 ""
Po -1268 -2370
$EndPAD
$PAD
Sh "42" R 177 787 0 0 0
Dr 0 0 0
At SMD N 00888000
Ne 0 ""
Po -952 -2370
$EndPAD
$PAD
Sh "41" R 177 787 0 0 0
Dr 0 0 0
At SMD N 00888000
Ne 0 ""
Po -638 -2370
$EndPAD
$PAD
Sh "40" R 177 787 0 0 0
Dr 0 0 0
At SMD N 00888000
Ne 0 ""
Po -322 -2370
$EndPAD
$PAD
Sh "39" R 177 787 0 0 0
Dr 0 0 0
At SMD N 00888000
Ne 0 ""
Po -8 -2370
$EndPAD
$PAD
Sh "36" R 177 787 0 0 0
Dr 0 0 0
At SMD N 00888000
Ne 0 ""
Po 938 -2370
$EndPAD
$PAD
Sh "34" R 177 787 0 0 0
Dr 0 0 0
At SMD N 00888000
Ne 0 ""
Po 1568 -2370
$EndPAD
$PAD
Sh "38" R 177 787 0 0 0
Dr 0 0 0
At SMD N 00888000
Ne 0 ""
Po 308 -2370
$EndPAD
$PAD
Sh "37" R 177 787 0 0 0
Dr 0 0 0
At SMD N 00888000
Ne 0 ""
Po 622 -2370
$EndPAD
$PAD
Sh "35" R 177 787 0 0 0
Dr 0 0 0
At SMD N 00888000
Ne 0 ""
Po 1252 -2370
$EndPAD
$PAD
Sh "12" R 177 787 0 0 0
Dr 0 0 0
At SMD N 00888000
Ne 0 ""
Po -1592 2340
$EndPAD
$PAD
Sh "13" R 177 787 0 0 0
Dr 0 0 0
At SMD N 00888000
Ne 0 ""
Po -1278 2340
$EndPAD
$PAD
Sh "14" R 177 787 0 0 0
Dr 0 0 0
At SMD N 00888000
Ne 0 ""
Po -962 2340
$EndPAD
$PAD
Sh "15" R 177 787 0 0 0
Dr 0 0 0
At SMD N 00888000
Ne 0 ""
Po -648 2340
$EndPAD
$PAD
Sh "16" R 177 787 0 0 0
Dr 0 0 0
At SMD N 00888000
Ne 0 ""
Po -332 2340
$EndPAD
$PAD
Sh "17" R 177 787 0 0 0
Dr 0 0 0
At SMD N 00888000
Ne 0 ""
Po -18 2340
$EndPAD
$PAD
Sh "18" R 177 787 0 0 0
Dr 0 0 0
At SMD N 00888000
Ne 0 ""
Po 298 2340
$EndPAD
$PAD
Sh "19" R 177 787 0 0 0
Dr 0 0 0
At SMD N 00888000
Ne 0 ""
Po 612 2340
$EndPAD
$PAD
Sh "20" R 177 787 0 0 0
Dr 0 0 0
At SMD N 00888000
Ne 0 ""
Po 928 2340
$EndPAD
$PAD
Sh "21" R 177 787 0 0 0
Dr 0 0 0
At SMD N 00888000
Ne 0 ""
Po 1242 2340
$EndPAD
$PAD
Sh "22" R 177 787 0 0 0
Dr 0 0 0
At SMD N 00888000
Ne 0 ""
Po 1558 2340
$EndPAD
$SHAPE3D
Na "smd/vqfp64.wrl"
Sc 0.615 0.615 0.35
Of 0 0 0
Ro 0 0 90
$EndSHAPE3D
$EndMODULE TQFP44_08
$MODULE TQFP48
Po 0 0 0 15 4FE37E17 00000000 ~~
Li TQFP48
Sc 0
AR
Op 0 0 0
.LocalClearance 59
T0 0 -2677 315 315 0 78 N V 21 N "TQFP48"
T1 0 -3150 315 315 0 78 N I 21 N "VAL**"
DS -2047 1339 -2047 2047 150 21
DS -2047 2047 -1339 2047 150 21
DS -1339 -2047 -2047 -2047 150 21
DS -2047 -2047 -2047 -1339 150 21
DS 2047 -1339 2047 -2047 150 21
DS 2047 -2047 1339 -2047 150 21
DS 1339 2047 2047 2047 150 21
DS 2047 2047 2047 1339 150 21
DC -1654 1654 -1614 1496 150 21
$PAD
Sh "1" R 118 630 0 0 0
Dr 0 0 0
At SMD N 00888000
Ne 0 ""
Po -1083 1614
$EndPAD
$PAD
Sh "2" R 118 630 0 0 0
Dr 0 0 0
At SMD N 00888000
Ne 0 ""
Po -886 1614
$EndPAD
$PAD
Sh "3" R 118 630 0 0 0
Dr 0 0 0
At SMD N 00888000
Ne 0 ""
Po -689 1614
$EndPAD
$PAD
Sh "4" R 118 630 0 0 0
Dr 0 0 0
At SMD N 00888000
Ne 0 ""
Po -492 1614
$EndPAD
$PAD
Sh "5" R 118 630 0 0 0
Dr 0 0 0
At SMD N 00888000
Ne 0 ""
Po -296 1614
$EndPAD
$PAD
Sh "6" R 118 630 0 0 0
Dr 0 0 0
At SMD N 00888000
Ne 0 ""
Po -99 1614
$EndPAD
$PAD
Sh "7" R 118 630 0 0 0
Dr 0 0 0
At SMD N 00888000
Ne 0 ""
Po 98 1614
$EndPAD
$PAD
Sh "8" R 118 630 0 0 0
Dr 0 0 0
At SMD N 00888000
Ne 0 ""
Po 295 1614
$EndPAD
$PAD
Sh "9" R 118 630 0 0 0
Dr 0 0 0
At SMD N 00888000
Ne 0 ""
Po 492 1614
$EndPAD
$PAD
Sh "10" R 118 630 0 0 0
Dr 0 0 0
At SMD N 00888000
Ne 0 ""
Po 689 1614
$EndPAD
$PAD
Sh "11" R 118 630 0 0 0
Dr 0 0 0
At SMD N 00888000
Ne 0 ""
Po 886 1614
$EndPAD
$PAD
Sh "12" R 118 630 0 0 0
Dr 0 0 0
At SMD N 00888000
Ne 0 ""
Po 1082 1614
$EndPAD
$PAD
Sh "25" R 118 630 0 0 0
Dr 0 0 0
At SMD N 00888000
Ne 0 ""
Po 1082 -1614
$EndPAD
$PAD
Sh "26" R 118 630 0 0 0
Dr 0 0 0
At SMD N 00888000
Ne 0 ""
Po 886 -1614
$EndPAD
$PAD
Sh "27" R 118 630 0 0 0
Dr 0 0 0
At SMD N 00888000
Ne 0 ""
Po 689 -1614
$EndPAD
$PAD
Sh "28" R 118 630 0 0 0
Dr 0 0 0
At SMD N 00888000
Ne 0 ""
Po 492 -1614
$EndPAD
$PAD
Sh "29" R 118 630 0 0 0
Dr 0 0 0
At SMD N 00888000
Ne 0 ""
Po 295 -1614
$EndPAD
$PAD
Sh "30" R 118 630 0 0 0
Dr 0 0 0
At SMD N 00888000
Ne 0 ""
Po 98 -1614
$EndPAD
$PAD
Sh "31" R 118 630 0 0 0
Dr 0 0 0
At SMD N 00888000
Ne 0 ""
Po -99 -1614
$EndPAD
$PAD
Sh "32" R 118 630 0 0 0
Dr 0 0 0
At SMD N 00888000
Ne 0 ""
Po -296 -1614
$EndPAD
$PAD
Sh "33" R 118 630 0 0 0
Dr 0 0 0
At SMD N 00888000
Ne 0 ""
Po -492 -1614
$EndPAD
$PAD
Sh "34" R 118 630 0 0 0
Dr 0 0 0
At SMD N 00888000
Ne 0 ""
Po -689 -1614
$EndPAD
$PAD
Sh "35" R 118 630 0 0 0
Dr 0 0 0
At SMD N 00888000
Ne 0 ""
Po -886 -1614
$EndPAD
$PAD
Sh "36" R 118 630 0 0 0
Dr 0 0 0
At SMD N 00888000
Ne 0 ""
Po -1083 -1614
$EndPAD
$PAD
Sh "13" R 630 118 0 0 0
Dr 0 0 0
At SMD N 00888000
Ne 0 ""
Po 1614 1083
$EndPAD
$PAD
Sh "14" R 630 118 0 0 0
Dr 0 0 0
At SMD N 00888000
Ne 0 ""
Po 1614 886
$EndPAD
$PAD
Sh "15" R 630 118 0 0 0
Dr 0 0 0
At SMD N 00888000
Ne 0 ""
Po 1614 689
$EndPAD
$PAD
Sh "16" R 630 118 0 0 0
Dr 0 0 0
At SMD N 00888000
Ne 0 ""
Po 1614 492
$EndPAD
$PAD
Sh "17" R 630 118 0 0 0
Dr 0 0 0
At SMD N 00888000
Ne 0 ""
Po 1614 295
$EndPAD
$PAD
Sh "18" R 630 118 0 0 0
Dr 0 0 0
At SMD N 00888000
Ne 0 ""
Po 1614 98
$EndPAD
$PAD
Sh "19" R 630 118 0 0 0
Dr 0 0 0
At SMD N 00888000
Ne 0 ""
Po 1614 -98
$EndPAD
$PAD
Sh "20" R 630 118 0 0 0
Dr 0 0 0
At SMD N 00888000
Ne 0 ""
Po 1614 -295
$EndPAD
$PAD
Sh "21" R 630 118 0 0 0
Dr 0 0 0
At SMD N 00888000
Ne 0 ""
Po 1614 -492
$EndPAD
$PAD
Sh "22" R 630 118 0 0 0
Dr 0 0 0
At SMD N 00888000
Ne 0 ""
Po 1614 -689
$EndPAD
$PAD
Sh "23" R 630 118 0 0 0
Dr 0 0 0
At SMD N 00888000
Ne 0 ""
Po 1614 -886
$EndPAD
$PAD
Sh "24" R 630 118 0 0 0
Dr 0 0 0
At SMD N 00888000
Ne 0 ""
Po 1614 -1083
$EndPAD
$PAD
Sh "37" R 630 118 0 0 0
Dr 0 0 0
At SMD N 00888000
Ne 0 ""
Po -1614 -1083
$EndPAD
$PAD
Sh "38" R 630 118 0 0 0
Dr 0 0 0
At SMD N 00888000
Ne 0 ""
Po -1614 -886
$EndPAD
$PAD
Sh "39" R 630 118 0 0 0
Dr 0 0 0
At SMD N 00888000
Ne 0 ""
Po -1614 -689
$EndPAD
$PAD
Sh "40" R 630 118 0 0 0
Dr 0 0 0
At SMD N 00888000
Ne 0 ""
Po -1614 -492
$EndPAD
$PAD
Sh "41" R 630 118 0 0 0
Dr 0 0 0
At SMD N 00888000
Ne 0 ""
Po -1614 -295
$EndPAD
$PAD
Sh "42" R 630 118 0 0 0
Dr 0 0 0
At SMD N 00888000
Ne 0 ""
Po -1614 -98
$EndPAD
$PAD
Sh "43" R 630 118 0 0 0
Dr 0 0 0
At SMD N 00888000
Ne 0 ""
Po -1614 98
$EndPAD
$PAD
Sh "44" R 630 118 0 0 0
Dr 0 0 0
At SMD N 00888000
Ne 0 ""
Po -1614 295
$EndPAD
$PAD
Sh "45" R 630 118 0 0 0
Dr 0 0 0
At SMD N 00888000
Ne 0 ""
Po -1614 492
$EndPAD
$PAD
Sh "46" R 630 118 0 0 0
Dr 0 0 0
At SMD N 00888000
Ne 0 ""
Po -1614 689
$EndPAD
$PAD
Sh "47" R 630 118 0 0 0
Dr 0 0 0
At SMD N 00888000
Ne 0 ""
Po -1614 886
$EndPAD
$PAD
Sh "48" R 630 118 0 0 0
Dr 0 0 0
At SMD N 00888000
Ne 0 ""
Po -1614 1083
$EndPAD
$EndMODULE TQFP48
$MODULE TQFP64_08
Po 0 0 0 15 4FE3861E 00000000 ~~
Li TQFP64_08
Kw AVR
Sc 0
AR
Op 0 0 0
T0 0 -4100 393 393 0 80 N V 21 N "TQFP64_08"
T1 0 0 393 393 0 80 N I 21 N "Value"
DS -2776 -2550 -2778 2780 120 21
DS 2784 -2780 -2550 -2780 120 21
DS -2776 -2550 -2546 -2780 120 21
DC -2368 -2376 -2208 -2276 120 21
DS 2784 -2780 2784 2780 120 21
DS -2776 2780 2784 2780 120 21
$PAD
Sh "8" R 787 177 0 0 0
Dr 0 0 0
At SMD N 00888000
Ne 0 ""
Po -3146 -157
$EndPAD
$PAD
Sh "7" R 787 177 0 0 0
Dr 0 0 0
At SMD N 00888000
Ne 0 ""
Po -3146 -472
$EndPAD
$PAD
Sh "6" R 787 177 0 0 0
Dr 0 0 0
At SMD N 00888000
Ne 0 ""
Po -3146 -787
$EndPAD
$PAD
Sh "5" R 787 177 0 0 0
Dr 0 0 0
At SMD N 00888000
Ne 0 ""
Po -3146 -1102
$EndPAD
$PAD
Sh "4" R 787 177 0 0 0
Dr 0 0 0
At SMD N 00888000
Ne 0 ""
Po -3146 -1417
$EndPAD
$PAD
Sh "3" R 787 177 0 0 0
Dr 0 0 0
At SMD N 00888000
Ne 0 ""
Po -3146 -1732
$EndPAD
$PAD
Sh "2" R 787 177 0 0 0
Dr 0 0 0
At SMD N 00888000
Ne 0 ""
Po -3146 -2047
$EndPAD
$PAD
Sh "1" R 787 177 0 0 0
Dr 0 0 0
At SMD N 00888000
Ne 0 ""
Po -3146 -2362
$EndPAD
$PAD
Sh "16" R 787 177 0 0 0
Dr 0 0 0
At SMD N 00888000
Ne 0 ""
Po -3146 2366
$EndPAD
$PAD
Sh "33" R 787 177 0 0 0
Dr 0 0 0
At SMD N 00888000
Ne 0 ""
Po 3150 2366
$EndPAD
$PAD
Sh "48" R 787 177 0 0 0
Dr 0 0 0
At SMD N 00888000
Ne 0 ""
Po 3150 -2362
$EndPAD
$PAD
Sh "9" R 787 177 0 0 0
Dr 0 0 0
At SMD N 00888000
Ne 0 ""
Po -3146 161
$EndPAD
$PAD
Sh "10" R 787 177 0 0 0
Dr 0 0 0
At SMD N 00888000
Ne 0 ""
Po -3146 476
$EndPAD
$PAD
Sh "11" R 787 177 0 0 0
Dr 0 0 0
At SMD N 00888000
Ne 0 ""
Po -3146 791
$EndPAD
$PAD
Sh "12" R 787 177 0 0 0
Dr 0 0 0
At SMD N 00888000
Ne 0 ""
Po -3146 1106
$EndPAD
$PAD
Sh "13" R 787 177 0 0 0
Dr 0 0 0
At SMD N 00888000
Ne 0 ""
Po -3146 1421
$EndPAD
$PAD
Sh "14" R 787 177 0 0 0
Dr 0 0 0
At SMD N 00888000
Ne 0 ""
Po -3146 1736
$EndPAD
$PAD
Sh "15" R 787 177 0 0 0
Dr 0 0 0
At SMD N 00888000
Ne 0 ""
Po -3146 2051
$EndPAD
$PAD
Sh "34" R 787 177 0 0 0
Dr 0 0 0
At SMD N 00888000
Ne 0 ""
Po 3150 2051
$EndPAD
$PAD
Sh "35" R 787 177 0 0 0
Dr 0 0 0
At SMD N 00888000
Ne 0 ""
Po 3150 1736
$EndPAD
$PAD
Sh "36" R 787 177 0 0 0
Dr 0 0 0
At SMD N 00888000
Ne 0 ""
Po 3150 1421
$EndPAD
$PAD
Sh "37" R 787 177 0 0 0
Dr 0 0 0
At SMD N 00888000
Ne 0 ""
Po 3150 1106
$EndPAD
$PAD
Sh "38" R 787 177 0 0 0
Dr 0 0 0
At SMD N 00888000
Ne 0 ""
Po 3150 791
$EndPAD
$PAD
Sh "39" R 787 177 0 0 0
Dr 0 0 0
At SMD N 00888000
Ne 0 ""
Po 3150 476
$EndPAD
$PAD
Sh "40" R 787 177 0 0 0
Dr 0 0 0
At SMD N 00888000
Ne 0 ""
Po 3150 161
$EndPAD
$PAD
Sh "41" R 787 177 0 0 0
Dr 0 0 0
At SMD N 00888000
Ne 0 ""
Po 3150 -157
$EndPAD
$PAD
Sh "42" R 787 177 0 0 0
Dr 0 0 0
At SMD N 00888000
Ne 0 ""
Po 3150 -472
$EndPAD
$PAD
Sh "43" R 787 177 0 0 0
Dr 0 0 0
At SMD N 00888000
Ne 0 ""
Po 3150 -787
$EndPAD
$PAD
Sh "44" R 787 177 0 0 0
Dr 0 0 0
At SMD N 00888000
Ne 0 ""
Po 3150 -1102
$EndPAD
$PAD
Sh "45" R 787 177 0 0 0
Dr 0 0 0
At SMD N 00888000
Ne 0 ""
Po 3150 -1417
$EndPAD
$PAD
Sh "46" R 787 177 0 0 0
Dr 0 0 0
At SMD N 00888000
Ne 0 ""
Po 3150 -1732
$EndPAD
$PAD
Sh "47" R 787 177 0 0 0
Dr 0 0 0
At SMD N 00888000
Ne 0 ""
Po 3150 -2047
$EndPAD
$PAD
Sh "64" R 177 787 0 0 0
Dr 0 0 0
At SMD N 00888000
Ne 0 ""
Po -2362 -3150
$EndPAD
$PAD
Sh "63" R 177 787 0 0 0
Dr 0 0 0
At SMD N 00888000
Ne 0 ""
Po -2048 -3150
$EndPAD
$PAD
Sh "62" R 177 787 0 0 0
Dr 0 0 0
At SMD N 00888000
Ne 0 ""
Po -1732 -3150
$EndPAD
$PAD
Sh "61" R 177 787 0 0 0
Dr 0 0 0
At SMD N 00888000
Ne 0 ""
Po -1418 -3150
$EndPAD
$PAD
Sh "60" R 177 787 0 0 0
Dr 0 0 0
At SMD N 00888000
Ne 0 ""
Po -1102 -3150
$EndPAD
$PAD
Sh "59" R 177 787 0 0 0
Dr 0 0 0
At SMD N 00888000
Ne 0 ""
Po -788 -3150
$EndPAD
$PAD
Sh "56" R 177 787 0 0 0
Dr 0 0 0
At SMD N 00888000
Ne 0 ""
Po 158 -3150
$EndPAD
$PAD
Sh "54" R 177 787 0 0 0
Dr 0 0 0
At SMD N 00888000
Ne 0 ""
Po 788 -3150
$EndPAD
$PAD
Sh "53" R 177 787 0 0 0
Dr 0 0 0
At SMD N 00888000
Ne 0 ""
Po 1102 -3150
$EndPAD
$PAD
Sh "58" R 177 787 0 0 0
Dr 0 0 0
At SMD N 00888000
Ne 0 ""
Po -472 -3150
$EndPAD
$PAD
Sh "57" R 177 787 0 0 0
Dr 0 0 0
At SMD N 00888000
Ne 0 ""
Po -158 -3150
$EndPAD
$PAD
Sh "55" R 177 787 0 0 0
Dr 0 0 0
At SMD N 00888000
Ne 0 ""
Po 472 -3150
$EndPAD
$PAD
Sh "52" R 177 787 0 0 0
Dr 0 0 0
At SMD N 00888000
Ne 0 ""
Po 1418 -3150
$EndPAD
$PAD
Sh "51" R 177 787 0 0 0
Dr 0 0 0
At SMD N 00888000
Ne 0 ""
Po 1732 -3150
$EndPAD
$PAD
Sh "50" R 177 787 0 0 0
Dr 0 0 0
At SMD N 00888000
Ne 0 ""
Po 2048 -3150
$EndPAD
$PAD
Sh "49" R 177 787 0 0 0
Dr 0 0 0
At SMD N 00888000
Ne 0 ""
Po 2362 -3150
$EndPAD
$PAD
Sh "17" R 177 787 0 0 0
Dr 0 0 0
At SMD N 00888000
Ne 0 ""
Po -2362 3150
$EndPAD
$PAD
Sh "18" R 177 787 0 0 0
Dr 0 0 0
At SMD N 00888000
Ne 0 ""
Po -2048 3150
$EndPAD
$PAD
Sh "19" R 177 787 0 0 0
Dr 0 0 0
At SMD N 00888000
Ne 0 ""
Po -1732 3150
$EndPAD
$PAD
Sh "20" R 177 787 0 0 0
Dr 0 0 0
At SMD N 00888000
Ne 0 ""
Po -1418 3150
$EndPAD
$PAD
Sh "21" R 177 787 0 0 0
Dr 0 0 0
At SMD N 00888000
Ne 0 ""
Po -1102 3150
$EndPAD
$PAD
Sh "22" R 177 787 0 0 0
Dr 0 0 0
At SMD N 00888000
Ne 0 ""
Po -788 3150
$EndPAD
$PAD
Sh "23" R 177 787 0 0 0
Dr 0 0 0
At SMD N 00888000
Ne 0 ""
Po -472 3150
$EndPAD
$PAD
Sh "24" R 177 787 0 0 0
Dr 0 0 0
At SMD N 00888000
Ne 0 ""
Po -158 3150
$EndPAD
$PAD
Sh "25" R 177 787 0 0 0
Dr 0 0 0
At SMD N 00888000
Ne 0 ""
Po 158 3150
$EndPAD
$PAD
Sh "26" R 177 787 0 0 0
Dr 0 0 0
At SMD N 00888000
Ne 0 ""
Po 472 3150
$EndPAD
$PAD
Sh "27" R 177 787 0 0 0
Dr 0 0 0
At SMD N 00888000
Ne 0 ""
Po 788 3150
$EndPAD
$PAD
Sh "28" R 177 787 0 0 0
Dr 0 0 0
At SMD N 00888000
Ne 0 ""
Po 1102 3150
$EndPAD
$PAD
Sh "29" R 177 787 0 0 0
Dr 0 0 0
At SMD N 00888000
Ne 0 ""
Po 1418 3150
$EndPAD
$PAD
Sh "30" R 177 787 0 0 0
Dr 0 0 0
At SMD N 00888000
Ne 0 ""
Po 1732 3150
$EndPAD
$PAD
Sh "31" R 177 787 0 0 0
Dr 0 0 0
At SMD N 00888000
Ne 0 ""
Po 2048 3150
$EndPAD
$PAD
Sh "32" R 177 787 0 0 0
Dr 0 0 0
At SMD N 00888000
Ne 0 ""
Po 2362 3150
$EndPAD
$SHAPE3D
Na "smd/vqfp64.wrl"
Sc 0.615 0.615 0.35
Of 0 0 0
Ro 0 0 90
$EndSHAPE3D
$EndMODULE TQFP64_08
$MODULE TSSOIC28
Po 0 0 0 15 4FE38642 00000000 ~~
Li TSSOIC28
Cd Smd module Tssoic24
Kw CMS TSSOIC
Sc 0
AR
Op 0 0 0
At SMD
T0 0 -1900 393 393 0 78 N V 21 N "TSSOIC28"
T1 100 0 393 393 0 78 N I 21 N "Value"
DS 1656 1240 1656 960 79 21
DS 1400 1232 1400 960 79 21
DS 1144 1224 1144 968 79 21
DS 1144 968 1144 976 79 21
DS 888 1232 888 960 79 21
DS 632 1216 632 968 79 21
DS 632 968 640 968 79 21
DS 376 1224 376 960 79 21
DS 120 1224 120 960 79 21
DS -136 1216 -136 960 79 21
DS -392 1232 -392 968 79 21
DS -656 1232 -656 944 79 21
DS -912 1224 -912 952 79 21
DS -912 952 -920 952 79 21
DS -1168 1232 -1168 960 79 21
DS -1424 1232 -1424 944 79 21
DS -1672 1232 -1672 944 79 21
DS -1672 944 -1664 944 79 21
DS 1656 -1232 1656 -928 79 21
DS 1400 -1224 1400 -928 79 21
DS 1144 -1232 1144 -920 79 21
DS 888 -1232 888 -928 79 21
DS 624 -1240 624 -928 79 21
DS 376 -1224 376 -936 79 21
DS 120 -1232 120 -936 79 21
DS -144 -1232 -144 -928 79 21
DS -392 -1224 -392 -912 79 21
DS -664 -1232 -664 -928 79 21
DS -904 -1232 -904 -920 79 21
DS -1168 -1232 -1168 -920 79 21
DS -1432 -1232 -1432 -928 79 21
DS -1680 -912 -1680 -1232 79 21
DS 2048 928 2048 -904 79 21
DS 2048 -904 -2040 -912 79 21
DS -2040 -912 -2040 920 79 21
DS -2024 928 2048 920 79 21
DS -2024 872 -2004 872 79 21
DC -1824 682 -1924 582 79 21
DS -2016 -290 -1716 -290 79 21
DS -1708 -290 -1708 210 79 21
DS -1708 210 -2008 210 79 21
$PAD
Sh "1" R 160 500 0 0 0
Dr 0 0 0
At SMD N 00888000
Ne 0 ""
Po -1674 1232
$EndPAD
$PAD
Sh "2" R 160 500 0 0 0
Dr 0 0 0
At SMD N 00888000
Ne 0 ""
Po -1424 1232
$EndPAD
$PAD
Sh "3" R 160 500 0 0 0
Dr 0 0 0
At SMD N 00888000
Ne 0 ""
Po -1164 1232
$EndPAD
$PAD
Sh "4" R 160 500 0 0 0
Dr 0 0 0
At SMD N 00888000
Ne 0 ""
Po -904 1232
$EndPAD
$PAD
Sh "5" R 160 500 0 0 0
Dr 0 0 0
At SMD N 00888000
Ne 0 ""
Po -654 1232
$EndPAD
$PAD
Sh "6" R 160 500 0 0 0
Dr 0 0 0
At SMD N 00888000
Ne 0 ""
Po -394 1232
$EndPAD
$PAD
Sh "7" R 160 500 0 0 0
Dr 0 0 0
At SMD N 00888000
Ne 0 ""
Po -134 1232
$EndPAD
$PAD
Sh "8" R 160 500 0 0 0
Dr 0 0 0
At SMD N 00888000
Ne 0 ""
Po 116 1232
$EndPAD
$PAD
Sh "9" R 160 500 0 0 0
Dr 0 0 0
At SMD N 00888000
Ne 0 ""
Po 376 1232
$EndPAD
$PAD
Sh "10" R 160 500 0 0 0
Dr 0 0 0
At SMD N 00888000
Ne 0 ""
Po 626 1232
$EndPAD
$PAD
Sh "11" R 160 500 0 0 0
Dr 0 0 0
At SMD N 00888000
Ne 0 ""
Po 886 1232
$EndPAD
$PAD
Sh "12" R 160 500 0 0 0
Dr 0 0 0
At SMD N 00888000
Ne 1 "GND"
Po 1146 1232
$EndPAD
$PAD
Sh "17" R 160 500 0 0 0
Dr 0 0 0
At SMD N 00888000
Ne 0 ""
Po 1144 -1240
$EndPAD
$PAD
Sh "18" R 160 500 0 0 0
Dr 0 0 0
At SMD N 00888000
Ne 0 ""
Po 886 -1240
$EndPAD
$PAD
Sh "19" R 160 500 0 0 0
Dr 0 0 0
At SMD N 00888000
Ne 0 ""
Po 626 -1240
$EndPAD
$PAD
Sh "20" R 160 500 0 0 0
Dr 0 0 0
At SMD N 00888000
Ne 0 ""
Po 376 -1240
$EndPAD
$PAD
Sh "21" R 160 500 0 0 0
Dr 0 0 0
At SMD N 00888000
Ne 0 ""
Po 116 -1240
$EndPAD
$PAD
Sh "22" R 160 500 0 0 0
Dr 0 0 0
At SMD N 00888000
Ne 0 ""
Po -134 -1240
$EndPAD
$PAD
Sh "23" R 160 500 0 0 0
Dr 0 0 0
At SMD N 00888000
Ne 0 ""
Po -394 -1240
$EndPAD
$PAD
Sh "24" R 160 500 0 0 0
Dr 0 0 0
At SMD N 00888000
Ne 0 ""
Po -654 -1240
$EndPAD
$PAD
Sh "25" R 160 500 0 0 0
Dr 0 0 0
At SMD N 00888000
Ne 0 ""
Po -904 -1240
$EndPAD
$PAD
Sh "26" R 160 500 0 0 0
Dr 0 0 0
At SMD N 00888000
Ne 0 ""
Po -1164 -1240
$EndPAD
$PAD
Sh "27" R 160 500 0 0 0
Dr 0 0 0
At SMD N 00888000
Ne 0 ""
Po -1424 -1240
$EndPAD
$PAD
Sh "28" R 160 500 0 0 0
Dr 0 0 0
At SMD N 00888000
Ne 2 "VCC"
Po -1674 -1240
$EndPAD
$PAD
Sh "13" R 160 500 0 0 0
Dr 0 0 0
At SMD N 00888000
Ne 0 ""
Po 1400 1232
$EndPAD
$PAD
Sh "14" R 160 500 0 0 0
Dr 0 0 0
At SMD N 00888000
Ne 0 ""
Po 1656 1232
$EndPAD
$PAD
Sh "16" R 160 500 0 0 0
Dr 0 0 0
At SMD N 00888000
Ne 0 ""
Po 1400 -1240
$EndPAD
$PAD
Sh "15" R 160 500 0 0 0
Dr 0 0 0
At SMD N 00888000
Ne 0 ""
Po 1656 -1240
$EndPAD
$SHAPE3D
Na "smd/cms_soj28.wrl"
Sc 0.255 0.45 0.3
Of 0 0 0
Ro 0 0 0
$EndSHAPE3D
$EndMODULE TSSOIC28
$MODULE VDFN8
Po 0 0 0 15 4FE37E8C 00000000 ~~
Li VDFN8
Sc 0
AR
Op 0 0 0
T0 0 -1480 315 315 0 78 N V 21 N "VDFN8"
T1 0 1300 315 315 0 78 N I 21 N "VAL**"
DC -1339 -1535 -1339 -1693 150 21
DS 1181 1181 1575 1181 150 21
DS 1575 1181 1575 984 150 21
DS -1575 984 -1575 1181 150 21
DS -1575 1181 -1181 1181 150 21
DS 1181 -1181 1575 -1181 150 21
DS 1575 -1181 1575 -984 150 21
DS -1575 -984 -1575 -1181 150 21
DS -1575 -1181 -1181 -1181 150 21
$PAD
Sh "9" R 1339 1575 0 0 0
Dr 0 0 0
At SMD N 00888000
Ne 0 ""
Po 0 0
$EndPAD
$PAD
Sh "1" R 472 197 0 0 0
Dr 0 0 0
At SMD N 00888000
Ne 0 ""
Po -1181 -750
$EndPAD
$PAD
Sh "2" R 472 197 0 0 0
Dr 0 0 0
At SMD N 00888000
Ne 0 ""
Po -1181 -250
$EndPAD
$PAD
Sh "3" R 472 197 0 0 0
Dr 0 0 0
At SMD N 00888000
Ne 0 ""
Po -1181 250
$EndPAD
$PAD
Sh "4" R 472 197 0 0 0
Dr 0 0 0
At SMD N 00888000
Ne 0 ""
Po -1181 750
$EndPAD
$PAD
Sh "6" R 472 197 0 0 0
Dr 0 0 0
At SMD N 00888000
Ne 0 ""
Po 1181 250
$EndPAD
$PAD
Sh "7" R 472 197 0 0 0
Dr 0 0 0
At SMD N 00888000
Ne 0 ""
Po 1181 -250
$EndPAD
$PAD
Sh "8" R 472 197 0 0 0
Dr 0 0 0
At SMD N 00888000
Ne 0 ""
Po 1181 -750
$EndPAD
$PAD
Sh "5" R 472 197 0 0 0
Dr 0 0 0
At SMD N 00888000
Ne 0 ""
Po 1181 750
$EndPAD
$EndMODULE VDFN8
$MODULE 6DIP-ELL300G
Po 0 0 0 15 4FE38A0E 00000000 ~~
Li 6DIP-ELL300G
Cd Module Dil 6 pins, pads elliptiques
Kw DIL
Sc 00000000
AR
Op 0 0 0
T0 -2244 0 394 394 900 79 N V 21 N "6DIP-ELL300G"
T1 0 0 394 394 0 79 N I 21 N "Value"
DS -1750 -1000 1750 -1000 150 21
DS 1750 -1000 1750 1000 150 21
DS 1750 1000 -1750 1000 150 21
DS -1750 1000 -1750 -1000 150 21
DS -1750 -250 -1250 -250 150 21
DS -1250 -250 -1250 250 150 21
DS -1250 250 -1750 250 150 21
$PAD
Sh "1" R 700 1500 0 0 0
Dr 320 0 0
At STD N 00E0FFFF
Ne 0 ""
Po -1000 1500
$EndPAD
$PAD
Sh "2" O 700 1500 0 0 0
Dr 320 0 0
At STD N 00E0FFFF
Ne 0 ""
Po 0 1500
$EndPAD
$PAD
Sh "3" O 700 1500 0 0 0
Dr 320 0 0
At STD N 00E0FFFF
Ne 0 ""
Po 1000 1500
$EndPAD
$PAD
Sh "4" O 700 1500 0 0 0
Dr 320 0 0
At STD N 00E0FFFF
Ne 0 ""
Po 1000 -1500
$EndPAD
$PAD
Sh "5" O 700 1500 0 0 0
Dr 320 0 0
At STD N 00E0FFFF
Ne 0 ""
Po 0 -1500
$EndPAD
$PAD
Sh "6" O 700 1500 0 0 0
Dr 320 0 0
At STD N 00E0FFFF
Ne 0 ""
Po -1000 -1500
$EndPAD
$SHAPE3D
Na "dil/dil_6.wrl"
Sc 1.000000 1.000000 1.000000
Of 0.000000 0.000000 0.000000
Ro 0.000000 0.000000 0.000000
$EndSHAPE3D
$EndMODULE  6DIP-ELL300G
$MODULE 4403
Po 0 0 0 15 4FE38A45 00000000 ~~
Li 4403
Cd Transistor TO92 brochage type 4403
Kw TR TO92
Sc 00000000
AR 
Op 0 0 0
T0 0 -1890 400 400 0 80 N V 21 N "4403"
T1 0 1457 400 400 0 80 N I 21 N "Value"
DS -500 1000 1000 -500 120 21
DS 1000 -500 1000 -1000 120 21
DS 1000 -1000 500 -1500 120 21
DS 500 -1500 -500 -1500 120 21
DS -500 -1500 -1500 -500 120 21
DS -1500 -500 -1500 500 120 21
DS -1500 500 -1000 1000 120 21
DS -1000 1000 -500 1000 120 21
$PAD
Sh "1" R 800 800 0 0 0
Dr 250 0 0
At STD N 00E0FFFF
Ne 0 ""
Po -500 500
$EndPAD
$PAD
Sh "2" C 800 800 0 0 0
Dr 250 0 0
At STD N 00E0FFFF
Ne 0 ""
Po -500 -500
$EndPAD
$PAD
Sh "3" C 800 800 0 0 0
Dr 250 0 0
At STD N 00E0FFFF
Ne 0 ""
Po 500 -500
$EndPAD
$SHAPE3D
Na "discret/to98.wrl"
Sc 1.000000 1.000000 1.000000
Of 0.000000 0.000000 0.000000
Ro 0.000000 0.000000 0.000000
$EndSHAPE3D
$EndMODULE  4403
$EndLIBRARY
