PCBNEW-LibModule-V1  Út 12. červen 2012, 19:18:12 CEST
# encoding utf-8
Units deci-mils
$INDEX
DIPS-DS01
DIPS-DS02
DIPS-DS03
DIPS-DS04
DIPS-DS05
DIPS-DS06
DIPS-DS07
DIPS-DS08
DIPS-DS09
DIPS-DS10
DIPS-DS12
SWDIP10
SWDIP12
$EndINDEX
$MODULE DIPS-DS01
Po 0 0 0 15 4FB00D64 00000000 ~~
Li DIPS-DS01
Kw dip switch
Sc 0
AR 
Op 0 0 0
T0 -1378 0 600 600 900 120 N V 21 N "DIPS-DS01"
T1 1575 0 600 600 900 120 N I 21 N "VAL**"
DS -800 -2000 -800 2000 150 21
DS -800 2000 800 2000 150 21
DS -800 -2000 800 -2000 150 21
DS 800 -2000 800 2000 150 21
$PAD
Sh "1" C 700 700 0 0 0
Dr 250 0 0
At STD N 00E0FFFF
Ne 0 ""
Po 0 1500
$EndPAD
$PAD
Sh "2" C 700 700 0 0 0
Dr 250 0 0
At STD N 00E0FFFF
Ne 0 ""
Po 0 -1500
$EndPAD
$SHAPE3D
Na "Switch\\DIP\\dips-ds01.wrl"
Sc 1 1 1
Of 0 0 0
Ro 0 0 0
$EndSHAPE3D
$EndMODULE DIPS-DS01
$MODULE DIPS-DS02
Po 0 0 0 15 4FB00E30 00000000 ~~
Li DIPS-DS02
Kw dip switch
Sc 0
AR 
Op 0 0 0
T0 -1870 0 600 600 900 120 N V 21 N "DIPS-DS02"
T1 1969 0 600 600 900 120 N I 21 N "VAL**"
DS 1300 2000 -1300 2000 150 21
DS -1300 -2000 1300 -2000 150 21
DS -1300 -2000 -1300 2000 150 21
DS 1300 -2000 1300 2000 150 21
$PAD
Sh "1" C 591 591 0 0 0
Dr 250 0 0
At STD N 00E0FFFF
Ne 0 ""
Po -500 1500
$EndPAD
$PAD
Sh "2" C 591 591 0 0 0
Dr 250 0 0
At STD N 00E0FFFF
Ne 0 ""
Po 500 1500
$EndPAD
$PAD
Sh "3" C 591 591 0 0 0
Dr 250 0 0
At STD N 00E0FFFF
Ne 0 ""
Po 500 -1500
$EndPAD
$PAD
Sh "4" C 591 591 0 0 0
Dr 250 0 0
At STD N 00E0FFFF
Ne 0 ""
Po -500 -1500
$EndPAD
$SHAPE3D
Na "Switch\\DIP\\dips-ds02.wrl"
Sc 1 1 1
Of 0 0 0
Ro 0 0 0
$EndSHAPE3D
$EndMODULE DIPS-DS02
$MODULE DIPS-DS03
Po 0 0 0 15 4FB00E7D 00000000 ~~
Li DIPS-DS03
Kw dip switch
Sc 0
AR 
Op 0 0 0
T0 0 -2559 600 600 0 120 N V 21 N "DIPS-DS03"
T1 0 2756 600 600 0 120 N I 21 N "VAL**"
DS 1800 2000 -1800 2000 150 21
DS -1800 -2000 1800 -2000 150 21
DS -1800 -2000 -1800 2000 150 21
DS 1800 -2000 1800 2000 150 21
$PAD
Sh "1" C 591 591 0 0 0
Dr 250 0 0
At STD N 00E0FFFF
Ne 0 ""
Po -1000 1500
$EndPAD
$PAD
Sh "2" C 591 591 0 0 0
Dr 250 0 0
At STD N 00E0FFFF
Ne 0 ""
Po 0 1500
$EndPAD
$PAD
Sh "3" C 591 591 0 0 0
Dr 250 0 0
At STD N 00E0FFFF
Ne 0 ""
Po 1000 1500
$EndPAD
$PAD
Sh "4" C 591 591 0 0 0
Dr 250 0 0
At STD N 00E0FFFF
Ne 0 ""
Po 1000 -1500
$EndPAD
$PAD
Sh "5" C 591 591 0 0 0
Dr 250 0 0
At STD N 00E0FFFF
Ne 0 ""
Po 0 -1500
$EndPAD
$PAD
Sh "6" C 591 591 0 0 0
Dr 250 0 0
At STD N 00E0FFFF
Ne 0 ""
Po -1000 -1500
$EndPAD
$SHAPE3D
Na "Switch\\DIP\\dips-ds03.wrl"
Sc 1 1 1
Of 0 0 0
Ro 0 0 0
$EndSHAPE3D
$EndMODULE DIPS-DS03
$MODULE DIPS-DS04
Po 0 0 0 15 4FB00EBA 00000000 ~~
Li DIPS-DS04
Kw dip switch
Sc 0
AR 
Op 0 0 0
T0 0 -2559 600 600 0 120 N V 21 N "DIPS-DS04"
T1 0 2756 600 600 0 120 N I 21 N "VAL**"
DS 2300 2000 -2300 2000 150 21
DS -2300 -2000 2300 -2000 150 21
DS -2300 -2000 -2300 2000 150 21
DS 2300 -2000 2300 2000 150 21
$PAD
Sh "1" C 591 591 0 0 0
Dr 250 0 0
At STD N 00E0FFFF
Ne 0 ""
Po -1500 1500
$EndPAD
$PAD
Sh "2" C 591 591 0 0 0
Dr 250 0 0
At STD N 00E0FFFF
Ne 0 ""
Po -500 1500
$EndPAD
$PAD
Sh "3" C 591 591 0 0 0
Dr 250 0 0
At STD N 00E0FFFF
Ne 0 ""
Po 500 1500
$EndPAD
$PAD
Sh "4" C 591 591 0 0 0
Dr 250 0 0
At STD N 00E0FFFF
Ne 0 ""
Po 1500 1500
$EndPAD
$PAD
Sh "5" C 591 591 0 0 0
Dr 250 0 0
At STD N 00E0FFFF
Ne 0 ""
Po 1500 -1500
$EndPAD
$PAD
Sh "6" C 591 591 0 0 0
Dr 250 0 0
At STD N 00E0FFFF
Ne 0 ""
Po 500 -1500
$EndPAD
$PAD
Sh "7" C 591 591 0 0 0
Dr 250 0 0
At STD N 00E0FFFF
Ne 0 ""
Po -500 -1500
$EndPAD
$PAD
Sh "8" C 591 591 0 0 0
Dr 250 0 0
At STD N 00E0FFFF
Ne 0 ""
Po -1500 -1500
$EndPAD
$SHAPE3D
Na "Switch\\DIP\\dips-ds04.wrl"
Sc 1 1 1
Of 0 0 0
Ro 0 0 0
$EndSHAPE3D
$EndMODULE DIPS-DS04
$MODULE DIPS-DS05
Po 0 0 0 15 4FB00EE8 00000000 ~~
Li DIPS-DS05
Kw dip switch
Sc 0
AR 
Op 0 0 0
T0 0 -2559 600 600 0 120 N V 21 N "DIPS-DS05"
T1 0 0 600 600 0 120 N I 21 N "VAL**"
DS 2800 2000 -2800 2000 150 21
DS -2800 -2000 2800 -2000 150 21
DS -2800 -2000 -2800 2000 150 21
DS 2800 -2000 2800 2000 150 21
$PAD
Sh "1" C 591 591 0 0 0
Dr 250 0 0
At STD N 00E0FFFF
Ne 0 ""
Po -2000 1500
$EndPAD
$PAD
Sh "2" C 591 591 0 0 0
Dr 250 0 0
At STD N 00E0FFFF
Ne 0 ""
Po -1000 1500
$EndPAD
$PAD
Sh "3" C 591 591 0 0 0
Dr 250 0 0
At STD N 00E0FFFF
Ne 0 ""
Po 0 1500
$EndPAD
$PAD
Sh "4" C 591 591 0 0 0
Dr 250 0 0
At STD N 00E0FFFF
Ne 0 ""
Po 1000 1500
$EndPAD
$PAD
Sh "5" C 591 591 0 0 0
Dr 250 0 0
At STD N 00E0FFFF
Ne 0 ""
Po 2000 1500
$EndPAD
$PAD
Sh "6" C 591 591 0 0 0
Dr 250 0 0
At STD N 00E0FFFF
Ne 0 ""
Po 2000 -1500
$EndPAD
$PAD
Sh "7" C 591 591 0 0 0
Dr 250 0 0
At STD N 00E0FFFF
Ne 0 ""
Po 1000 -1500
$EndPAD
$PAD
Sh "8" C 591 591 0 0 0
Dr 250 0 0
At STD N 00E0FFFF
Ne 0 ""
Po 0 -1500
$EndPAD
$PAD
Sh "9" C 591 591 0 0 0
Dr 250 0 0
At STD N 00E0FFFF
Ne 0 ""
Po -1000 -1500
$EndPAD
$PAD
Sh "10" C 591 591 0 0 0
Dr 250 0 0
At STD N 00E0FFFF
Ne 0 ""
Po -2000 -1500
$EndPAD
$SHAPE3D
Na "Switch\\DIP\\dips-ds05.wrl"
Sc 1 1 1
Of 0 0 0
Ro 0 0 0
$EndSHAPE3D
$EndMODULE DIPS-DS05
$MODULE DIPS-DS06
Po 0 0 0 15 4FB00F13 00000000 ~~
Li DIPS-DS06
Kw dip switch
Sc 0
AR 
Op 0 0 0
T0 0 -2657 600 600 0 120 N V 21 N "DIPS-DS06"
T1 0 0 600 600 0 120 N I 21 N "VAL**"
DS 3300 2000 -3300 2000 150 21
DS 3300 -2000 -3300 -2000 150 21
DS -3300 -2000 -3300 2000 150 21
DS 3300 -2000 3300 2000 150 21
$PAD
Sh "1" C 591 591 0 0 0
Dr 250 0 0
At STD N 00E0FFFF
Ne 0 ""
Po -2500 1500
$EndPAD
$PAD
Sh "2" C 591 591 0 0 0
Dr 250 0 0
At STD N 00E0FFFF
Ne 0 ""
Po -1500 1500
$EndPAD
$PAD
Sh "3" C 591 591 0 0 0
Dr 250 0 0
At STD N 00E0FFFF
Ne 0 ""
Po -500 1500
$EndPAD
$PAD
Sh "4" C 591 591 0 0 0
Dr 250 0 0
At STD N 00E0FFFF
Ne 0 ""
Po 500 1500
$EndPAD
$PAD
Sh "5" C 591 591 0 0 0
Dr 250 0 0
At STD N 00E0FFFF
Ne 0 ""
Po 1500 1500
$EndPAD
$PAD
Sh "6" C 591 591 0 0 0
Dr 250 0 0
At STD N 00E0FFFF
Ne 0 ""
Po 2500 1500
$EndPAD
$PAD
Sh "7" C 591 591 0 0 0
Dr 250 0 0
At STD N 00E0FFFF
Ne 0 ""
Po 2500 -1500
$EndPAD
$PAD
Sh "8" C 591 591 0 0 0
Dr 250 0 0
At STD N 00E0FFFF
Ne 0 ""
Po 1500 -1500
$EndPAD
$PAD
Sh "9" C 591 591 0 0 0
Dr 250 0 0
At STD N 00E0FFFF
Ne 0 ""
Po 500 -1500
$EndPAD
$PAD
Sh "10" C 591 591 0 0 0
Dr 250 0 0
At STD N 00E0FFFF
Ne 0 ""
Po -500 -1500
$EndPAD
$PAD
Sh "11" C 591 591 0 0 0
Dr 250 0 0
At STD N 00E0FFFF
Ne 0 ""
Po -1500 -1500
$EndPAD
$PAD
Sh "12" C 591 591 0 0 0
Dr 250 0 0
At STD N 00E0FFFF
Ne 0 ""
Po -2500 -1500
$EndPAD
$SHAPE3D
Na "Switch\\DIP\\dips-ds06.wrl"
Sc 1 1 1
Of 0 0 0
Ro 0 0 0
$EndSHAPE3D
$EndMODULE DIPS-DS06
$MODULE DIPS-DS07
Po 0 0 0 15 4FB00F4A 00000000 ~~
Li DIPS-DS07
Kw dip switch
Sc 0
AR 
Op 0 0 0
T0 0 -2559 600 600 0 120 N V 21 N "DIPS-DS07"
T1 0 0 600 600 0 120 N I 21 N "VAL**"
DS 3800 2000 -3800 2000 150 21
DS -3800 -2000 3800 -2000 150 21
DS -3800 -2000 -3800 2000 150 21
DS 3800 -2000 3800 2000 150 21
$PAD
Sh "1" C 591 591 0 0 0
Dr 250 0 0
At STD N 00E0FFFF
Ne 0 ""
Po -3000 1500
$EndPAD
$PAD
Sh "2" C 591 591 0 0 0
Dr 250 0 0
At STD N 00E0FFFF
Ne 0 ""
Po -2000 1500
$EndPAD
$PAD
Sh "3" C 591 591 0 0 0
Dr 250 0 0
At STD N 00E0FFFF
Ne 0 ""
Po -1000 1500
$EndPAD
$PAD
Sh "4" C 591 591 0 0 0
Dr 250 0 0
At STD N 00E0FFFF
Ne 0 ""
Po 0 1500
$EndPAD
$PAD
Sh "5" C 591 591 0 0 0
Dr 250 0 0
At STD N 00E0FFFF
Ne 0 ""
Po 1000 1500
$EndPAD
$PAD
Sh "6" C 591 591 0 0 0
Dr 250 0 0
At STD N 00E0FFFF
Ne 0 ""
Po 2000 1500
$EndPAD
$PAD
Sh "7" C 591 591 0 0 0
Dr 250 0 0
At STD N 00E0FFFF
Ne 0 ""
Po 3000 1500
$EndPAD
$PAD
Sh "8" C 591 591 0 0 0
Dr 250 0 0
At STD N 00E0FFFF
Ne 0 ""
Po 3000 -1500
$EndPAD
$PAD
Sh "9" C 591 591 0 0 0
Dr 250 0 0
At STD N 00E0FFFF
Ne 0 ""
Po 2000 -1500
$EndPAD
$PAD
Sh "10" C 591 591 0 0 0
Dr 250 0 0
At STD N 00E0FFFF
Ne 0 ""
Po 1000 -1500
$EndPAD
$PAD
Sh "11" C 591 591 0 0 0
Dr 250 0 0
At STD N 00E0FFFF
Ne 0 ""
Po 0 -1500
$EndPAD
$PAD
Sh "12" C 591 591 0 0 0
Dr 250 0 0
At STD N 00E0FFFF
Ne 0 ""
Po -1000 -1500
$EndPAD
$PAD
Sh "13" C 591 591 0 0 0
Dr 250 0 0
At STD N 00E0FFFF
Ne 0 ""
Po -2000 -1500
$EndPAD
$PAD
Sh "14" C 591 591 0 0 0
Dr 250 0 0
At STD N 00E0FFFF
Ne 0 ""
Po -3000 -1500
$EndPAD
$SHAPE3D
Na "Switch\\DIP\\dips-ds07.wrl"
Sc 1 1 1
Of 0 0 0
Ro 0 0 0
$EndSHAPE3D
$EndMODULE DIPS-DS07
$MODULE DIPS-DS08
Po 0 0 0 15 4FB00F74 00000000 ~~
Li DIPS-DS08
Kw dip switch
Sc 0
AR 
Op 0 0 0
T0 0 -2559 600 600 0 120 N V 21 N "DIPS-DS08"
T1 0 0 600 600 0 120 N I 21 N "VAL**"
DS 4300 2000 -4300 2000 150 21
DS -4300 -2000 4300 -2000 150 21
DS -4300 -2000 -4300 2000 150 21
DS 4300 -2000 4300 2000 150 21
$PAD
Sh "1" C 591 591 0 0 0
Dr 250 0 0
At STD N 00E0FFFF
Ne 0 ""
Po -3500 1500
$EndPAD
$PAD
Sh "2" C 591 591 0 0 0
Dr 250 0 0
At STD N 00E0FFFF
Ne 0 ""
Po -2500 1500
$EndPAD
$PAD
Sh "3" C 591 591 0 0 0
Dr 250 0 0
At STD N 00E0FFFF
Ne 0 ""
Po -1500 1500
$EndPAD
$PAD
Sh "4" C 591 591 0 0 0
Dr 250 0 0
At STD N 00E0FFFF
Ne 0 ""
Po -500 1500
$EndPAD
$PAD
Sh "5" C 591 591 0 0 0
Dr 250 0 0
At STD N 00E0FFFF
Ne 0 ""
Po 500 1500
$EndPAD
$PAD
Sh "6" C 591 591 0 0 0
Dr 250 0 0
At STD N 00E0FFFF
Ne 0 ""
Po 1500 1500
$EndPAD
$PAD
Sh "7" C 591 591 0 0 0
Dr 250 0 0
At STD N 00E0FFFF
Ne 0 ""
Po 2500 1500
$EndPAD
$PAD
Sh "8" C 591 591 0 0 0
Dr 250 0 0
At STD N 00E0FFFF
Ne 0 ""
Po 3500 1500
$EndPAD
$PAD
Sh "9" C 591 591 0 0 0
Dr 250 0 0
At STD N 00E0FFFF
Ne 0 ""
Po 3500 -1500
$EndPAD
$PAD
Sh "10" C 591 591 0 0 0
Dr 250 0 0
At STD N 00E0FFFF
Ne 0 ""
Po 2500 -1500
$EndPAD
$PAD
Sh "11" C 591 591 0 0 0
Dr 250 0 0
At STD N 00E0FFFF
Ne 0 ""
Po 1500 -1500
$EndPAD
$PAD
Sh "12" C 591 591 0 0 0
Dr 250 0 0
At STD N 00E0FFFF
Ne 0 ""
Po 500 -1500
$EndPAD
$PAD
Sh "13" C 591 591 0 0 0
Dr 250 0 0
At STD N 00E0FFFF
Ne 0 ""
Po -500 -1500
$EndPAD
$PAD
Sh "14" C 591 591 0 0 0
Dr 250 0 0
At STD N 00E0FFFF
Ne 0 ""
Po -1500 -1500
$EndPAD
$PAD
Sh "15" C 591 591 0 0 0
Dr 250 0 0
At STD N 00E0FFFF
Ne 0 ""
Po -2500 -1500
$EndPAD
$PAD
Sh "16" C 591 591 0 0 0
Dr 250 0 0
At STD N 00E0FFFF
Ne 0 ""
Po -3500 -1500
$EndPAD
$SHAPE3D
Na "Switch\\DIP\\dips-ds08.wrl"
Sc 1 1 1
Of 0 0 0
Ro 0 0 0
$EndSHAPE3D
$EndMODULE DIPS-DS08
$MODULE DIPS-DS09
Po 0 0 0 15 4FB00F98 00000000 ~~
Li DIPS-DS09
Kw dip switch
Sc 0
AR 
Op 0 0 0
T0 0 -2559 600 600 0 120 N V 21 N "DIPS-DS09"
T1 0 0 600 600 0 120 N I 21 N "VAL**"
DS 4800 -2000 -4800 -2000 150 21
DS 4800 2000 -4800 2000 150 21
DS -4800 -2000 -4800 2000 150 21
DS 4800 -2000 4800 2000 150 21
$PAD
Sh "1" C 591 591 0 0 0
Dr 250 0 0
At STD N 00E0FFFF
Ne 0 ""
Po -4000 1500
$EndPAD
$PAD
Sh "2" C 591 591 0 0 0
Dr 250 0 0
At STD N 00E0FFFF
Ne 0 ""
Po -3000 1500
$EndPAD
$PAD
Sh "3" C 591 591 0 0 0
Dr 250 0 0
At STD N 00E0FFFF
Ne 0 ""
Po -2000 1500
$EndPAD
$PAD
Sh "4" C 591 591 0 0 0
Dr 250 0 0
At STD N 00E0FFFF
Ne 0 ""
Po -1000 1500
$EndPAD
$PAD
Sh "5" C 591 591 0 0 0
Dr 250 0 0
At STD N 00E0FFFF
Ne 0 ""
Po 0 1500
$EndPAD
$PAD
Sh "6" C 591 591 0 0 0
Dr 250 0 0
At STD N 00E0FFFF
Ne 0 ""
Po 1000 1500
$EndPAD
$PAD
Sh "7" C 591 591 0 0 0
Dr 250 0 0
At STD N 00E0FFFF
Ne 0 ""
Po 2000 1500
$EndPAD
$PAD
Sh "8" C 591 591 0 0 0
Dr 250 0 0
At STD N 00E0FFFF
Ne 0 ""
Po 3000 1500
$EndPAD
$PAD
Sh "9" C 591 591 0 0 0
Dr 250 0 0
At STD N 00E0FFFF
Ne 0 ""
Po 4000 1500
$EndPAD
$PAD
Sh "10" C 591 591 0 0 0
Dr 250 0 0
At STD N 00E0FFFF
Ne 0 ""
Po 4000 -1500
$EndPAD
$PAD
Sh "11" C 591 591 0 0 0
Dr 250 0 0
At STD N 00E0FFFF
Ne 0 ""
Po 3000 -1500
$EndPAD
$PAD
Sh "12" C 591 591 0 0 0
Dr 250 0 0
At STD N 00E0FFFF
Ne 0 ""
Po 2000 -1500
$EndPAD
$PAD
Sh "13" C 591 591 0 0 0
Dr 250 0 0
At STD N 00E0FFFF
Ne 0 ""
Po 1000 -1500
$EndPAD
$PAD
Sh "14" C 591 591 0 0 0
Dr 250 0 0
At STD N 00E0FFFF
Ne 0 ""
Po 0 -1500
$EndPAD
$PAD
Sh "15" C 591 591 0 0 0
Dr 250 0 0
At STD N 00E0FFFF
Ne 0 ""
Po -1000 -1500
$EndPAD
$PAD
Sh "16" C 591 591 0 0 0
Dr 250 0 0
At STD N 00E0FFFF
Ne 0 ""
Po -2000 -1500
$EndPAD
$PAD
Sh "17" C 591 591 0 0 0
Dr 250 0 0
At STD N 00E0FFFF
Ne 0 ""
Po -3000 -1500
$EndPAD
$PAD
Sh "18" C 591 591 0 0 0
Dr 250 0 0
At STD N 00E0FFFF
Ne 0 ""
Po -4000 -1500
$EndPAD
$SHAPE3D
Na "Switch\\DIP\\dips-ds09.wrl"
Sc 1 1 1
Of 0 0 0
Ro 0 0 0
$EndSHAPE3D
$EndMODULE DIPS-DS09
$MODULE DIPS-DS10
Po 0 0 0 15 4FB00FBF 00000000 ~~
Li DIPS-DS10
Kw dip switch
Sc 0
AR 
Op 0 0 0
T0 0 -2559 600 600 0 120 N V 21 N "DIPS-DS10"
T1 0 0 600 600 0 120 N I 21 N "VAL**"
DS 5300 2000 -5300 2000 150 21
DS 5300 -2000 -5300 -2000 150 21
DS -5300 -2000 -5300 2000 150 21
DS 5300 -2000 5300 2000 150 21
$PAD
Sh "1" C 591 591 0 0 0
Dr 250 0 0
At STD N 00E0FFFF
Ne 0 ""
Po -4500 1500
$EndPAD
$PAD
Sh "2" C 591 591 0 0 0
Dr 250 0 0
At STD N 00E0FFFF
Ne 0 ""
Po -3500 1500
$EndPAD
$PAD
Sh "3" C 591 591 0 0 0
Dr 250 0 0
At STD N 00E0FFFF
Ne 0 ""
Po -2500 1500
$EndPAD
$PAD
Sh "4" C 591 591 0 0 0
Dr 250 0 0
At STD N 00E0FFFF
Ne 0 ""
Po -1500 1500
$EndPAD
$PAD
Sh "5" C 591 591 0 0 0
Dr 250 0 0
At STD N 00E0FFFF
Ne 0 ""
Po -500 1500
$EndPAD
$PAD
Sh "6" C 591 591 0 0 0
Dr 250 0 0
At STD N 00E0FFFF
Ne 0 ""
Po 500 1500
$EndPAD
$PAD
Sh "7" C 591 591 0 0 0
Dr 250 0 0
At STD N 00E0FFFF
Ne 0 ""
Po 1500 1500
$EndPAD
$PAD
Sh "8" C 591 591 0 0 0
Dr 250 0 0
At STD N 00E0FFFF
Ne 0 ""
Po 2500 1500
$EndPAD
$PAD
Sh "9" C 591 591 0 0 0
Dr 250 0 0
At STD N 00E0FFFF
Ne 0 ""
Po 3500 1500
$EndPAD
$PAD
Sh "10" C 591 591 0 0 0
Dr 250 0 0
At STD N 00E0FFFF
Ne 0 ""
Po 4500 1500
$EndPAD
$PAD
Sh "11" C 591 591 0 0 0
Dr 250 0 0
At STD N 00E0FFFF
Ne 0 ""
Po 4500 -1500
$EndPAD
$PAD
Sh "12" C 591 591 0 0 0
Dr 250 0 0
At STD N 00E0FFFF
Ne 0 ""
Po 3500 -1500
$EndPAD
$PAD
Sh "13" C 591 591 0 0 0
Dr 250 0 0
At STD N 00E0FFFF
Ne 0 ""
Po 2500 -1500
$EndPAD
$PAD
Sh "14" C 591 591 0 0 0
Dr 250 0 0
At STD N 00E0FFFF
Ne 0 ""
Po 1500 -1500
$EndPAD
$PAD
Sh "15" C 591 591 0 0 0
Dr 250 0 0
At STD N 00E0FFFF
Ne 0 ""
Po 500 -1500
$EndPAD
$PAD
Sh "16" C 591 591 0 0 0
Dr 250 0 0
At STD N 00E0FFFF
Ne 0 ""
Po -500 -1500
$EndPAD
$PAD
Sh "17" C 591 591 0 0 0
Dr 250 0 0
At STD N 00E0FFFF
Ne 0 ""
Po -1500 -1500
$EndPAD
$PAD
Sh "18" C 591 591 0 0 0
Dr 250 0 0
At STD N 00E0FFFF
Ne 0 ""
Po -2500 -1500
$EndPAD
$PAD
Sh "19" C 591 591 0 0 0
Dr 250 0 0
At STD N 00E0FFFF
Ne 0 ""
Po -3500 -1500
$EndPAD
$PAD
Sh "20" C 591 591 0 0 0
Dr 250 0 0
At STD N 00E0FFFF
Ne 0 ""
Po -4500 -1500
$EndPAD
$SHAPE3D
Na "Switch\\DIP\\dips-ds10.wrl"
Sc 1 1 1
Of 0 0 0
Ro 0 0 0
$EndSHAPE3D
$EndMODULE DIPS-DS10
$MODULE DIPS-DS12
Po 0 0 0 15 4FB00FE4 00000000 ~~
Li DIPS-DS12
Kw dip switch
Sc 0
AR 
Op 0 0 0
T0 0 -2559 600 600 0 120 N V 21 N "DIPS-DS12"
T1 0 0 600 600 0 120 N I 21 N "VAL**"
DS 6300 2000 -6300 2000 150 21
DS -6300 -2000 6300 -2000 150 21
DS 6300 -2000 6300 2000 150 21
DS -6300 -2000 -6300 2000 150 21
$PAD
Sh "1" C 591 591 0 0 0
Dr 250 0 0
At STD N 00E0FFFF
Ne 0 ""
Po -5500 1500
$EndPAD
$PAD
Sh "2" C 591 591 0 0 0
Dr 250 0 0
At STD N 00E0FFFF
Ne 0 ""
Po -4500 1500
$EndPAD
$PAD
Sh "3" C 591 591 0 0 0
Dr 250 0 0
At STD N 00E0FFFF
Ne 0 ""
Po -3500 1500
$EndPAD
$PAD
Sh "4" C 591 591 0 0 0
Dr 250 0 0
At STD N 00E0FFFF
Ne 0 ""
Po -2500 1500
$EndPAD
$PAD
Sh "5" C 591 591 0 0 0
Dr 250 0 0
At STD N 00E0FFFF
Ne 0 ""
Po -1500 1500
$EndPAD
$PAD
Sh "6" C 591 591 0 0 0
Dr 250 0 0
At STD N 00E0FFFF
Ne 0 ""
Po -500 1500
$EndPAD
$PAD
Sh "7" C 591 591 0 0 0
Dr 250 0 0
At STD N 00E0FFFF
Ne 0 ""
Po 500 1500
$EndPAD
$PAD
Sh "8" C 591 591 0 0 0
Dr 250 0 0
At STD N 00E0FFFF
Ne 0 ""
Po 1500 1500
$EndPAD
$PAD
Sh "9" C 591 591 0 0 0
Dr 250 0 0
At STD N 00E0FFFF
Ne 0 ""
Po 2500 1500
$EndPAD
$PAD
Sh "10" C 591 591 0 0 0
Dr 250 0 0
At STD N 00E0FFFF
Ne 0 ""
Po 3500 1500
$EndPAD
$PAD
Sh "11" C 591 591 0 0 0
Dr 250 0 0
At STD N 00E0FFFF
Ne 0 ""
Po 4500 1500
$EndPAD
$PAD
Sh "12" C 591 591 0 0 0
Dr 250 0 0
At STD N 00E0FFFF
Ne 0 ""
Po 5500 1500
$EndPAD
$PAD
Sh "13" C 591 591 0 0 0
Dr 250 0 0
At STD N 00E0FFFF
Ne 0 ""
Po 5500 -1500
$EndPAD
$PAD
Sh "14" C 591 591 0 0 0
Dr 250 0 0
At STD N 00E0FFFF
Ne 0 ""
Po 4500 -1500
$EndPAD
$PAD
Sh "15" C 591 591 0 0 0
Dr 250 0 0
At STD N 00E0FFFF
Ne 0 ""
Po 3500 -1500
$EndPAD
$PAD
Sh "16" C 591 591 0 0 0
Dr 250 0 0
At STD N 00E0FFFF
Ne 0 ""
Po 2500 -1500
$EndPAD
$PAD
Sh "17" C 591 591 0 0 0
Dr 250 0 0
At STD N 00E0FFFF
Ne 0 ""
Po 1500 -1500
$EndPAD
$PAD
Sh "18" C 591 591 0 0 0
Dr 250 0 0
At STD N 00E0FFFF
Ne 0 ""
Po 500 -1500
$EndPAD
$PAD
Sh "19" C 591 591 0 0 0
Dr 250 0 0
At STD N 00E0FFFF
Ne 0 ""
Po -500 -1500
$EndPAD
$PAD
Sh "20" C 591 591 0 0 0
Dr 250 0 0
At STD N 00E0FFFF
Ne 0 ""
Po -1500 -1500
$EndPAD
$PAD
Sh "21" C 591 591 0 0 0
Dr 250 0 0
At STD N 00E0FFFF
Ne 0 ""
Po -2500 -1500
$EndPAD
$PAD
Sh "22" C 591 591 0 0 0
Dr 250 0 0
At STD N 00E0FFFF
Ne 0 ""
Po -3500 -1500
$EndPAD
$PAD
Sh "23" C 591 591 0 0 0
Dr 250 0 0
At STD N 00E0FFFF
Ne 0 ""
Po -4500 -1500
$EndPAD
$PAD
Sh "24" C 591 591 0 0 0
Dr 250 0 0
At STD N 00E0FFFF
Ne 0 ""
Po -5500 -1500
$EndPAD
$SHAPE3D
Na "Switch\\DIP\\dips-ds12.wrl"
Sc 1 1 1
Of 0 0 0
Ro 0 0 0
$EndSHAPE3D
$EndMODULE DIPS-DS12
$MODULE SWDIP10
Po 0 0 0 15 4FD777BB 00000000 ~~
Li SWDIP10
Cd Switch Dil 8 elements
Kw SWITCH DEV
Sc 0
AR 
Op 0 0 0
T0 0 -2500 393 393 0 78 N V 21 N "SWDIP10"
T1 0 0 392 392 0 77 N I 21 N "Value"
DS 3000 500 5000 500 150 21
DS 5000 500 5000 -500 150 21
DS 5000 -500 3000 -500 150 21
DS 3500 2000 5500 2000 150 21
DS 5500 2000 5500 -2000 150 21
DS 5500 -2000 3500 -2000 150 21
DS -5500 2000 3500 2000 150 21
DS 3500 -2000 -5500 -2000 150 21
DS -5500 -2000 -5500 2000 150 21
DS -5000 -500 3000 -500 150 21
DS 3000 500 -5000 500 150 21
DS -5000 500 -5000 -500 150 21
$PAD
Sh "1" R 600 600 0 0 0
Dr 320 0 0
At STD N 00E0FFFF
Ne 0 ""
Po -4500 1500
$EndPAD
$PAD
Sh "2" C 600 600 0 0 0
Dr 320 0 0
At STD N 00E0FFFF
Ne 0 ""
Po -3500 1500
$EndPAD
$PAD
Sh "3" C 600 600 0 0 0
Dr 320 0 0
At STD N 00E0FFFF
Ne 0 ""
Po -2500 1500
$EndPAD
$PAD
Sh "4" C 600 600 0 0 0
Dr 320 0 0
At STD N 00E0FFFF
Ne 0 ""
Po -1500 1500
$EndPAD
$PAD
Sh "5" C 600 600 0 0 0
Dr 320 0 0
At STD N 00E0FFFF
Ne 0 ""
Po -500 1500
$EndPAD
$PAD
Sh "6" C 600 600 0 0 0
Dr 320 0 0
At STD N 00E0FFFF
Ne 0 ""
Po 500 1500
$EndPAD
$PAD
Sh "7" C 600 600 0 0 0
Dr 320 0 0
At STD N 00E0FFFF
Ne 0 ""
Po 1500 1500
$EndPAD
$PAD
Sh "8" C 600 600 0 0 0
Dr 320 0 0
At STD N 00E0FFFF
Ne 0 ""
Po 2500 1500
$EndPAD
$PAD
Sh "13" C 600 600 0 0 0
Dr 320 0 0
At STD N 00E0FFFF
Ne 0 ""
Po 2500 -1500
$EndPAD
$PAD
Sh "14" C 600 600 0 0 0
Dr 320 0 0
At STD N 00E0FFFF
Ne 0 ""
Po 1500 -1500
$EndPAD
$PAD
Sh "15" C 600 600 0 0 0
Dr 320 0 0
At STD N 00E0FFFF
Ne 0 ""
Po 500 -1500
$EndPAD
$PAD
Sh "16" C 600 600 0 0 0
Dr 320 0 0
At STD N 00E0FFFF
Ne 0 ""
Po -500 -1500
$EndPAD
$PAD
Sh "17" C 600 600 0 0 0
Dr 320 0 0
At STD N 00E0FFFF
Ne 0 ""
Po -1500 -1500
$EndPAD
$PAD
Sh "18" C 600 600 0 0 0
Dr 320 0 0
At STD N 00E0FFFF
Ne 0 ""
Po -2500 -1500
$EndPAD
$PAD
Sh "19" C 600 600 0 0 0
Dr 320 0 0
At STD N 00E0FFFF
Ne 0 ""
Po -3500 -1500
$EndPAD
$PAD
Sh "20" C 600 600 0 0 0
Dr 320 0 0
At STD N 00E0FFFF
Ne 0 ""
Po -4500 -1500
$EndPAD
$PAD
Sh "9" C 600 600 0 0 0
Dr 200 0 0
At STD N 00E0FFFF
Ne 0 ""
Po 3500 1500
$EndPAD
$PAD
Sh "10" C 600 600 0 0 0
Dr 200 0 0
At STD N 00E0FFFF
Ne 0 ""
Po 4500 1500
$EndPAD
$PAD
Sh "12" C 600 600 0 0 0
Dr 200 0 0
At STD N 00E0FFFF
Ne 0 ""
Po 3500 -1500
$EndPAD
$PAD
Sh "11" C 600 600 0 0 0
Dr 200 0 0
At STD N 00E0FFFF
Ne 0 ""
Po 4500 -1500
$EndPAD
$SHAPE3D
Na "Switch/DIP/dipswitth_10.wrl"
Sc 1 1 1
Of 0 0 0
Ro 0 0 0
$EndSHAPE3D
$EndMODULE SWDIP10
$MODULE SWDIP12
Po 0 0 0 15 4FD779AD 00000000 ~~
Li SWDIP12
Cd Switch Dil 8 elements
Kw SWITCH DEV
Sc 0
AR 
Op 0 0 0
T0 0 -2500 393 393 0 78 N V 21 N "SWDIP12"
T1 0 0 392 392 0 77 N I 21 N "Value"
DS 4000 500 6000 500 150 21
DS 6000 500 6000 -500 150 21
DS 6000 -500 4000 -500 150 21
DS 4500 2000 6500 2000 150 21
DS 6500 2000 6500 -2000 150 21
DS 6500 -2000 4500 -2000 150 21
DS 2000 500 4000 500 150 21
DS 4000 -500 2000 -500 150 21
DS 2500 2000 4500 2000 150 21
DS 4500 -2000 2500 -2000 150 21
DS -6500 2000 2500 2000 150 21
DS 2500 -2000 -6500 -2000 150 21
DS -6500 -2000 -6500 2000 150 21
DS -6000 -500 2000 -500 150 21
DS 2000 500 -6000 500 150 21
DS -6000 500 -6000 -500 150 21
$PAD
Sh "1" R 600 600 0 0 0
Dr 320 0 0
At STD N 00E0FFFF
Ne 0 ""
Po -5500 1500
$EndPAD
$PAD
Sh "2" C 600 600 0 0 0
Dr 320 0 0
At STD N 00E0FFFF
Ne 0 ""
Po -4500 1500
$EndPAD
$PAD
Sh "3" C 600 600 0 0 0
Dr 320 0 0
At STD N 00E0FFFF
Ne 0 ""
Po -3500 1500
$EndPAD
$PAD
Sh "4" C 600 600 0 0 0
Dr 320 0 0
At STD N 00E0FFFF
Ne 0 ""
Po -2500 1500
$EndPAD
$PAD
Sh "5" C 600 600 0 0 0
Dr 320 0 0
At STD N 00E0FFFF
Ne 0 ""
Po -1500 1500
$EndPAD
$PAD
Sh "6" C 600 600 0 0 0
Dr 320 0 0
At STD N 00E0FFFF
Ne 0 ""
Po -500 1500
$EndPAD
$PAD
Sh "7" C 600 600 0 0 0
Dr 320 0 0
At STD N 00E0FFFF
Ne 0 ""
Po 500 1500
$EndPAD
$PAD
Sh "8" C 600 600 0 0 0
Dr 320 0 0
At STD N 00E0FFFF
Ne 0 ""
Po 1500 1500
$EndPAD
$PAD
Sh "17" C 600 600 0 0 0
Dr 320 0 0
At STD N 00E0FFFF
Ne 0 ""
Po 1500 -1500
$EndPAD
$PAD
Sh "18" C 600 600 0 0 0
Dr 320 0 0
At STD N 00E0FFFF
Ne 0 ""
Po 500 -1500
$EndPAD
$PAD
Sh "19" C 600 600 0 0 0
Dr 320 0 0
At STD N 00E0FFFF
Ne 0 ""
Po -500 -1500
$EndPAD
$PAD
Sh "20" C 600 600 0 0 0
Dr 320 0 0
At STD N 00E0FFFF
Ne 0 ""
Po -1500 -1500
$EndPAD
$PAD
Sh "21" C 600 600 0 0 0
Dr 320 0 0
At STD N 00E0FFFF
Ne 0 ""
Po -2500 -1500
$EndPAD
$PAD
Sh "22" C 600 600 0 0 0
Dr 320 0 0
At STD N 00E0FFFF
Ne 0 ""
Po -3500 -1500
$EndPAD
$PAD
Sh "23" C 600 600 0 0 0
Dr 320 0 0
At STD N 00E0FFFF
Ne 0 ""
Po -4500 -1500
$EndPAD
$PAD
Sh "24" C 600 600 0 0 0
Dr 320 0 0
At STD N 00E0FFFF
Ne 0 ""
Po -5500 -1500
$EndPAD
$PAD
Sh "9" C 600 600 0 0 0
Dr 200 0 0
At STD N 00E0FFFF
Ne 0 ""
Po 2500 1500
$EndPAD
$PAD
Sh "10" C 600 600 0 0 0
Dr 200 0 0
At STD N 00E0FFFF
Ne 0 ""
Po 3500 1500
$EndPAD
$PAD
Sh "16" C 600 600 0 0 0
Dr 200 0 0
At STD N 00E0FFFF
Ne 0 ""
Po 2500 -1500
$EndPAD
$PAD
Sh "15" C 600 600 0 0 0
Dr 200 0 0
At STD N 00E0FFFF
Ne 0 ""
Po 3500 -1500
$EndPAD
$PAD
Sh "11" C 600 600 0 0 0
Dr 320 0 0
At STD N 00E0FFFF
Ne 0 ""
Po 4500 1500
$EndPAD
$PAD
Sh "12" C 600 600 0 0 0
Dr 320 0 0
At STD N 00E0FFFF
Ne 0 ""
Po 5500 1500
$EndPAD
$PAD
Sh "14" C 600 600 0 0 0
Dr 320 0 0
At STD N 00E0FFFF
Ne 0 ""
Po 4500 -1500
$EndPAD
$PAD
Sh "13" C 600 600 0 0 0
Dr 320 0 0
At STD N 00E0FFFF
Ne 0 ""
Po 5500 -1500
$EndPAD
$SHAPE3D
Na "Switch/DIP/dipswitth_12.wrl"
Sc 1 1 1
Of 0 0 0
Ro 0 0 0
$EndSHAPE3D
$EndMODULE SWDIP12
$EndLIBRARY
