#VRML V2.0 utf8
#kicad StepUp wrl exported

Shape {
    appearance Appearance {material DEF PIN-01 Material {
        ambientIntensity 0.271
        diffuseColor 0.824 0.820 0.781
        specularColor 0.328 0.258 0.172
        emissiveColor 0.0 0.0 0.0
        shininess 0.70
        transparency 0.0
        }
    }
}
Shape {
    appearance Appearance {material DEF MET-01 Material {
        ambientIntensity 0.249999
        diffuseColor 0.298 0.298 0.298
        specularColor 0.398 0.398 0.398
        emissiveColor 0.0 0.0 0.0
        shininess 0.056122
        transparency 0.0
        }
    }
}
Shape {
    appearance Appearance {material DEF PIN-02 Material {
        ambientIntensity 0.379
        diffuseColor 0.859 0.738 0.496
        specularColor 0.137 0.145 0.184
        emissiveColor 0.0 0.0 0.0
        shininess 0.40
        transparency 0.0
        }
    }
}
Shape {
    appearance Appearance {material DEF IC-BODY-EPOXY-04 Material {
        ambientIntensity 0.293
        diffuseColor 0.148 0.145 0.145
        specularColor 0.180 0.168 0.160
        emissiveColor 0.0 0.0 0.0
        shininess 0.35
        transparency 0.0
        }
    }
}
Shape {
    appearance Appearance {material DEF RES-SMD-01 Material {
        diffuseColor 0.082 0.086 0.094
        emissiveColor 0.000 0.000 0.000
        specularColor 0.066 0.063 0.063
        ambientIntensity 0.638
        transparency 0.0
        shininess 0.3
        }
    }
}
Shape {
    appearance Appearance {material DEF IC-BODY-EPOXY-01 Material {
        ambientIntensity 0.117
        diffuseColor 0.250 0.262 0.281
        specularColor 0.316 0.281 0.176
        emissiveColor 0.0 0.0 0.0
        shininess 0.25
        transparency 0.0
        }
    }
}
Shape {
    appearance Appearance {material DEF CAP-CERAMIC-05 Material {
        ambientIntensity 0.179
        diffuseColor 0.273 0.273 0.273
        specularColor 0.203 0.188 0.176
        emissiveColor 0.0 0.0 0.0
        shininess 0.15
        transparency 0.0
        }
    }
}
Shape {
    appearance Appearance {material DEF CAP-CERAMIC-06 Material {
        ambientIntensity 0.453
        diffuseColor 0.379 0.270 0.215
        specularColor 0.223 0.223 0.223
        emissiveColor 0.0 0.0 0.0
        shininess 0.15
        transparency 0.0
        }
    }
}
Shape {
    appearance Appearance {material DEF RES-THT-01 Material {
        ambientIntensity 0.149
        diffuseColor 0.883 0.711 0.492
        specularColor 0.043 0.121 0.281
        emissiveColor 0.0 0.0 0.0
        shininess 0.40
        transparency 0.0
        }
    }
}
Shape {
    appearance Appearance {material DEF PLASTIC-BLUE-01 Material {
        ambientIntensity 0.565
        diffuseColor 0.137 0.402 0.727
        specularColor 0.359 0.379 0.270
        emissiveColor 0.0 0.0 0.0
        shininess 0.25
        transparency 0.0
        }
    }
}
Shape {
    appearance Appearance {material DEF PLASTIC-GREEN-01 Material {
        ambientIntensity 0.315
        diffuseColor 0.340 0.680 0.445
        specularColor 0.176 0.105 0.195
        emissiveColor 0.0 0.0 0.0
        shininess 0.25
        transparency 0.0
        }
    }
}
Shape {
    appearance Appearance {material DEF PLASTIC-ORANGE-01 Material {
        ambientIntensity 0.284
        diffuseColor 0.809 0.426 0.148
        specularColor 0.039 0.102 0.145
        emissiveColor 0.0 0.0 0.0
        shininess 0.25
        transparency 0.0
        }
    }
}
Shape {
    appearance Appearance {material DEF RED-BODY Material {
        ambientIntensity 0.683
        diffuseColor 0.700 0.100 0.050
        emissiveColor 0.000 0.000 0.000
        specularColor 0.300 0.400 0.150
        shininess 0.25
        transparency 0.0
        }
    }
}
Shape {
    appearance Appearance {material DEF CAP-CERAMIC-02 Material {
        ambientIntensity 0.683
        diffuseColor 0.578 0.336 0.352
        specularColor 0.105 0.273 0.270
        emissiveColor 0.0 0.0 0.0
        shininess 0.25
        transparency 0.0
        }
    }
}
Shape {
    appearance Appearance {material DEF PLASTIC-YELLOW-01 Material {
        ambientIntensity 0.522
        diffuseColor 0.832 0.680 0.066
        specularColor 0.160 0.203 0.320
        emissiveColor 0.0 0.0 0.0
        shininess 0.25
        transparency 0.0
        }
    }
}
Shape {
    appearance Appearance {material DEF PLASTIC-WHITE-01 Material {
        ambientIntensity 0.494
        diffuseColor 0.895 0.891 0.813
        specularColor 0.047 0.055 0.109
        emissiveColor 0.0 0.0 0.0
        shininess 0.25
        transparency 0.0
        }
    }
}
Shape {
    appearance Appearance {material DEF IC-LABEL-01 Material {
        ambientIntensity 0.082
        diffuseColor 0.691 0.664 0.598
        specularColor 0.000 0.000 0.000
        emissiveColor 0.0 0.0 0.0
        shininess 0.01
        transparency 0.0
        }
    }
}
Shape {
    appearance Appearance {material DEF LED-RED Material {
        ambientIntensity 0.789
        diffuseColor 0.700 0.100 0.050
        emissiveColor 0.000 0.000 0.000
        specularColor 0.300 0.400 0.150
        shininess 0.125
        transparency 0.10
        }
    }
}
Shape {
    appearance Appearance {material DEF LED-GREEN Material {
        ambientIntensity 0.789
        diffuseColor 0.400 0.700 0.150
        emissiveColor 0.000 0.000 0.000
        specularColor 0.600 0.300 0.100
        shininess 0.05
        transparency 0.10
        }
    }
}
Shape {
    appearance Appearance {material DEF LED-BLUE Material {
        ambientIntensity 0.789
        diffuseColor 0.100 0.250 0.700
        emissiveColor 0.000 0.000 0.000
        specularColor 0.500 0.600 0.300
        shininess 0.125
        transparency 0.10
        }
    }
}
Shape {
    appearance Appearance {material DEF LED-YELLOW Material {
        ambientIntensity 0.522
        diffuseColor 0.98 0.840 0.066
        specularColor 0.160 0.203 0.320
        emissiveColor 0.0 0.0 0.0
        shininess 0.125
        transparency 0.10
        }
    }
}
Shape {
    appearance Appearance {material DEF LED-WHITE Material {
        ambientIntensity 0.494
        diffuseColor 0.895 0.891 0.813
        specularColor 0.047 0.055 0.109
        emissiveColor 0.0 0.0 0.0
        shininess 0.125
        transparency 0.10
        }
    }
}
Shape {
    appearance Appearance {material DEF LED-GREY Material {
        ambientIntensity 0.494
        diffuseColor 0.27 0.25 0.27
        specularColor 0.5 0.5 0.6
        emissiveColor 0.0 0.0 0.0
        shininess 0.35
        transparency 0.10
        }
    }
}
Shape {
    appearance Appearance {material DEF LED-BLACK Material {
        ambientIntensity 0.494
        diffuseColor 0.1 0.05 0.1
        specularColor 0.6 0.5 0.6
        emissiveColor 0.0 0.0 0.0
        shininess 0.5
        transparency 0.0
        }
    }
}
Shape {
    appearance Appearance {material DEF GLASS-19 Material {
        ambientIntensity 2.018212
        diffuseColor 0.400769 0.441922 0.459091
        specularColor 0.573887 0.649271 0.810811
        emissiveColor 0.000000 0.000000 0.000000
        shininess 0.127273
        transparency 0.37
        }
    }
}
Shape {
    appearance Appearance {material DEF GLASS-29 Material {
        ambientIntensity 0.234375
        diffuseColor 0.566681 0.580872 0.580874
        specularColor 0.617761 0.429816 0.400140
        emissiveColor 0.000000 0.000000 0.000000
        shininess 0.072727
        transparency 0.38
        }
    }
}
Shape {
    appearance Appearance {material DEF GLASS-13 Material {
        ambientIntensity 0.250000
        diffuseColor 0.000000 0.631244 0.748016
        specularColor 0.915152 0.915152 0.915152
        emissiveColor 0.000000 0.000000 0.000000
        shininess 0.642424
        transparency 0.39
        }
    }
}
Shape {
    appearance Appearance {material DEF GLASS-GREEN Material {
        ambientIntensity 0.250000
        diffuseColor 0.000000 0.75 0.44
        specularColor 0.915152 0.915152 0.915152
        emissiveColor 0.000000 0.000000 0.000000
        shininess 0.642424
        transparency 0.39
        }
    }
}
Shape {
    appearance Appearance {material DEF GLASS-ORANGE Material {
        ambientIntensity 0.250000
        diffuseColor 0.75 0.44 0.000000
        specularColor 0.915152 0.915152 0.915152
        emissiveColor 0.000000 0.000000 0.000000
        shininess 0.642424
        transparency 0.39
        }
    }
}
Shape {
    appearance Appearance {material DEF BOARD-GREEN-02 Material {
        ambientIntensity 1
        diffuseColor 0.07 0.3 0.12
        specularColor 0.07 0.3 0.12
        emissiveColor 0.0 0.0 0.0
        shininess 0.40
        transparency 0.0
        }
    }
}
Shape {
    appearance Appearance {material DEF BOARD-BLUE-01 Material {
        ambientIntensity 1
        diffuseColor 0.07 0.12 0.3
        specularColor 0.07 0.12 0.3
        emissiveColor 0.0 0.0 0.0
        shininess 0.40
        transparency 0.0
        }
    }
}
Shape {
    appearance Appearance {material DEF BOARD-BLACK-03 Material {
        ambientIntensity 1
        diffuseColor 0.16 0.16 0.16
        specularColor 0.16 0.16 0.16
        emissiveColor 0.0 0.0 0.0
        shininess 0.40
        transparency 0.0
        }
    }
}
Shape {
    appearance Appearance {material DEF MET-ALUMINUM Material {
        ambientIntensity 0.256000
        diffuseColor 0.372322 0.371574 0.373173
        specularColor 0.556122 0.554201 0.556122
        emissiveColor 0.0 0.0 0.0
        shininess 0.127551
        transparency 0.0
        }
    }
}
Shape {
    appearance Appearance {material DEF MET-BRONZE Material {
        ambientIntensity 0.022727
        diffuseColor 0.714 0.4284 0.18144
        specularColor 0.393548 0.271906 0.166721
        emissiveColor 0.000000 0.000000 0.000000
        shininess 0.2
        transparency 0.0
        }
    }
}
Shape {
    appearance Appearance {material DEF MET-SILVER Material {
        ambientIntensity 0.022727
        diffuseColor 0.50754 0.50754 0.50754
        specularColor 0.508273 0.508273 0.508273
        emissiveColor 0.000000 0.000000 0.000000
        shininess 0.4
        transparency 0.0
        }
    }
}
Shape {
    appearance Appearance {material DEF MET-COPPER Material {
        ambientIntensity 0.022727
        diffuseColor 0.7038 0.27048 0.0828
        specularColor 0.780612 0.37 0.000000
        emissiveColor 0.000000 0.000000 0.000000
        shininess 0.2
        transparency 0.0
        }
    }
}
Shape { geometry IndexedFaceSet 
{ creaseAngle 0.50 coordIndex [0,1,2,-1,0,2,3,-1]
coord Coordinate { point [6.73227 0.452755 3.937,-0.846455 0.452755 3.937,-0.846455 -1.87007 3.937,6.73227 -1.87007 3.937]
}}
appearance Appearance{material Material{diffuseColor 0 0 0
transparency 0}}}
Shape { geometry IndexedFaceSet 
{ creaseAngle 0.50 coordIndex [0,1,2,-1,3,0,2,-1,4,2,1,-1,5,2,4,-1]
coord Coordinate { point [-0.94488 0.452755 3.937,-0.94488 -1.90944 3.937,-0.846455 -1.87007 3.937,-0.846455 0.452755 3.937,6.73227 -1.90944 3.937,6.73227 -1.87007 3.937]
}}
appearance Appearance{material Material{diffuseColor 0 0 0
transparency 0}}}
Shape { geometry IndexedFaceSet 
{ creaseAngle 0.50 coordIndex [0,1,2,-1,0,3,4,-1,5,0,4,-1,5,1,0,-1]
coord Coordinate { point [6.73227 0.452755 3.937,-0.846455 0.492125 3.937,-0.846455 0.452755 3.937,6.73227 -1.87007 3.937,6.8307 -1.87007 3.937,6.8307 0.492125 3.937]
}}
appearance Appearance{material Material{diffuseColor 0 0 0
transparency 0}}}
Shape { geometry IndexedFaceSet 
{ creaseAngle 0.50 coordIndex [0,1,2,-1,3,1,0,-1]
coord Coordinate { point [-0.94488 0.452755 0,-0.94488 -1.90944 3.937,-0.94488 0.452755 3.937,-0.94488 -1.90944 0]
}}
appearance Appearance{material Material{diffuseColor 0 0 0
transparency 0}}}
Shape { geometry IndexedFaceSet 
{ creaseAngle 0.50 coordIndex [0,1,2,-1,3,1,0,-1]
coord Coordinate { point [-0.94488 0.452755 3.937,-0.846455 0.452755 0,-0.94488 0.452755 0,-0.846455 0.452755 3.937]
}}
appearance Appearance{material Material{diffuseColor 0 0 0
transparency 0}}}
Shape { geometry IndexedFaceSet 
{ creaseAngle 0.50 coordIndex [0,1,2,-1,3,1,0,-1]
coord Coordinate { point [6.73227 -1.87007 3.937,6.73227 -1.90944 0,6.73227 -1.87007 0,6.73227 -1.90944 3.937]
}}
appearance Appearance{material Material{diffuseColor 0 0 0
transparency 0}}}
Shape { geometry IndexedFaceSet 
{ creaseAngle 0.50 coordIndex [0,1,2,-1,2,1,3,-1]
coord Coordinate { point [6.73227 -1.90944 0,6.73227 -1.90944 3.937,-0.94488 -1.90944 0,-0.94488 -1.90944 3.937]
}}
appearance Appearance{material Material{diffuseColor 0 0 0
transparency 0}}}
Shape { geometry IndexedFaceSet 
{ creaseAngle 0.50 coordIndex [0,1,2,-1,0,3,1,-1]
coord Coordinate { point [-0.846455 0.452755 0,-0.846455 0.492125 3.937,-0.846455 0.492125 0,-0.846455 0.452755 3.937]
}}
appearance Appearance{material Material{diffuseColor 0 0 0
transparency 0}}}
Shape { geometry IndexedFaceSet 
{ creaseAngle 0.50 coordIndex [0,1,2,-1,0,2,3,-1]
coord Coordinate { point [6.8307 0.492125 3.937,6.8307 0.492125 0,-0.846455 0.492125 0,-0.846455 0.492125 3.937]
}}
appearance Appearance{material Material{diffuseColor 0 0 0
transparency 0}}}
Shape { geometry IndexedFaceSet 
{ creaseAngle 0.50 coordIndex [0,1,2,-1,0,3,1,-1]
coord Coordinate { point [6.8307 -1.87007 3.937,6.8307 0.492125 0,6.8307 0.492125 3.937,6.8307 -1.87007 0]
}}
appearance Appearance{material Material{diffuseColor 0 0 0
transparency 0}}}
Shape { geometry IndexedFaceSet 
{ creaseAngle 0.50 coordIndex [0,1,2,-1,0,3,1,-1]
coord Coordinate { point [6.8307 -1.87007 0,6.73227 -1.87007 3.937,6.73227 -1.87007 0,6.8307 -1.87007 3.937]
}}
appearance Appearance{material Material{diffuseColor 0 0 0
transparency 0}}}
Shape { geometry IndexedFaceSet 
{ creaseAngle 0.50 coordIndex [0,1,2,-1,1,3,2,-1,2,4,0,-1,2,5,4,-1]
coord Coordinate { point [-0.94488 -1.90944 0,-0.94488 0.452755 0,-0.846455 -1.87007 0,-0.846455 0.452755 0,6.73227 -1.90944 0,6.73227 -1.87007 0]
}}
appearance Appearance{material Material{diffuseColor 0 0 0
transparency 0}}}
Shape { geometry IndexedFaceSet 
{ creaseAngle 0.50 coordIndex [0,1,2,-1,3,1,4,-1,1,5,4,-1,0,5,1,-1]
coord Coordinate { point [-0.846455 0.492125 0,6.73227 0.452755 0,-0.846455 0.452755 0,6.73227 -1.87007 0,6.8307 -1.87007 0,6.8307 0.492125 0]
}}
appearance Appearance{material Material{diffuseColor 0 0 0
transparency 0}}}
Shape { geometry IndexedFaceSet 
{ creaseAngle 0.50 coordIndex [0,1,2,-1,2,1,3,-1,4,5,6,-1,7,8,9,-1,6,5,10,-1,7,11,8,-1,8,12,9,-1,13,14,5,-1,1,14,13,-1,5,14,10,-1,7,14,1,-1,7,1,0,-1,7,0,15,-1,7,15,16,-1,7,16,17,-1,7,17,18,-1,7,18,19,-1,11,20,21,-1,7,20,11,-1,22,23,12,-1,7,24,20,-1,12,25,9,-1,23,25,12,-1,24,26,23,-1,23,26,25,-1,25,27,9,-1,26,19,28,-1,7,19,24,-1,24,19,26,-1,29,30,27,-1,27,31,9,-1,30,31,27,-1,18,32,30,-1,30,32,31,-1,32,17,33,-1,18,17,32,-1,34,35,36,-1,35,37,36,-1,16,38,35,-1,35,38,37,-1,16,15,38,-1,38,15,39,-1,40,41,42,-1,37,10,36,-1,36,10,31,-1,42,10,37,-1,31,10,9,-1,41,43,42,-1,42,43,10,-1,41,2,43,-1,0,2,41,-1,43,6,10,-1]
coord Coordinate { point [4.19684 0.098425 0,4.99999 0.098425 0,4.90156 0.059055 0,4.99999 0.059055 0,5.09841 0 0,5.19684 0 0,5.09841 -0.03937 0,-0.846455 0.452755 0,-0.098425 -0.03937 0,-0.846455 -1.87007 0,6.73227 -1.87007 0,-0.098425 0.059055 0,0.098425 -0.03937 0,5.19684 0.098425 0,6.73227 0.452755 0,3.99999 0.098425 0,3.19684 0.098425 0,2.99999 0.098425 0,1.19685 0.098425 0,0.999998 0.098425 0,0 0.098425 0,0 0.059055 0,0.098425 0 0,0.19685 0 0,0.19685 0.098425 0,0.901573 -0.03937 0,0.901573 0.059055 0,1.09842 -0.03937 0,0.999998 0.059055 0,1.09842 0 0,1.19685 0 0,2.90157 -0.03937 0,2.90157 0.059055 0,2.99999 0.059055 0,3.09842 0 0,3.19684 0 0,3.09842 -0.03937 0,3.90157 -0.03937 0,3.90157 0.059055 0,3.99999 0.059055 0,4.09842 0 0,4.19684 0 0,4.09842 -0.03937 0,4.90156 -0.03937 0]
}}
appearance Appearance{material Material{diffuseColor 0 0 0
transparency 0}}}
Shape { geometry IndexedFaceSet 
{ creaseAngle 0.50 coordIndex [0,1,2,-1,0,2,3,-1]
coord Coordinate { point [0.999998 0.059055 0,0.999998 0.059055 -1.1811,0.901573 0.059055 -1.1811,0.901573 0.059055 0]
}}
appearance Appearance{material Material{diffuseColor 0.8 0.8 0.8
transparency 0}}}
Shape { geometry IndexedFaceSet 
{ creaseAngle 0.50 coordIndex [0,1,2,-1,3,1,0,-1]
coord Coordinate { point [0.901573 0.059055 -1.1811,0.901573 -0.03937 0,0.901573 0.059055 0,0.901573 -0.03937 -1.1811]
}}
appearance Appearance{material Material{diffuseColor 0.8 0.8 0.8
transparency 0}}}
Shape { geometry IndexedFaceSet 
{ creaseAngle 0.50 coordIndex [0,1,2,-1,2,1,3,-1]
coord Coordinate { point [1.09842 -0.03937 -1.1811,1.09842 -0.03937 0,0.901573 -0.03937 -1.1811,0.901573 -0.03937 0]
}}
appearance Appearance{material Material{diffuseColor 0.8 0.8 0.8
transparency 0}}}
Shape { geometry IndexedFaceSet 
{ creaseAngle 0.50 coordIndex [0,1,2,-1,0,3,1,-1]
coord Coordinate { point [1.09842 -0.03937 0,1.09842 0 -1.1811,1.09842 0 0,1.09842 -0.03937 -1.1811]
}}
appearance Appearance{material Material{diffuseColor 0.8 0.8 0.8
transparency 0}}}
Shape { geometry IndexedFaceSet 
{ creaseAngle 0.50 coordIndex [0,1,2,-1,2,1,3,-1]
coord Coordinate { point [1.19685 0 -1.1811,1.19685 0 0,1.09842 0 -1.1811,1.09842 0 0]
}}
appearance Appearance{material Material{diffuseColor 0.8 0.8 0.8
transparency 0}}}
Shape { geometry IndexedFaceSet 
{ creaseAngle 0.50 coordIndex [0,1,2,-1,0,3,1,-1]
coord Coordinate { point [1.19685 0 0,1.19685 0.098425 -1.1811,1.19685 0.098425 0,1.19685 0 -1.1811]
}}
appearance Appearance{material Material{diffuseColor 0.8 0.8 0.8
transparency 0}}}
Shape { geometry IndexedFaceSet 
{ creaseAngle 0.50 coordIndex [0,1,2,-1,0,2,3,-1]
coord Coordinate { point [1.19685 0.098425 0,1.19685 0.098425 -1.1811,0.999998 0.098425 -1.1811,0.999998 0.098425 0]
}}
appearance Appearance{material Material{diffuseColor 0.8 0.8 0.8
transparency 0}}}
Shape { geometry IndexedFaceSet 
{ creaseAngle 0.50 coordIndex [0,1,2,-1,3,1,0,-1]
coord Coordinate { point [0.999998 0.098425 -1.1811,0.999998 0.059055 0,0.999998 0.098425 0,0.999998 0.059055 -1.1811]
}}
appearance Appearance{material Material{diffuseColor 0.8 0.8 0.8
transparency 0}}}
Shape { geometry IndexedFaceSet 
{ creaseAngle 0.50 coordIndex [0,1,2,-1,0,2,3,-1]
coord Coordinate { point [2.99999 0.059055 0,2.99999 0.059055 -1.1811,2.90157 0.059055 -1.1811,2.90157 0.059055 0]
}}
appearance Appearance{material Material{diffuseColor 0.8 0.8 0.8
transparency 0}}}
Shape { geometry IndexedFaceSet 
{ creaseAngle 0.50 coordIndex [0,1,2,-1,3,1,0,-1]
coord Coordinate { point [2.90157 0.059055 -1.1811,2.90157 -0.03937 0,2.90157 0.059055 0,2.90157 -0.03937 -1.1811]
}}
appearance Appearance{material Material{diffuseColor 0.8 0.8 0.8
transparency 0}}}
Shape { geometry IndexedFaceSet 
{ creaseAngle 0.50 coordIndex [0,1,2,-1,2,1,3,-1]
coord Coordinate { point [3.09842 -0.03937 -1.1811,3.09842 -0.03937 0,2.90157 -0.03937 -1.1811,2.90157 -0.03937 0]
}}
appearance Appearance{material Material{diffuseColor 0.8 0.8 0.8
transparency 0}}}
Shape { geometry IndexedFaceSet 
{ creaseAngle 0.50 coordIndex [0,1,2,-1,0,3,1,-1]
coord Coordinate { point [3.09842 -0.03937 0,3.09842 0 -1.1811,3.09842 0 0,3.09842 -0.03937 -1.1811]
}}
appearance Appearance{material Material{diffuseColor 0.8 0.8 0.8
transparency 0}}}
Shape { geometry IndexedFaceSet 
{ creaseAngle 0.50 coordIndex [0,1,2,-1,2,1,3,-1]
coord Coordinate { point [3.19684 0 -1.1811,3.19684 0 0,3.09842 0 -1.1811,3.09842 0 0]
}}
appearance Appearance{material Material{diffuseColor 0.8 0.8 0.8
transparency 0}}}
Shape { geometry IndexedFaceSet 
{ creaseAngle 0.50 coordIndex [0,1,2,-1,0,3,1,-1]
coord Coordinate { point [3.19684 0 0,3.19684 0.098425 -1.1811,3.19684 0.098425 0,3.19684 0 -1.1811]
}}
appearance Appearance{material Material{diffuseColor 0.8 0.8 0.8
transparency 0}}}
Shape { geometry IndexedFaceSet 
{ creaseAngle 0.50 coordIndex [0,1,2,-1,0,2,3,-1]
coord Coordinate { point [3.19684 0.098425 0,3.19684 0.098425 -1.1811,2.99999 0.098425 -1.1811,2.99999 0.098425 0]
}}
appearance Appearance{material Material{diffuseColor 0.8 0.8 0.8
transparency 0}}}
Shape { geometry IndexedFaceSet 
{ creaseAngle 0.50 coordIndex [0,1,2,-1,3,1,0,-1]
coord Coordinate { point [2.99999 0.098425 -1.1811,2.99999 0.059055 0,2.99999 0.098425 0,2.99999 0.059055 -1.1811]
}}
appearance Appearance{material Material{diffuseColor 0.8 0.8 0.8
transparency 0}}}
Shape { geometry IndexedFaceSet 
{ creaseAngle 0.50 coordIndex [0,1,2,-1,3,1,0,-1]
coord Coordinate { point [4.90156 0.059055 -1.1811,4.90156 -0.03937 0,4.90156 0.059055 0,4.90156 -0.03937 -1.1811]
}}
appearance Appearance{material Material{diffuseColor 0.8 0.8 0.8
transparency 0}}}
Shape { geometry IndexedFaceSet 
{ creaseAngle 0.50 coordIndex [0,1,2,-1,2,1,3,-1]
coord Coordinate { point [5.09841 -0.03937 -1.1811,5.09841 -0.03937 0,4.90156 -0.03937 -1.1811,4.90156 -0.03937 0]
}}
appearance Appearance{material Material{diffuseColor 0.8 0.8 0.8
transparency 0}}}
Shape { geometry IndexedFaceSet 
{ creaseAngle 0.50 coordIndex [0,1,2,-1,0,3,1,-1]
coord Coordinate { point [5.09841 -0.03937 0,5.09841 0 -1.1811,5.09841 0 0,5.09841 -0.03937 -1.1811]
}}
appearance Appearance{material Material{diffuseColor 0.8 0.8 0.8
transparency 0}}}
Shape { geometry IndexedFaceSet 
{ creaseAngle 0.50 coordIndex [0,1,2,-1,2,1,3,-1]
coord Coordinate { point [5.19684 0 -1.1811,5.19684 0 0,5.09841 0 -1.1811,5.09841 0 0]
}}
appearance Appearance{material Material{diffuseColor 0.8 0.8 0.8
transparency 0}}}
Shape { geometry IndexedFaceSet 
{ creaseAngle 0.50 coordIndex [0,1,2,-1,0,3,1,-1]
coord Coordinate { point [5.19684 0 0,5.19684 0.098425 -1.1811,5.19684 0.098425 0,5.19684 0 -1.1811]
}}
appearance Appearance{material Material{diffuseColor 0.8 0.8 0.8
transparency 0}}}
Shape { geometry IndexedFaceSet 
{ creaseAngle 0.50 coordIndex [0,1,2,-1,0,2,3,-1]
coord Coordinate { point [5.19684 0.098425 0,5.19684 0.098425 -1.1811,4.99999 0.098425 -1.1811,4.99999 0.098425 0]
}}
appearance Appearance{material Material{diffuseColor 0.8 0.8 0.8
transparency 0}}}
Shape { geometry IndexedFaceSet 
{ creaseAngle 0.50 coordIndex [0,1,2,-1,3,1,0,-1]
coord Coordinate { point [4.99999 0.098425 -1.1811,4.99999 0.059055 0,4.99999 0.098425 0,4.99999 0.059055 -1.1811]
}}
appearance Appearance{material Material{diffuseColor 0.8 0.8 0.8
transparency 0}}}
Shape { geometry IndexedFaceSet 
{ creaseAngle 0.50 coordIndex [0,1,2,-1,0,2,3,-1]
coord Coordinate { point [4.99999 0.059055 0,4.99999 0.059055 -1.1811,4.90156 0.059055 -1.1811,4.90156 0.059055 0]
}}
appearance Appearance{material Material{diffuseColor 0.8 0.8 0.8
transparency 0}}}
Shape { geometry IndexedFaceSet 
{ creaseAngle 0.50 coordIndex [0,1,2,-1,0,2,3,-1]
coord Coordinate { point [3.99999 0.059055 0,3.99999 0.059055 -1.1811,3.90157 0.059055 -1.1811,3.90157 0.059055 0]
}}
appearance Appearance{material Material{diffuseColor 0.8 0.8 0.8
transparency 0}}}
Shape { geometry IndexedFaceSet 
{ creaseAngle 0.50 coordIndex [0,1,2,-1,3,1,0,-1]
coord Coordinate { point [3.90157 0.059055 -1.1811,3.90157 -0.03937 0,3.90157 0.059055 0,3.90157 -0.03937 -1.1811]
}}
appearance Appearance{material Material{diffuseColor 0.8 0.8 0.8
transparency 0}}}
Shape { geometry IndexedFaceSet 
{ creaseAngle 0.50 coordIndex [0,1,2,-1,2,1,3,-1]
coord Coordinate { point [4.09842 -0.03937 -1.1811,4.09842 -0.03937 0,3.90157 -0.03937 -1.1811,3.90157 -0.03937 0]
}}
appearance Appearance{material Material{diffuseColor 0.8 0.8 0.8
transparency 0}}}
Shape { geometry IndexedFaceSet 
{ creaseAngle 0.50 coordIndex [0,1,2,-1,0,3,1,-1]
coord Coordinate { point [4.09842 -0.03937 0,4.09842 0 -1.1811,4.09842 0 0,4.09842 -0.03937 -1.1811]
}}
appearance Appearance{material Material{diffuseColor 0.8 0.8 0.8
transparency 0}}}
Shape { geometry IndexedFaceSet 
{ creaseAngle 0.50 coordIndex [0,1,2,-1,2,1,3,-1]
coord Coordinate { point [4.19684 0 -1.1811,4.19684 0 0,4.09842 0 -1.1811,4.09842 0 0]
}}
appearance Appearance{material Material{diffuseColor 0.8 0.8 0.8
transparency 0}}}
Shape { geometry IndexedFaceSet 
{ creaseAngle 0.50 coordIndex [0,1,2,-1,0,3,1,-1]
coord Coordinate { point [4.19684 0 0,4.19684 0.098425 -1.1811,4.19684 0.098425 0,4.19684 0 -1.1811]
}}
appearance Appearance{material Material{diffuseColor 0.8 0.8 0.8
transparency 0}}}
Shape { geometry IndexedFaceSet 
{ creaseAngle 0.50 coordIndex [0,1,2,-1,0,2,3,-1]
coord Coordinate { point [4.19684 0.098425 0,4.19684 0.098425 -1.1811,3.99999 0.098425 -1.1811,3.99999 0.098425 0]
}}
appearance Appearance{material Material{diffuseColor 0.8 0.8 0.8
transparency 0}}}
Shape { geometry IndexedFaceSet 
{ creaseAngle 0.50 coordIndex [0,1,2,-1,3,1,0,-1]
coord Coordinate { point [3.99999 0.098425 -1.1811,3.99999 0.059055 0,3.99999 0.098425 0,3.99999 0.059055 -1.1811]
}}
appearance Appearance{material Material{diffuseColor 0.8 0.8 0.8
transparency 0}}}
Shape { geometry IndexedFaceSet 
{ creaseAngle 0.50 coordIndex [0,1,2,-1,0,2,3,-1]
coord Coordinate { point [0 0.059055 0,0 0.059055 -1.1811,-0.098425 0.059055 -1.1811,-0.098425 0.059055 0]
}}
appearance Appearance{material Material{diffuseColor 0.8 0.8 0.8
transparency 0}}}
Shape { geometry IndexedFaceSet 
{ creaseAngle 0.50 coordIndex [0,1,2,-1,3,1,0,-1]
coord Coordinate { point [-0.098425 0.059055 -1.1811,-0.098425 -0.03937 0,-0.098425 0.059055 0,-0.098425 -0.03937 -1.1811]
}}
appearance Appearance{material Material{diffuseColor 0.8 0.8 0.8
transparency 0}}}
Shape { geometry IndexedFaceSet 
{ creaseAngle 0.50 coordIndex [0,1,2,-1,2,1,3,-1]
coord Coordinate { point [0.098425 -0.03937 -1.1811,0.098425 -0.03937 0,-0.098425 -0.03937 -1.1811,-0.098425 -0.03937 0]
}}
appearance Appearance{material Material{diffuseColor 0.8 0.8 0.8
transparency 0}}}
Shape { geometry IndexedFaceSet 
{ creaseAngle 0.50 coordIndex [0,1,2,-1,0,3,1,-1]
coord Coordinate { point [0.098425 -0.03937 0,0.098425 0 -1.1811,0.098425 0 0,0.098425 -0.03937 -1.1811]
}}
appearance Appearance{material Material{diffuseColor 0.8 0.8 0.8
transparency 0}}}
Shape { geometry IndexedFaceSet 
{ creaseAngle 0.50 coordIndex [0,1,2,-1,2,1,3,-1]
coord Coordinate { point [0.19685 0 -1.1811,0.19685 0 0,0.098425 0 -1.1811,0.098425 0 0]
}}
appearance Appearance{material Material{diffuseColor 0.8 0.8 0.8
transparency 0}}}
Shape { geometry IndexedFaceSet 
{ creaseAngle 0.50 coordIndex [0,1,2,-1,0,3,1,-1]
coord Coordinate { point [0.19685 0 0,0.19685 0.098425 -1.1811,0.19685 0.098425 0,0.19685 0 -1.1811]
}}
appearance Appearance{material Material{diffuseColor 0.8 0.8 0.8
transparency 0}}}
Shape { geometry IndexedFaceSet 
{ creaseAngle 0.50 coordIndex [0,1,2,-1,0,2,3,-1]
coord Coordinate { point [0.19685 0.098425 0,0.19685 0.098425 -1.1811,0 0.098425 -1.1811,0 0.098425 0]
}}
appearance Appearance{material Material{diffuseColor 0.8 0.8 0.8
transparency 0}}}
Shape { geometry IndexedFaceSet 
{ creaseAngle 0.50 coordIndex [0,1,2,-1,3,1,0,-1]
coord Coordinate { point [0 0.098425 -1.1811,0 0.059055 0,0 0.098425 0,0 0.059055 -1.1811]
}}
appearance Appearance{material Material{diffuseColor 0.8 0.8 0.8
transparency 0}}}
Shape { geometry IndexedFaceSet 
{ creaseAngle 0.50 coordIndex [0,1,2,-1,1,3,2,-1,0,4,1,-1,1,5,3,-1]
coord Coordinate { point [0.901573 0.059055 -1.1811,0.999998 0 -1.1811,0.901573 -0.03937 -1.1811,1.09842 -0.03937 -1.1811,0.999998 0.059055 -1.1811,1.09842 0 -1.1811]
}}
appearance Appearance{material Material{diffuseColor 0.8 0.8 0.8
transparency 0}}}
Shape { geometry IndexedFaceSet 
{ creaseAngle 0.50 coordIndex [0,1,2,-1,1,3,4,-1,1,5,3,-1,0,5,1,-1]
coord Coordinate { point [0.999998 0.098425 -1.1811,1.09842 0.059055 -1.1811,0.999998 0.059055 -1.1811,1.19685 0 -1.1811,1.09842 0 -1.1811,1.19685 0.098425 -1.1811]
}}
appearance Appearance{material Material{diffuseColor 0.8 0.8 0.8
transparency 0}}}
Shape { geometry IndexedFaceSet 
{ creaseAngle 0.50 coordIndex [0,1,2,-1,1,3,2,-1,0,4,1,-1,1,5,3,-1]
coord Coordinate { point [2.90157 0.059055 -1.1811,2.99999 0 -1.1811,2.90157 -0.03937 -1.1811,3.09842 -0.03937 -1.1811,2.99999 0.059055 -1.1811,3.09842 0 -1.1811]
}}
appearance Appearance{material Material{diffuseColor 0.8 0.8 0.8
transparency 0}}}
Shape { geometry IndexedFaceSet 
{ creaseAngle 0.50 coordIndex [0,1,2,-1,1,3,4,-1,1,5,3,-1,0,5,1,-1]
coord Coordinate { point [2.99999 0.098425 -1.1811,3.09842 0.059055 -1.1811,2.99999 0.059055 -1.1811,3.19684 0 -1.1811,3.09842 0 -1.1811,3.19684 0.098425 -1.1811]
}}
appearance Appearance{material Material{diffuseColor 0.8 0.8 0.8
transparency 0}}}
Shape { geometry IndexedFaceSet 
{ creaseAngle 0.50 coordIndex [0,1,2,-1,1,3,2,-1,0,4,1,-1,1,5,3,-1]
coord Coordinate { point [4.90156 0.059055 -1.1811,4.99999 0 -1.1811,4.90156 -0.03937 -1.1811,5.09841 -0.03937 -1.1811,4.99999 0.059055 -1.1811,5.09841 0 -1.1811]
}}
appearance Appearance{material Material{diffuseColor 0.8 0.8 0.8
transparency 0}}}
Shape { geometry IndexedFaceSet 
{ creaseAngle 0.50 coordIndex [0,1,2,-1,1,3,4,-1,1,5,3,-1,0,5,1,-1]
coord Coordinate { point [4.99999 0.098425 -1.1811,5.09841 0.059055 -1.1811,4.99999 0.059055 -1.1811,5.19684 0 -1.1811,5.09841 0 -1.1811,5.19684 0.098425 -1.1811]
}}
appearance Appearance{material Material{diffuseColor 0.8 0.8 0.8
transparency 0}}}
Shape { geometry IndexedFaceSet 
{ creaseAngle 0.50 coordIndex [0,1,2,-1,1,3,2,-1,0,4,1,-1,1,5,3,-1]
coord Coordinate { point [3.90157 0.059055 -1.1811,3.99999 0 -1.1811,3.90157 -0.03937 -1.1811,4.09842 -0.03937 -1.1811,3.99999 0.059055 -1.1811,4.09842 0 -1.1811]
}}
appearance Appearance{material Material{diffuseColor 0.8 0.8 0.8
transparency 0}}}
Shape { geometry IndexedFaceSet 
{ creaseAngle 0.50 coordIndex [0,1,2,-1,1,3,4,-1,1,5,3,-1,0,5,1,-1]
coord Coordinate { point [3.99999 0.098425 -1.1811,4.09842 0.059055 -1.1811,3.99999 0.059055 -1.1811,4.19684 0 -1.1811,4.09842 0 -1.1811,4.19684 0.098425 -1.1811]
}}
appearance Appearance{material Material{diffuseColor 0.8 0.8 0.8
transparency 0}}}
Shape { geometry IndexedFaceSet 
{ creaseAngle 0.50 coordIndex [0,1,2,-1,0,3,1,-1,1,4,2,-1,1,5,4,-1]
coord Coordinate { point [-0.098425 0.059055 -1.1811,0 0 -1.1811,-0.098425 -0.03937 -1.1811,0 0.059055 -1.1811,0.098425 -0.03937 -1.1811,0.098425 0 -1.1811]
}}
appearance Appearance{material Material{diffuseColor 0.8 0.8 0.8
transparency 0}}}
Shape { geometry IndexedFaceSet 
{ creaseAngle 0.50 coordIndex [0,1,2,-1,1,3,4,-1,1,5,3,-1,0,5,1,-1]
coord Coordinate { point [0 0.098425 -1.1811,0.098425 0.059055 -1.1811,0 0.059055 -1.1811,0.19685 0 -1.1811,0.098425 0 -1.1811,0.19685 0.098425 -1.1811]
}}
appearance Appearance{material Material{diffuseColor 0.8 0.8 0.8
transparency 0}}}
Shape { geometry IndexedFaceSet 
{ creaseAngle 0.50 coordIndex [0,1,2,-1,2,1,3,-1]
coord Coordinate { point [0.999998 0.059055 -1.1811,1.09842 0.059055 -1.1811,0.999998 0 -1.1811,1.09842 0 -1.1811]
}}
appearance Appearance{material Material{diffuseColor 0.8 0.8 0.8
transparency 0}}}
Shape { geometry IndexedFaceSet 
{ creaseAngle 0.50 coordIndex [0,1,2,-1,2,1,3,-1]
coord Coordinate { point [2.99999 0.059055 -1.1811,3.09842 0.059055 -1.1811,2.99999 0 -1.1811,3.09842 0 -1.1811]
}}
appearance Appearance{material Material{diffuseColor 0.8 0.8 0.8
transparency 0}}}
Shape { geometry IndexedFaceSet 
{ creaseAngle 0.50 coordIndex [0,1,2,-1,3,1,0,-1]
coord Coordinate { point [4.99999 0 -1.1811,5.09841 0.059055 -1.1811,5.09841 0 -1.1811,4.99999 0.059055 -1.1811]
}}
appearance Appearance{material Material{diffuseColor 0.8 0.8 0.8
transparency 0}}}
Shape { geometry IndexedFaceSet 
{ creaseAngle 0.50 coordIndex [0,1,2,-1,2,1,3,-1]
coord Coordinate { point [3.99999 0.059055 -1.1811,4.09842 0.059055 -1.1811,3.99999 0 -1.1811,4.09842 0 -1.1811]
}}
appearance Appearance{material Material{diffuseColor 0.8 0.8 0.8
transparency 0}}}
Shape { geometry IndexedFaceSet 
{ creaseAngle 0.50 coordIndex [0,1,2,-1,2,1,3,-1]
coord Coordinate { point [0 0.059055 -1.1811,0.098425 0.059055 -1.1811,0 0 -1.1811,0.098425 0 -1.1811]
}}
appearance Appearance{material Material{diffuseColor 0.8 0.8 0.8
transparency 0}}}
