PCBNEW-LibModule-V1  Čt 14. červen 2012, 21:05:48 CEST
# encoding utf-8
Units deci-mils
$INDEX
TR2
TRANSF EI305-1
TRANSF EI305-1_v2
TRANSF EI305-2
Transfo-double
Transfo-simple
tr_sw01H25x25
$EndINDEX
$MODULE TR2
Po 0 0 0 15 4FDA27A2 00000000 ~~
Li TR2
Sc 0
AR 
Op 0 0 0
T0 5000 1000 392 392 0 77 N V 21 N "TR2x"
T1 2500 6500 392 392 0 77 N I 21 N "Value"
DS 0 1500 10000 1500 150 21
DS 10000 1500 10000 11500 150 21
DS 10000 11500 0 11500 150 21
DS 0 11500 0 1500 150 21
$PAD
Sh "1" C 1574 1574 0 0 0
Dr 393 0 0
At STD N 00E0FFFF
Ne 0 ""
Po 2000 3500
$EndPAD
$PAD
Sh "2" C 1574 1574 0 0 0
Dr 393 0 0
At STD N 00E0FFFF
Ne 0 ""
Po 2000 9500
$EndPAD
$PAD
Sh "3" C 1574 1574 0 0 0
Dr 393 0 0
At STD N 00E0FFFF
Ne 0 ""
Po 8000 9500
$EndPAD
$PAD
Sh "4" C 1574 1574 0 0 0
Dr 393 0 0
At STD N 00E0FFFF
Ne 0 ""
Po 8000 3500
$EndPAD
$PAD
Sh "5" C 1574 1574 0 0 0
Dr 393 0 0
At STD N 00E0FFFF
Ne 0 ""
Po 8000 5500
$EndPAD
$PAD
Sh "6" C 1574 1574 0 0 0
Dr 393 0 0
At STD N 00E0FFFF
Ne 0 ""
Po 8000 7500
$EndPAD
$EndMODULE TR2
$MODULE TRANSF EI305-1
Po 0 0 0 15 479D098E 47B1870A ~~
Li TRANSF EI305-1
Sc 47B1870A
AR 
Op 0 0 0
T0 250 1500 600 600 0 120 N V 21 N "TRANSF EI305-1"
T1 0 0 600 600 0 120 N V 21 N "VAL**"
DS -5000 -4000 5000 -4000 50 21
DS 5000 -4000 5000 4000 50 21
DS 5000 4000 -5000 4000 50 21
DS -5000 4000 -5000 -4000 50 21
DS 6500 -5500 6500 5500 50 21
DS 6500 5500 -6500 5500 50 21
DS -6500 5500 -6500 -5500 50 21
DS -6500 -5500 6500 -5500 50 21
DS -6250 -5500 4500 -5500 50 21
DS 4500 -5500 6500 -5500 50 21
DS 6500 -5500 6500 5250 50 21
$PAD
Sh "1" C 984 984 0 0 0
Dr 0 0 0
At SMD N 00C0FFFF
Ne 0 ""
Po 4000 -4000
$EndPAD
$PAD
Sh "5" C 984 984 0 0 0
Dr 0 0 0
At SMD N 00C0FFFF
Ne 0 ""
Po -4000 -4000
$EndPAD
$PAD
Sh "7" C 984 984 0 0 0
Dr 0 0 0
At SMD N 00C0FFFF
Ne 0 ""
Po -2000 4000
$EndPAD
$PAD
Sh "9" C 984 984 0 0 0
Dr 0 0 0
At SMD N 00C0FFFF
Ne 0 ""
Po 2000 4000
$EndPAD
$SHAPE3D
Na "LR/TRHEI305_1.wrl"
Sc 1 1 1
Of 0 0 0
Ro 0 0 0
$EndSHAPE3D
$EndMODULE TRANSF EI305-1
$MODULE TRANSF EI305-1_v2
Po 0 0 0 15 4FBD2A07 00000000 ~~
Li TRANSF EI305-1_v2
Sc 0
AR 
Op 0 0 0
T0 0 -5850 394 394 0 79 N V 21 N "TRANSF EI305-1"
T1 0 0 394 394 0 79 N I 21 N "Value"
DS -5000 -4000 5000 -4000 50 21
DS 5000 -4000 5000 4000 50 21
DS 5000 4000 -5000 4000 50 21
DS -5000 4000 -5000 -4000 50 21
DS 6500 -5500 6500 5500 50 21
DS 6500 5500 -6500 5500 50 21
DS -6500 5500 -6500 -5500 50 21
DS -6500 -5500 6500 -5500 50 21
DS -6250 -5500 4500 -5500 50 21
DS 4500 -5500 6500 -5500 50 21
DS 6500 -5500 6500 5250 50 21
$PAD
Sh "1" C 984 984 0 0 0
Dr 394 0 0
At STD N 00E0FFFF
Ne 0 ""
Po 4000 -4000
$EndPAD
$PAD
Sh "5" C 984 984 0 0 0
Dr 394 0 0
At STD N 00E0FFFF
Ne 0 ""
Po -4000 -4000
$EndPAD
$PAD
Sh "7" C 984 984 0 0 0
Dr 394 0 0
At STD N 00E0FFFF
Ne 0 ""
Po -2000 4000
$EndPAD
$PAD
Sh "9" C 984 984 0 0 0
Dr 394 0 0
At STD N 00E0FFFF
Ne 0 ""
Po 2000 4000
$EndPAD
$SHAPE3D
Na "Transformer\\TRHEI305_1.wrl"
Sc 1 1 1
Of 0 0 0
Ro 0 0 0
$EndSHAPE3D
$EndMODULE TRANSF EI305-1_v2
$MODULE TRANSF EI305-2
Po 0 0 0 15 4FBD2A74 00000000 ~~
Li TRANSF EI305-2
Sc 0
AR 
Op 0 0 0
T0 0 -5950 394 394 0 79 N V 21 N "TRANSF EI305-2"
T1 0 0 394 394 0 79 N I 21 N "Value"
DS -5000 -4000 5000 -4000 50 21
DS 5000 -4000 5000 4000 50 21
DS 5000 4000 -5000 4000 50 21
DS -5000 4000 -5000 -4000 50 21
DS 6500 -5500 6500 5500 50 21
DS 6500 5500 -6500 5500 50 21
DS -6500 5500 -6500 -5500 50 21
DS -6500 -5500 6500 -5500 50 21
DS -6250 -5500 4500 -5500 50 21
DS 4500 -5500 6500 -5500 50 21
DS 6500 -5500 6500 5250 50 21
$PAD
Sh "1" C 984 984 0 0 0
Dr 394 0 0
At STD N 00E0FFFF
Ne 0 ""
Po 4000 -4000
$EndPAD
$PAD
Sh "5" C 984 984 0 0 0
Dr 394 0 0
At STD N 00E0FFFF
Ne 0 ""
Po -4000 -4000
$EndPAD
$PAD
Sh "7" C 984 984 0 0 0
Dr 394 0 0
At STD N 00E0FFFF
Ne 0 ""
Po -2000 4000
$EndPAD
$PAD
Sh "9" C 984 984 0 0 0
Dr 394 0 0
At STD N 00E0FFFF
Ne 0 ""
Po 2000 4000
$EndPAD
$PAD
Sh "10" C 984 984 0 0 0
Dr 394 0 0
At STD N 00E0FFFF
Ne 0 ""
Po 4000 4000
$EndPAD
$PAD
Sh "6" C 984 984 0 0 0
Dr 394 0 0
At STD N 00E0FFFF
Ne 0 ""
Po -4000 4000
$EndPAD
$SHAPE3D
Na "Transformer\\TRHEI305_2.wrl"
Sc 1 1 1
Of 0 0 0
Ro 0 0 0
$EndSHAPE3D
$EndMODULE TRANSF EI305-2
$MODULE Transfo-double
Po 0 0 0 15 4FDA340F 00000000 ~~
Li Transfo-double
Sc 0
AR 
Op 0 0 0
T0 0 -6500 393 393 0 78 N V 21 N "Transfo-double"
T1 0 0 392 392 0 77 N I 21 N "Value"
DS -6000 -6000 6000 -6000 150 21
DS 6000 -6000 6000 6000 150 21
DS 6000 6000 -6000 6000 150 21
DS -6000 6000 -6000 -6000 150 21
$PAD
Sh "1" C 1000 1000 0 0 0
Dr 315 0 0
At STD N 00F0FFFF
Ne 0 ""
Po -4000 -4000
$EndPAD
$PAD
Sh "2" C 1000 1000 0 0 0
Dr 315 0 0
At STD N 00F0FFFF
Ne 0 ""
Po 4000 -4000
$EndPAD
$PAD
Sh "3" C 1000 1000 0 0 0
Dr 315 0 0
At STD N 00F0FFFF
Ne 0 ""
Po 4000 4000
$EndPAD
$PAD
Sh "4" C 1000 1000 0 0 0
Dr 315 0 0
At STD N 00F0FFFF
Ne 0 ""
Po 2000 4000
$EndPAD
$PAD
Sh "5" C 1000 1000 0 0 0
Dr 315 0 0
At STD N 00F0FFFF
Ne 0 ""
Po -2000 4000
$EndPAD
$PAD
Sh "6" C 1000 1000 0 0 0
Dr 315 0 0
At STD N 00F0FFFF
Ne 0 ""
Po -4000 4000
$EndPAD
$SHAPE3D
Na "Transformer/Transfo_Serie_VB2.wrl"
Sc 1 1 1
Of -0.6 0.6 0
Ro 0 0 0
$EndSHAPE3D
$EndMODULE Transfo-double
$MODULE Transfo-simple
Po 0 0 0 15 4FDA3511 00000000 ~~
Li Transfo-simple
Sc 0
AR 
Op 0 0 0
T0 0 -6000 393 393 0 78 N V 21 N "Transfo-simple"
T1 0 0 392 392 0 77 N I 21 N "Value"
DS -6500 -5500 6500 -5500 150 21
DS 6500 -5500 6500 5500 150 21
DS 6500 5500 -6500 5500 150 21
DS -6500 5500 -6500 -5500 150 21
$PAD
Sh "2" C 1000 1000 0 0 0
Dr 315 0 0
At STD N 00F0FFFF
Ne 0 ""
Po -4000 -3500
$EndPAD
$PAD
Sh "1" C 1000 1000 0 0 0
Dr 315 0 0
At STD N 00F0FFFF
Ne 0 ""
Po 4000 -3500
$EndPAD
$PAD
Sh "3" C 1000 1000 0 0 0
Dr 315 0 0
At STD N 00F0FFFF
Ne 0 ""
Po 2000 4000
$EndPAD
$PAD
Sh "4" C 1000 1000 0 0 0
Dr 315 0 0
At STD N 00F0FFFF
Ne 0 ""
Po -2000 4000
$EndPAD
$SHAPE3D
Na "Transformer/Transfo_Serie_VB-simple.wrl"
Sc 1 1 1
Of -0.64 0.55 0
Ro 0 0 0
$EndSHAPE3D
$EndMODULE Transfo-simple
$MODULE tr_sw01H25x25
Po 0 0 0 15 4FD650D4 00000000 ~~
Li tr_sw01H25x25
Sc 0
AR 
Op 0 0 0
T0 0 -5000 393 393 0 78 N V 21 N "tr_sw01H25x25"
T1 0 0 393 393 0 78 N I 21 N "Value"
DS -2500 3000 2500 3000 150 21
DS -2500 -3000 2500 -3000 150 21
DS 2500 -3500 2500 3500 150 21
DS -2500 3500 -2500 -3500 150 21
DS 3000 -5000 3000 -4500 250 21
DS 3000 -4500 -3000 -4500 250 21
DS -3000 -4500 -3000 -5000 250 21
DS -3000 5000 -3000 4500 250 21
DS -3000 4500 3000 4500 250 21
DS 3000 4500 3000 5000 250 21
DS 5000 5000 3000 5000 250 21
DS -5000 5000 -3000 5000 250 21
DS -5000 -5000 -3000 -5000 250 21
DS 5000 -5000 3000 -5000 250 21
DS 5000 5000 5000 -5000 250 21
DS -5000 -5000 -5000 5000 250 21
$PAD
Sh "1" R 1500 1500 0 0 0
Dr 393 0 0
At STD N 00E0FFFF
Ne 0 ""
Po -4000 -4000
$EndPAD
$PAD
Sh "2" C 1500 1500 0 0 0
Dr 393 0 0
At STD N 00E0FFFF
Ne 0 ""
Po -4000 -2000
$EndPAD
$PAD
Sh "3" C 1500 1500 0 0 0
Dr 393 0 0
At STD N 00E0FFFF
Ne 0 ""
Po -4000 0
$EndPAD
$PAD
Sh "4" C 1500 1500 0 0 0
Dr 393 0 0
At STD N 00E0FFFF
Ne 0 ""
Po -4000 2000
$EndPAD
$PAD
Sh "5" C 1500 1500 0 0 0
Dr 393 0 0
At STD N 00E0FFFF
Ne 0 ""
Po -4000 4000
$EndPAD
$PAD
Sh "6" C 1500 1500 0 0 0
Dr 393 0 0
At STD N 00E0FFFF
Ne 0 ""
Po 4000 4000
$EndPAD
$PAD
Sh "8" C 1500 1500 0 0 0
Dr 393 0 0
At STD N 00E0FFFF
Ne 0 ""
Po 4000 0
$EndPAD
$PAD
Sh "10" C 1500 1500 0 0 0
Dr 393 0 0
At STD N 00E0FFFF
Ne 0 ""
Po 4000 -4000
$EndPAD
$EndMODULE tr_sw01H25x25
$EndLIBRARY
