PCBNEW-LibModule-V1  21.5.2012 18:48:07
# encoding utf-8
$INDEX
SIL-1
SIL-11
SIL-16
SIL-20
$EndINDEX
$MODULE SIL-1
Po 0 0 0 15 4FBA70FA 00000000 ~~
Li SIL-1
Cd Connecteurs 2 pins
Kw CONN DEV
Sc 00000000
AR
Op 0 0 0
T0 0 -1000 394 394 0 79 N V 21 N "SIL-1"
T1 50 1100 394 394 0 79 N I 21 N "Val**"
DS -500 -500 500 -500 120 21
DS 500 -500 500 500 120 21
DS 500 500 -500 500 120 21
DS -500 500 -500 -500 120 21
$PAD
Sh "1" R 550 550 0 0 0
Dr 320 0 0
At STD N 00E0FFFF
Ne 0 ""
Po 0 0
$EndPAD
$EndMODULE  SIL-1
$MODULE SIL-11
Po 0 0 0 15 4FBA7120 00000000 ~~
Li SIL-11
Cd Connecteur 10 pins
Kw CONN DEV
Sc 00000000
AR
Op 0 0 0
T0 0 -900 394 394 0 79 N V 21 N "SIL-11"
T1 0 950 394 394 0 79 N I 21 N "Val**"
DS 4500 -500 5500 -500 120 21
DS 5500 -500 5500 500 120 21
DS 5500 500 4500 500 120 21
DS -5500 500 -5500 -500 120 21
DS -5500 -500 4500 -500 120 21
DS 4500 500 -5500 500 120 21
DS -4500 500 -4500 -500 120 21
$PAD
Sh "1" R 550 550 0 0 0
Dr 320 0 0
At STD N 00E0FFFF
Ne 0 ""
Po -5000 0
$EndPAD
$PAD
Sh "2" C 550 550 0 0 0
Dr 320 0 0
At STD N 00E0FFFF
Ne 0 ""
Po -4000 0
$EndPAD
$PAD
Sh "3" C 550 550 0 0 0
Dr 320 0 0
At STD N 00E0FFFF
Ne 0 ""
Po -3000 0
$EndPAD
$PAD
Sh "4" C 550 550 0 0 0
Dr 320 0 0
At STD N 00E0FFFF
Ne 0 ""
Po -2000 0
$EndPAD
$PAD
Sh "5" C 550 550 0 0 0
Dr 320 0 0
At STD N 00E0FFFF
Ne 0 ""
Po -1000 0
$EndPAD
$PAD
Sh "6" C 550 550 0 0 0
Dr 320 0 0
At STD N 00E0FFFF
Ne 0 ""
Po 0 0
$EndPAD
$PAD
Sh "7" C 550 550 0 0 0
Dr 320 0 0
At STD N 00E0FFFF
Ne 0 ""
Po 1000 0
$EndPAD
$PAD
Sh "8" C 550 550 0 0 0
Dr 320 0 0
At STD N 00E0FFFF
Ne 0 ""
Po 2000 0
$EndPAD
$PAD
Sh "9" C 550 550 0 0 0
Dr 320 0 0
At STD N 00E0FFFF
Ne 0 ""
Po 3000 0
$EndPAD
$PAD
Sh "10" C 550 550 0 0 0
Dr 320 0 0
At STD N 00E0FFFF
Ne 0 ""
Po 4000 0
$EndPAD
$PAD
Sh "11" C 550 550 0 0 0
Dr 320 0 0
At STD N 00E0FFFF
Ne 0 ""
Po 5000 0
$EndPAD
$EndMODULE  SIL-11
$MODULE SIL-16
Po 0 0 0 15 4FBA716F 00000000 ~~
Li SIL-16
Cd Connecteur 15 pins
Kw CONN DEV
Sc 00000000
AR
Op 0 0 0
T0 0 -1000 394 394 0 79 N V 21 N "SIL-16"
T1 0 950 394 394 0 79 N I 21 N "Val**"
DS -7000 450 -7000 -450 150 21
DS 7000 -500 8000 -500 120 21
DS 8000 -500 8000 500 120 21
DS 8000 500 7000 500 120 21
DS -8000 -500 7000 -500 120 21
DS 7000 500 -8000 500 120 21
DS -8000 500 -8000 -500 120 21
$PAD
Sh "1" R 550 550 0 0 0
Dr 320 0 0
At STD N 00E0FFFF
Ne 0 ""
Po -7500 0
$EndPAD
$PAD
Sh "2" C 550 550 0 0 0
Dr 320 0 0
At STD N 00E0FFFF
Ne 0 ""
Po -6500 0
$EndPAD
$PAD
Sh "3" C 550 550 0 0 0
Dr 320 0 0
At STD N 00E0FFFF
Ne 0 ""
Po -5500 0
$EndPAD
$PAD
Sh "4" C 550 550 0 0 0
Dr 320 0 0
At STD N 00E0FFFF
Ne 0 ""
Po -4500 0
$EndPAD
$PAD
Sh "5" C 550 550 0 0 0
Dr 320 0 0
At STD N 00E0FFFF
Ne 0 ""
Po -3500 0
$EndPAD
$PAD
Sh "6" C 550 550 0 0 0
Dr 320 0 0
At STD N 00E0FFFF
Ne 0 ""
Po -2500 0
$EndPAD
$PAD
Sh "7" C 550 550 0 0 0
Dr 320 0 0
At STD N 00E0FFFF
Ne 0 ""
Po -1500 0
$EndPAD
$PAD
Sh "8" C 550 550 0 0 0
Dr 320 0 0
At STD N 00E0FFFF
Ne 0 ""
Po -500 0
$EndPAD
$PAD
Sh "9" C 550 550 0 0 0
Dr 320 0 0
At STD N 00E0FFFF
Ne 0 ""
Po 500 0
$EndPAD
$PAD
Sh "10" C 550 550 0 0 0
Dr 320 0 0
At STD N 00E0FFFF
Ne 0 ""
Po 1500 0
$EndPAD
$PAD
Sh "11" C 550 550 0 0 0
Dr 320 0 0
At STD N 00E0FFFF
Ne 0 ""
Po 2500 0
$EndPAD
$PAD
Sh "12" C 550 550 0 0 0
Dr 320 0 0
At STD N 00E0FFFF
Ne 0 ""
Po 3500 0
$EndPAD
$PAD
Sh "13" C 550 550 0 0 0
Dr 320 0 0
At STD N 00E0FFFF
Ne 0 ""
Po 4500 0
$EndPAD
$PAD
Sh "14" C 550 550 0 0 0
Dr 320 0 0
At STD N 00E0FFFF
Ne 0 ""
Po 5500 0
$EndPAD
$PAD
Sh "15" C 550 550 0 0 0
Dr 320 0 0
At STD N 00E0FFFF
Ne 0 ""
Po 6500 0
$EndPAD
$PAD
Sh "16" C 550 550 0 0 0
Dr 320 0 0
At STD N 00E0FFFF
Ne 0 ""
Po 7500 0
$EndPAD
$EndMODULE  SIL-16
$MODULE SIL-20
Po 0 0 0 15 4FBA71B8 00000000 ~~
Li SIL-20
Cd Connecteur 18 pins
Kw CONN DEV
Sc 00000000
AR 
Op 0 0 0
T0 0 -1000 394 394 0 79 N V 21 N "SIL-20"
T1 0 1000 394 394 0 79 N I 21 N "Val**"
DS 8000 -500 10000 -500 120 21
DS 10000 -500 10000 500 120 21
DS 10000 500 8000 500 120 21
DS -10000 -500 8000 -500 120 21
DS 8000 500 -10000 500 120 21
DS -10000 500 -10000 -500 120 21
DS -9000 -500 -9000 500 120 21
$PAD
Sh "1" R 550 550 0 0 0
Dr 320 0 0
At STD N 00E0FFFF
Ne 0 ""
Po -9500 0
$EndPAD
$PAD
Sh "2" C 550 550 0 0 0
Dr 320 0 0
At STD N 00E0FFFF
Ne 0 ""
Po -8500 0
$EndPAD
$PAD
Sh "3" C 550 550 0 0 0
Dr 320 0 0
At STD N 00E0FFFF
Ne 0 ""
Po -7500 0
$EndPAD
$PAD
Sh "4" C 550 550 0 0 0
Dr 320 0 0
At STD N 00E0FFFF
Ne 0 ""
Po -6500 0
$EndPAD
$PAD
Sh "5" C 550 550 0 0 0
Dr 320 0 0
At STD N 00E0FFFF
Ne 0 ""
Po -5500 0
$EndPAD
$PAD
Sh "6" C 550 550 0 0 0
Dr 320 0 0
At STD N 00E0FFFF
Ne 0 ""
Po -4500 0
$EndPAD
$PAD
Sh "7" C 550 550 0 0 0
Dr 320 0 0
At STD N 00E0FFFF
Ne 0 ""
Po -3500 0
$EndPAD
$PAD
Sh "8" C 550 550 0 0 0
Dr 320 0 0
At STD N 00E0FFFF
Ne 0 ""
Po -2500 0
$EndPAD
$PAD
Sh "9" C 550 550 0 0 0
Dr 320 0 0
At STD N 00E0FFFF
Ne 0 ""
Po -1500 0
$EndPAD
$PAD
Sh "10" C 550 550 0 0 0
Dr 320 0 0
At STD N 00E0FFFF
Ne 0 ""
Po -500 0
$EndPAD
$PAD
Sh "11" C 550 550 0 0 0
Dr 320 0 0
At STD N 00E0FFFF
Ne 0 ""
Po 500 0
$EndPAD
$PAD
Sh "12" C 550 550 0 0 0
Dr 320 0 0
At STD N 00E0FFFF
Ne 0 ""
Po 1500 0
$EndPAD
$PAD
Sh "13" C 550 550 0 0 0
Dr 320 0 0
At STD N 00E0FFFF
Ne 0 ""
Po 2500 0
$EndPAD
$PAD
Sh "14" C 550 550 0 0 0
Dr 320 0 0
At STD N 00E0FFFF
Ne 0 ""
Po 3500 0
$EndPAD
$PAD
Sh "15" C 550 550 0 0 0
Dr 320 0 0
At STD N 00E0FFFF
Ne 0 ""
Po 4500 0
$EndPAD
$PAD
Sh "16" C 550 550 0 0 0
Dr 320 0 0
At STD N 00E0FFFF
Ne 0 ""
Po 5500 0
$EndPAD
$PAD
Sh "17" C 550 550 0 0 0
Dr 320 0 0
At STD N 00E0FFFF
Ne 0 ""
Po 6500 0
$EndPAD
$PAD
Sh "18" C 550 550 0 0 0
Dr 320 0 0
At STD N 00E0FFFF
Ne 0 ""
Po 7500 0
$EndPAD
$PAD
Sh "19" C 550 550 0 0 0
Dr 320 0 0
At STD N 00E0FFFF
Ne 0 ""
Po 8500 0
$EndPAD
$PAD
Sh "20" C 550 550 0 0 0
Dr 320 0 0
At STD N 00E0FFFF
Ne 0 ""
Po 9500 0
$EndPAD
$EndMODULE  SIL-20
$EndLIBRARY
