PCBNEW-LibModule-V1  So 5. leden 2013, 15:26:26 CET
# encoding utf-8
Units deci-mils
$INDEX
G128641B
LCD30
MCOC0802
$EndINDEX
$MODULE G128641B
Po 0 0 0 15 4FE1F8F0 00000000 ~~
Li G128641B
Sc 0
AR 
Op 0 0 0
T0 0 -13750 392 392 0 80 N V 21 N "G128641B"
T1 0 0 392 392 0 80 N I 21 N "Value"
DS -10800 8100 11400 8100 118 21
DS 11400 8100 11400 -6900 118 21
DS 11400 -6900 -10800 -6900 118 21
DS -10800 -6900 -10800 8100 118 21
DS -12000 9100 -12000 -8300 118 21
DS -12000 -8300 -11400 -8300 118 21
DS -12000 9100 12600 9100 118 21
DS 12600 9100 12600 -8300 118 21
DS 12600 -8300 -11800 -8300 118 21
DS -14800 -10900 15000 -10900 118 21
DS -14800 11900 15000 11900 118 21
DS 15000 11900 15000 11700 118 21
DC -12800 -12100 -12400 -11900 118 21
DC 13000 -12100 13200 -11700 118 21
DS -14800 -13100 15000 -13100 118 21
DS 15000 -13100 15000 14500 118 21
DS 15000 14500 -14800 14500 118 21
DS -14800 14500 -14800 -13100 118 21
DS -14800 -13100 -14600 -13100 118 21
$PAD
Sh "1" C 591 591 0 0 0
Dr 394 0 0
At STD N 00E0FFFF
Ne 9 "GND"
Po -9600 -12100
$EndPAD
$PAD
Sh "2" C 591 591 0 0 0
Dr 394 0 0
At STD N 00E0FFFF
Ne 9 "GND"
Po -8600 -12100
$EndPAD
$PAD
Sh "3" C 591 591 0 0 0
Dr 394 0 0
At STD N 00E0FFFF
Ne 10 "VCC"
Po -7600 -12100
$EndPAD
$PAD
Sh "4" C 591 591 0 0 0
Dr 394 0 0
At STD N 00E0FFFF
Ne 0 ""
Po -6600 -12100
$EndPAD
$PAD
Sh "5" C 591 591 0 0 0
Dr 394 0 0
At STD N 00E0FFFF
Ne 0 ""
Po -5600 -12100
$EndPAD
$PAD
Sh "6" C 591 591 0 0 0
Dr 394 0 0
At STD N 00E0FFFF
Ne 0 ""
Po -4600 -12100
$EndPAD
$PAD
Sh "7" C 591 591 0 0 0
Dr 394 0 0
At STD N 00E0FFFF
Ne 0 ""
Po -3600 -12100
$EndPAD
$PAD
Sh "8" C 591 591 0 0 0
Dr 394 0 0
At STD N 00E0FFFF
Ne 0 ""
Po -2600 -12100
$EndPAD
$PAD
Sh "9" C 591 591 0 0 0
Dr 394 0 0
At STD N 00E0FFFF
Ne 0 ""
Po -1600 -12100
$EndPAD
$PAD
Sh "11" C 591 591 0 0 0
Dr 394 0 0
At STD N 00E0FFFF
Ne 2 "DA-1_1"
Po 400 -12100
$EndPAD
$PAD
Sh "10" C 591 591 0 0 0
Dr 394 0 0
At STD N 00E0FFFF
Ne 1 "ChA-0_7"
Po -600 -12100
$EndPAD
$PAD
Sh "12" C 591 591 0 0 0
Dr 394 0 0
At STD N 00E0FFFF
Ne 3 "DA-2_1"
Po 1400 -12100
$EndPAD
$PAD
Sh "13" C 591 591 0 0 0
Dr 394 0 0
At STD N 00E0FFFF
Ne 4 "DA-3_6"
Po 2400 -12100
$EndPAD
$PAD
Sh "14" C 591 591 0 0 0
Dr 394 0 0
At STD N 00E0FFFF
Ne 5 "DA-4_4"
Po 3400 -12100
$EndPAD
$PAD
Sh "15" C 591 591 0 0 0
Dr 394 0 0
At STD N 00E0FFFF
Ne 6 "DA-5_1"
Po 4400 -12100
$EndPAD
$PAD
Sh "16" C 591 591 0 0 0
Dr 394 0 0
At STD N 00E0FFFF
Ne 7 "DA-6_1"
Po 5400 -12100
$EndPAD
$PAD
Sh "17" C 591 591 0 0 0
Dr 394 0 0
At STD N 00E0FFFF
Ne 8 "DA-7_1"
Po 6400 -12100
$EndPAD
$PAD
Sh "18" C 591 591 0 0 0
Dr 394 0 0
At STD N 00E0FFFF
Ne 0 ""
Po 7400 -12100
$EndPAD
$PAD
Sh "19" C 591 591 0 0 0
Dr 394 0 0
At STD N 00E0FFFF
Ne 0 ""
Po 8400 -12100
$EndPAD
$PAD
Sh "20" C 591 591 0 0 0
Dr 394 0 0
At STD N 00E0FFFF
Ne 0 ""
Po 9400 -12100
$EndPAD
$EndMODULE G128641B
$MODULE LCD30
Po 0 0 0 15 50DCABF1 00000000 ~~
Li LCD30
Sc 0
AR 
Op 0 0 0
T0 0 -7480 394 394 0 79 N V 21 N "LCD30"
T1 0 4724 394 394 0 79 N I 21 N "VAL**"
DC -6693 -6693 -6693 -6496 392 21
DS -2953 2362 -2559 394 393 21
DS -5115 2756 -3147 2756 393 21
DS -4921 394 -5315 2362 393 21
DS -2362 -394 -1968 -2362 393 21
DS -4134 -2756 -2165 -2756 393 21
DS -4724 -394 -4330 -2362 393 21
DS -4527 0 -2756 0 392 21
DC -2362 2953 -2165 2953 392 21
DC 1181 2952 1378 2952 392 21
DS 2559 -1 4330 -1 392 21
DS 2362 -395 2756 -2363 393 21
DS 2952 -2757 4921 -2757 393 21
DS 4724 -395 5118 -2363 393 21
DS 2165 393 1771 2361 393 21
DS 1971 2755 3939 2755 393 21
DS 4133 2361 4527 393 393 21
DS 590 2362 984 394 393 21
DS -1572 2756 396 2756 393 21
DS -1378 394 -1772 2362 393 21
DS 1181 -394 1575 -2362 393 21
DS -591 -2756 1378 -2756 393 21
DS -1181 -394 -787 -2362 393 21
DS -984 0 787 0 392 21
DS -6102 -3543 6102 -3543 150 21
DS 6102 -3543 6102 3543 150 21
DS 6102 3543 -6102 3543 150 21
DS -6102 3543 -6102 -3543 150 21
DS 6890 6004 -6890 6004 150 21
DS -6890 6004 -6890 -6004 150 21
DS -6890 -6004 6890 -6004 150 21
DS 6890 -6004 6890 6004 150 21
$PAD
Sh "1" R 590 1181 0 0 0
Dr 314 0 0
At STD N 00E0FFFF
Ne 0 ""
Po -5500 -6500
$EndPAD
$PAD
Sh "2" O 590 1180 0 0 0
Dr 314 0 0
At STD N 00E0FFFF
Ne 0 ""
Po -4500 -6500
$EndPAD
$PAD
Sh "3" O 590 1180 0 0 0
Dr 314 0 0
At STD N 00E0FFFF
Ne 0 ""
Po -3500 -6500
$EndPAD
$PAD
Sh "4" O 590 1180 0 0 0
Dr 314 0 0
At STD N 00E0FFFF
Ne 0 ""
Po -2500 -6500
$EndPAD
$PAD
Sh "5" O 590 1180 0 0 0
Dr 314 0 0
At STD N 00E0FFFF
Ne 0 ""
Po -1500 -6500
$EndPAD
$PAD
Sh "6" O 590 1180 0 0 0
Dr 314 0 0
At STD N 00E0FFFF
Ne 0 ""
Po -500 -6500
$EndPAD
$PAD
Sh "7" O 590 1180 0 0 0
Dr 314 0 0
At STD N 00E0FFFF
Ne 0 ""
Po 500 -6500
$EndPAD
$PAD
Sh "8" O 590 1180 0 0 0
Dr 314 0 0
At STD N 00E0FFFF
Ne 0 ""
Po 1500 -6500
$EndPAD
$PAD
Sh "9" O 590 1180 0 0 0
Dr 314 0 0
At STD N 00E0FFFF
Ne 0 ""
Po 2500 -6500
$EndPAD
$PAD
Sh "10" O 590 1180 0 0 0
Dr 314 0 0
At STD N 00E0FFFF
Ne 0 ""
Po 3500 -6500
$EndPAD
$PAD
Sh "11" O 590 1180 0 0 0
Dr 314 0 0
At STD N 00E0FFFF
Ne 0 ""
Po 4500 -6500
$EndPAD
$PAD
Sh "12" O 590 1180 0 0 0
Dr 314 0 0
At STD N 00E0FFFF
Ne 0 ""
Po 5500 -6500
$EndPAD
$PAD
Sh "13" O 590 1180 0 0 0
Dr 314 0 0
At STD N 00E0FFFF
Ne 0 ""
Po 5500 6500
$EndPAD
$PAD
Sh "14" O 590 1180 0 0 0
Dr 314 0 0
At STD N 00E0FFFF
Ne 0 ""
Po 4500 6500
$EndPAD
$PAD
Sh "15" O 590 1180 0 0 0
Dr 314 0 0
At STD N 00E0FFFF
Ne 0 ""
Po 3500 6500
$EndPAD
$PAD
Sh "16" O 590 1180 0 0 0
Dr 314 0 0
At STD N 00E0FFFF
Ne 0 ""
Po 2500 6500
$EndPAD
$PAD
Sh "17" O 590 1180 0 0 0
Dr 314 0 0
At STD N 00E0FFFF
Ne 0 ""
Po 1500 6500
$EndPAD
$PAD
Sh "18" O 590 1180 0 0 0
Dr 314 0 0
At STD N 00E0FFFF
Ne 0 ""
Po 500 6500
$EndPAD
$PAD
Sh "19" O 590 1180 0 0 0
Dr 314 0 0
At STD N 00E0FFFF
Ne 0 ""
Po -500 6500
$EndPAD
$PAD
Sh "20" O 590 1180 0 0 0
Dr 314 0 0
At STD N 00E0FFFF
Ne 0 ""
Po -1500 6500
$EndPAD
$PAD
Sh "21" O 590 1180 0 0 0
Dr 314 0 0
At STD N 00E0FFFF
Ne 0 ""
Po -2500 6500
$EndPAD
$PAD
Sh "22" O 590 1180 0 0 0
Dr 314 0 0
At STD N 00E0FFFF
Ne 0 ""
Po -3500 6500
$EndPAD
$PAD
Sh "23" O 590 1180 0 0 0
Dr 314 0 0
At STD N 00E0FFFF
Ne 0 ""
Po -4500 6500
$EndPAD
$PAD
Sh "24" O 590 1180 0 0 0
Dr 314 0 0
At STD N 00E0FFFF
Ne 0 ""
Po -5500 6500
$EndPAD
$EndMODULE LCD30
$MODULE MCOC0802
Po 0 0 0 15 50B357E5 00000000 ~~
Li MCOC0802
Sc 0
AR 
Op 0 0 0
T0 0 -6890 394 394 0 79 N V 21 N "MCOC0802"
T1 0 0 394 394 0 79 N I 21 N "Value"
DS -5512 -2362 5512 -2362 150 21
DS 5512 -2362 5512 2362 150 21
DS 5512 2362 -5512 2362 150 21
DS -5512 2362 -5512 -2362 150 21
DS -8465 -4528 8465 -4528 150 21
DS 8465 -4528 8465 4528 150 21
DS 8465 4528 -8465 4528 150 21
DS -8465 4528 -8465 -4528 150 21
DS -11417 -6299 11417 -6299 150 21
DS 11417 -6299 11417 6299 150 21
DS 11417 6299 -11417 6299 150 21
DS -11417 6299 -11417 -6299 150 21
$PAD
Sh "D1" C 1969 1969 0 0 0
Dr 984 0 0
At STD N 00E0FFFF
Ne 0 ""
Po -10433 5315
$EndPAD
$PAD
Sh "D4" C 1969 1969 0 0 0
Dr 984 0 0
At STD N 00E0FFFF
Ne 0 ""
Po -10433 -5315
$EndPAD
$PAD
Sh "D2" C 1969 1969 0 0 0
Dr 984 0 0
At STD N 00E0FFFF
Ne 0 ""
Po 10433 5315
$EndPAD
$PAD
Sh "D3" C 1969 1969 0 0 0
Dr 984 0 0
At STD N 00E0FFFF
Ne 0 ""
Po 10433 -5315
$EndPAD
$PAD
Sh "8" C 669 669 0 0 0
Dr 394 0 0
At STD N 00E0FFFF
Ne 0 ""
Po -10787 500
$EndPAD
$PAD
Sh "6" C 669 669 0 0 0
Dr 394 0 0
At STD N 00E0FFFF
Ne 0 ""
Po -10787 1500
$EndPAD
$PAD
Sh "4" C 669 669 0 0 0
Dr 394 0 0
At STD N 00E0FFFF
Ne 0 ""
Po -10787 2500
$EndPAD
$PAD
Sh "2" C 669 669 0 0 0
Dr 394 0 0
At STD N 00E0FFFF
Ne 0 ""
Po -10787 3500
$EndPAD
$PAD
Sh "10" C 669 669 0 0 0
Dr 394 0 0
At STD N 00E0FFFF
Ne 0 ""
Po -10787 -500
$EndPAD
$PAD
Sh "12" C 669 669 0 0 0
Dr 394 0 0
At STD N 00E0FFFF
Ne 0 ""
Po -10787 -1500
$EndPAD
$PAD
Sh "14" C 669 669 0 0 0
Dr 394 0 0
At STD N 00E0FFFF
Ne 0 ""
Po -10787 -2500
$EndPAD
$PAD
Sh "16" C 669 669 0 0 0
Dr 394 0 0
At STD N 00E0FFFF
Ne 0 ""
Po -10787 -3500
$EndPAD
$PAD
Sh "1" C 669 669 0 0 0
Dr 394 0 0
At STD N 00E0FFFF
Ne 0 ""
Po -9787 3500
$EndPAD
$PAD
Sh "3" C 669 669 0 0 0
Dr 394 0 0
At STD N 00E0FFFF
Ne 0 ""
Po -9787 2500
$EndPAD
$PAD
Sh "5" C 669 669 0 0 0
Dr 394 0 0
At STD N 00E0FFFF
Ne 0 ""
Po -9787 1500
$EndPAD
$PAD
Sh "7" C 669 669 0 0 0
Dr 394 0 0
At STD N 00E0FFFF
Ne 0 ""
Po -9787 500
$EndPAD
$PAD
Sh "9" C 669 669 0 0 0
Dr 394 0 0
At STD N 00E0FFFF
Ne 0 ""
Po -9787 -500
$EndPAD
$PAD
Sh "11" C 669 669 0 0 0
Dr 394 0 0
At STD N 00E0FFFF
Ne 0 ""
Po -9787 -1500
$EndPAD
$PAD
Sh "13" C 669 669 0 0 0
Dr 394 0 0
At STD N 00E0FFFF
Ne 0 ""
Po -9787 -2500
$EndPAD
$PAD
Sh "15" C 669 669 0 0 0
Dr 394 0 0
At STD N 00E0FFFF
Ne 0 ""
Po -9787 -3500
$EndPAD
$SHAPE3D
Na "LED-Display/MCOC0802.wrl"
Sc 1 1 1
Of 0 0 0
Ro 0 0 0
$EndSHAPE3D
$EndMODULE MCOC0802
$EndLIBRARY
