(module Elko_vert_11.5x8mm_RM3.5_CopperClear (layer F.Cu) (tedit 562EA862)
  (descr "Electrolytic Capacitor, vertical, diameter 8mm, RM 3,5mm, Copper clear, radial,")
  (tags "Electrolytic Capacitor, vertical, diameter 8mm, RM 3,5mm, Elko, Electrolytkondensator, Kondensator gepolt, Durchmesser 8mm, Copper clear,")
  (fp_text reference REF** (at 1.905 -5.08) (layer F.SilkS)
    (effects (font (size 1 1) (thickness 0.15)))
  )
  (fp_text value Elko_vert_11.5x8mm_RM3.5_CopperClear (at 2.54 6.35) (layer F.Fab)
    (effects (font (size 1 1) (thickness 0.15)))
  )
  (fp_line (start 0.635 -2.54) (end 0.635 -1.524) (layer F.SilkS) (width 0.15))
  (fp_line (start 0.127 -2.032) (end 1.143 -2.032) (layer F.SilkS) (width 0.15))
  (fp_circle (center 1.905 0) (end 5.9055 0) (layer F.SilkS) (width 0.15))
  (pad 2 thru_hole circle (at 3.81 0) (size 2 2) (drill 0.8001) (layers *.Cu *.Mask F.SilkS))
  (pad 1 thru_hole rect (at 0 0) (size 2 2) (drill 0.8001) (layers *.Cu *.Mask F.SilkS))
  (model Capacitors_Elko_ThroughHole.3dshapes/Elko_vert_11.5x8mm_RM3.5_CopperClear.wrl
    (at (xyz 0 0 0))
    (scale (xyz 1 1 1))
    (rotate (xyz 0 0 0))
  )
)
