PCBNEW-LibModule-V1  sab 23 apr 2011 11:33:29 CEST
# encoding utf-8
$INDEX
relay_hb
relay_SY
relay_V23042
relay_V23042-B2
relay_PE
relay_DK1a
relay_DK1a-L2
relay_DK1a1b-L2
relay_DK1a1b
relay_DK2a
relay_DK2a-L2
relay_RT1
$EndINDEX
$MODULE relay_DK1a
Po 0 0 0 15 4B90E1A5 00000000 ~~
Li relay_DK1a
Cd relay, DK series
Sc 00000000
AR
Op 0 0 0
T0 0 3500 600 600 0 120 N V 21 N"relay_DK1a"
T1 0 -3500 600 600 0 120 N V 21 N"RLY***"
DS -3950 2450 -3950 -2450 120 21
DS 3950 -2450 3950 2450 120 21
DS -2900 -950 -3600 -650 120 21
DS -3500 -2000 -3500 -1100 120 21
DS -500 -1950 -500 -950 120 21
DS -500 -950 -2900 -950 120 21
DS 3500 -300 3500 -2000 120 21
DS 3500 2000 3500 300 120 21
DS 3950 -2450 -3950 -2450 120 21
DS -3950 2450 3950 2450 120 21
DS 3050 1250 3050 1650 120 21
DS 2850 1450 3250 1450 120 21
DS 2850 -1450 3250 -1450 120 21
DS 3900 -300 3100 300 120 21
DS 3900 300 3100 300 120 21
DS 3100 300 3100 -300 120 21
DS 3100 -300 3900 -300 120 21
DS 3900 -300 3900 300 120 21
$PAD
Sh "1" C 787 787 0 0 1800
Dr 315 0 0
At STD N 0000FFFF
Ne 0 ""
Po 3500 -2000
$EndPAD
$PAD
Sh "3" C 787 787 0 0 1800
Dr 315 0 0
At STD N 0000FFFF
Ne 0 ""
Po -500 -2000
$EndPAD
$PAD
Sh "4" C 787 787 0 0 1800
Dr 315 0 0
At STD N 0000FFFF
Ne 0 ""
Po -3500 -2000
$EndPAD
$PAD
Sh "6" C 787 787 0 0 1800
Dr 315 0 0
At STD N 0000FFFF
Ne 0 ""
Po 3500 2000
$EndPAD
$SHAPE3D
Na "walter\relay\relay_DK1a.wrl"
Sc 1.000000 1.000000 1.000000
Of 0.000000 0.000000 0.000000
Ro 0.000000 0.000000 0.000000
$EndSHAPE3D
$EndMODULE  relay_DK1a
$MODULE relay_DK1a-L2
Po 0 0 0 15 4B90E1B2 00000000 ~~
Li relay_DK1a-L2
Cd relay, DK series
Sc 00000000
AR
Op 0 0 0
T0 0 3500 600 600 0 120 N V 21 N"relay_DK1a-L2"
T1 0 -3500 600 600 0 120 N V 21 N"RLY***"
DS -3950 2450 -3950 -2450 120 21
DS 3950 -2450 3950 2450 120 21
DS 2500 -300 2500 -950 120 21
DS 2500 -950 3500 -950 120 21
DS 2900 -300 2900 300 120 21
DS 2100 -300 2900 -300 120 21
DS 2100 300 2100 -300 120 21
DS 2900 300 2100 300 120 21
DS 2900 -300 2100 300 120 21
DS 1850 1450 2250 1450 120 21
DS 2050 1250 2050 1650 120 21
DS 2500 2000 2500 300 120 21
DS -2900 -950 -3600 -650 120 21
DS -3500 -2000 -3500 -1100 120 21
DS -500 -1950 -500 -950 120 21
DS -500 -950 -2900 -950 120 21
DS 3500 -300 3500 -2000 120 21
DS 3500 2000 3500 300 120 21
DS 3950 -2450 -3950 -2450 120 21
DS -3950 2450 3950 2450 120 21
DS 3050 1250 3050 1650 120 21
DS 2850 1450 3250 1450 120 21
DS 2850 -1450 3250 -1450 120 21
DS 3900 -300 3100 300 120 21
DS 3900 300 3100 300 120 21
DS 3100 300 3100 -300 120 21
DS 3100 -300 3900 -300 120 21
DS 3900 -300 3900 300 120 21
$PAD
Sh "1" C 787 787 0 0 1800
Dr 315 0 0
At STD N 0000FFFF
Ne 0 ""
Po 3500 -2000
$EndPAD
$PAD
Sh "3" C 787 787 0 0 1800
Dr 315 0 0
At STD N 0000FFFF
Ne 0 ""
Po -500 -2000
$EndPAD
$PAD
Sh "4" C 787 787 0 0 1800
Dr 315 0 0
At STD N 0000FFFF
Ne 0 ""
Po -3500 -2000
$EndPAD
$PAD
Sh "6" C 787 787 0 0 1800
Dr 315 0 0
At STD N 0000FFFF
Ne 0 ""
Po 3500 2000
$EndPAD
$PAD
Sh "5" C 787 787 0 0 1800
Dr 315 0 0
At STD N 0000FFFF
Ne 0 ""
Po 2500 2000
$EndPAD
$SHAPE3D
Na "walter\relay\relay_DK1a-L2.wrl"
Sc 1.000000 1.000000 1.000000
Of 0.000000 0.000000 0.000000
Ro 0.000000 0.000000 0.000000
$EndSHAPE3D
$EndMODULE  relay_DK1a-L2
$MODULE relay_DK1a1b
Po 0 0 0 15 4B90E1BA 00000000 ~~
Li relay_DK1a1b
Cd relay, DK series
Sc 00000000
AR
Op 0 0 0
T0 0 3500 600 600 0 120 N V 21 N"relay_DK1a1b"
T1 0 -3500 600 600 0 120 N V 21 N"RLY***"
DS 3950 2950 3950 -2950 120 21
DS -3950 -2950 -3950 2950 120 21
DS -2900 -950 -3600 -650 120 21
DS -2900 1000 -3600 1300 120 21
DS -500 1000 -2900 1000 120 21
DS -500 1000 -500 2000 120 21
DS -3500 1100 -3500 2000 120 21
DS -3500 -2000 -3500 -1100 120 21
DS -500 -1950 -500 -950 120 21
DS -500 -950 -2900 -950 120 21
DS 3500 -300 3500 -2000 120 21
DS 3500 2000 3500 300 120 21
DS 3950 -2950 -3950 -2950 120 21
DS -3950 2950 3950 2950 120 21
DS 3050 1250 3050 1650 120 21
DS 2850 1450 3250 1450 120 21
DS 2850 -1450 3250 -1450 120 21
DS 3900 -300 3100 300 120 21
DS 3900 300 3100 300 120 21
DS 3100 300 3100 -300 120 21
DS 3100 -300 3900 -300 120 21
DS 3900 -300 3900 300 120 21
$PAD
Sh "1" C 787 787 0 0 1800
Dr 315 0 0
At STD N 0000FFFF
Ne 0 ""
Po 3500 -2000
$EndPAD
$PAD
Sh "3" C 787 787 0 0 1800
Dr 315 0 0
At STD N 0000FFFF
Ne 0 ""
Po -500 -2000
$EndPAD
$PAD
Sh "4" C 787 787 0 0 1800
Dr 315 0 0
At STD N 0000FFFF
Ne 0 ""
Po -3500 -2000
$EndPAD
$PAD
Sh "8" C 787 787 0 0 1800
Dr 315 0 0
At STD N 0000FFFF
Ne 0 ""
Po 3500 2000
$EndPAD
$PAD
Sh "6" C 787 787 0 0 1800
Dr 315 0 0
At STD N 0000FFFF
Ne 0 ""
Po -500 2000
$EndPAD
$PAD
Sh "5" C 787 787 0 0 1800
Dr 315 0 0
At STD N 0000FFFF
Ne 0 ""
Po -3500 2000
$EndPAD
$SHAPE3D
Na "walter\relay\relay_DK1a1b.wrl"
Sc 1.000000 1.000000 1.000000
Of 0.000000 0.000000 0.000000
Ro 0.000000 0.000000 0.000000
$EndSHAPE3D
$EndMODULE  relay_DK1a1b
$MODULE relay_DK1a1b-L2
Po 0 0 0 15 4B90E1C4 00000000 ~~
Li relay_DK1a1b-L2
Cd relay, DK series
Sc 00000000
AR
Op 0 0 0
T0 0 3500 600 600 0 120 N V 21 N"relay_DK1a1b-L2"
T1 0 -3500 600 600 0 120 N V 21 N"RLY***"
DS 2500 -300 2500 -950 120 21
DS 2500 -950 3500 -950 120 21
DS 2900 -300 2900 300 120 21
DS 2100 -300 2900 -300 120 21
DS 2100 300 2100 -300 120 21
DS 2900 300 2100 300 120 21
DS 2900 -300 2100 300 120 21
DS 1850 1450 2250 1450 120 21
DS 2050 1250 2050 1650 120 21
DS 2500 2000 2500 300 120 21
DS 3950 2950 3950 -2950 120 21
DS -3950 -2950 -3950 2950 120 21
DS -2900 -950 -3600 -650 120 21
DS -2900 1000 -3600 1300 120 21
DS -500 1000 -2900 1000 120 21
DS -500 1000 -500 2000 120 21
DS -3500 1100 -3500 2000 120 21
DS -3500 -2000 -3500 -1100 120 21
DS -500 -1950 -500 -950 120 21
DS -500 -950 -2900 -950 120 21
DS 3500 -300 3500 -2000 120 21
DS 3500 2000 3500 300 120 21
DS 3950 -2950 -3950 -2950 120 21
DS -3950 2950 3950 2950 120 21
DS 3050 1250 3050 1650 120 21
DS 2850 1450 3250 1450 120 21
DS 2850 -1450 3250 -1450 120 21
DS 3900 -300 3100 300 120 21
DS 3900 300 3100 300 120 21
DS 3100 300 3100 -300 120 21
DS 3100 -300 3900 -300 120 21
DS 3900 -300 3900 300 120 21
$PAD
Sh "1" C 787 787 0 0 1800
Dr 315 0 0
At STD N 0000FFFF
Ne 0 ""
Po 3500 -2000
$EndPAD
$PAD
Sh "3" C 787 787 0 0 1800
Dr 315 0 0
At STD N 0000FFFF
Ne 0 ""
Po -500 -2000
$EndPAD
$PAD
Sh "4" C 787 787 0 0 1800
Dr 315 0 0
At STD N 0000FFFF
Ne 0 ""
Po -3500 -2000
$EndPAD
$PAD
Sh "8" C 787 787 0 0 1800
Dr 315 0 0
At STD N 0000FFFF
Ne 0 ""
Po 3500 2000
$EndPAD
$PAD
Sh "6" C 787 787 0 0 1800
Dr 315 0 0
At STD N 0000FFFF
Ne 0 ""
Po -500 2000
$EndPAD
$PAD
Sh "5" C 787 787 0 0 1800
Dr 315 0 0
At STD N 0000FFFF
Ne 0 ""
Po -3500 2000
$EndPAD
$PAD
Sh "7" C 787 787 0 0 1800
Dr 315 0 0
At STD N 0000FFFF
Ne 0 ""
Po 2500 2000
$EndPAD
$SHAPE3D
Na "walter\relay\relay_DK1a1b-L2.wrl"
Sc 1.000000 1.000000 1.000000
Of 0.000000 0.000000 0.000000
Ro 0.000000 0.000000 0.000000
$EndSHAPE3D
$EndMODULE  relay_DK1a1b-L2
$MODULE relay_DK2a
Po 0 0 0 15 4B90E1CE 00000000 ~~
Li relay_DK2a
Cd relay, DK series
Sc 00000000
AR
Op 0 0 0
T0 0 3500 600 600 0 120 N V 21 N"relay_DK2a"
T1 0 -3500 600 600 0 120 N V 21 N"RLY***"
DS -2900 1000 -3600 700 120 21
DS 3950 2950 3950 -2950 120 21
DS -3950 -2950 -3950 2950 120 21
DS -2900 -950 -3600 -650 120 21
DS -500 1000 -2900 1000 120 21
DS -500 1000 -500 2000 120 21
DS -3500 1100 -3500 2000 120 21
DS -3500 -2000 -3500 -1100 120 21
DS -500 -1950 -500 -950 120 21
DS -500 -950 -2900 -950 120 21
DS 3500 -300 3500 -2000 120 21
DS 3500 2000 3500 300 120 21
DS 3950 -2950 -3950 -2950 120 21
DS -3950 2950 3950 2950 120 21
DS 3050 1250 3050 1650 120 21
DS 2850 1450 3250 1450 120 21
DS 2850 -1450 3250 -1450 120 21
DS 3900 -300 3100 300 120 21
DS 3900 300 3100 300 120 21
DS 3100 300 3100 -300 120 21
DS 3100 -300 3900 -300 120 21
DS 3900 -300 3900 300 120 21
$PAD
Sh "1" C 787 787 0 0 1800
Dr 315 0 0
At STD N 0000FFFF
Ne 0 ""
Po 3500 -2000
$EndPAD
$PAD
Sh "3" C 787 787 0 0 1800
Dr 315 0 0
At STD N 0000FFFF
Ne 0 ""
Po -500 -2000
$EndPAD
$PAD
Sh "4" C 787 787 0 0 1800
Dr 315 0 0
At STD N 0000FFFF
Ne 0 ""
Po -3500 -2000
$EndPAD
$PAD
Sh "8" C 787 787 0 0 1800
Dr 315 0 0
At STD N 0000FFFF
Ne 0 ""
Po 3500 2000
$EndPAD
$PAD
Sh "6" C 787 787 0 0 1800
Dr 315 0 0
At STD N 0000FFFF
Ne 0 ""
Po -500 2000
$EndPAD
$PAD
Sh "5" C 787 787 0 0 1800
Dr 315 0 0
At STD N 0000FFFF
Ne 0 ""
Po -3500 2000
$EndPAD
$SHAPE3D
Na "walter\relay\relay_DK1a1b.wrl"
Sc 1.000000 1.000000 1.000000
Of 0.000000 0.000000 0.000000
Ro 0.000000 0.000000 0.000000
$EndSHAPE3D
$EndMODULE  relay_DK2a
$MODULE relay_DK2a-L2
Po 0 0 0 15 4B90E1D6 00000000 ~~
Li relay_DK2a-L2
Cd relay, DK series
Sc 00000000
AR
Op 0 0 0
T0 0 3500 600 600 0 120 N V 21 N"relay_DK2a-L2"
T1 0 -3500 600 600 0 120 N V 21 N"RLY***"
DS -2900 1000 -3600 700 120 21
DS 2500 -300 2500 -950 120 21
DS 2500 -950 3500 -950 120 21
DS 2900 -300 2900 300 120 21
DS 2100 -300 2900 -300 120 21
DS 2100 300 2100 -300 120 21
DS 2900 300 2100 300 120 21
DS 2900 -300 2100 300 120 21
DS 1850 1450 2250 1450 120 21
DS 2050 1250 2050 1650 120 21
DS 2500 2000 2500 300 120 21
DS 3950 2950 3950 -2950 120 21
DS -3950 -2950 -3950 2950 120 21
DS -2900 -950 -3600 -650 120 21
DS -500 1000 -2900 1000 120 21
DS -500 1000 -500 2000 120 21
DS -3500 1100 -3500 2000 120 21
DS -3500 -2000 -3500 -1100 120 21
DS -500 -1950 -500 -950 120 21
DS -500 -950 -2900 -950 120 21
DS 3500 -300 3500 -2000 120 21
DS 3500 2000 3500 300 120 21
DS 3950 -2950 -3950 -2950 120 21
DS -3950 2950 3950 2950 120 21
DS 3050 1250 3050 1650 120 21
DS 2850 1450 3250 1450 120 21
DS 2850 -1450 3250 -1450 120 21
DS 3900 -300 3100 300 120 21
DS 3900 300 3100 300 120 21
DS 3100 300 3100 -300 120 21
DS 3100 -300 3900 -300 120 21
DS 3900 -300 3900 300 120 21
$PAD
Sh "1" C 787 787 0 0 1800
Dr 315 0 0
At STD N 0000FFFF
Ne 0 ""
Po 3500 -2000
$EndPAD
$PAD
Sh "3" C 787 787 0 0 1800
Dr 315 0 0
At STD N 0000FFFF
Ne 0 ""
Po -500 -2000
$EndPAD
$PAD
Sh "4" C 787 787 0 0 1800
Dr 315 0 0
At STD N 0000FFFF
Ne 0 ""
Po -3500 -2000
$EndPAD
$PAD
Sh "8" C 787 787 0 0 1800
Dr 315 0 0
At STD N 0000FFFF
Ne 0 ""
Po 3500 2000
$EndPAD
$PAD
Sh "6" C 787 787 0 0 1800
Dr 315 0 0
At STD N 0000FFFF
Ne 0 ""
Po -500 2000
$EndPAD
$PAD
Sh "5" C 787 787 0 0 1800
Dr 315 0 0
At STD N 0000FFFF
Ne 0 ""
Po -3500 2000
$EndPAD
$PAD
Sh "7" C 787 787 0 0 1800
Dr 315 0 0
At STD N 0000FFFF
Ne 0 ""
Po 2500 2000
$EndPAD
$SHAPE3D
Na "walter\relay\relay_DK1a1b-L2.wrl"
Sc 1.000000 1.000000 1.000000
Of 0.000000 0.000000 0.000000
Ro 0.000000 0.000000 0.000000
$EndSHAPE3D
$EndMODULE  relay_DK2a-L2
$MODULE relay_hb
Po 0 0 0 15 4B90E204 00000000 ~~
Li relay_hb
Cd relay, HB series
Sc 00000000
AR
Op 0 0 0
T0 0 4700 600 600 0 120 N V 21 N"relay_HB"
T1 0 -4600 600 600 0 120 N V 21 N"RLY***"
DS 200 -3000 900 -3300 120 21
DS -200 -3000 -900 -3300 120 21
DS 900 3500 200 3500 120 21
DS -200 3500 -900 3500 120 21
DS -900 400 900 -400 120 21
DC 200 -3000 200 -2900 120 21
DC 900 -2500 900 -2400 120 21
DC 900 -3500 800 -3500 120 21
DS 200 -3000 200 3500 120 21
DS 900 0 1500 0 120 21
DS 1500 0 1500 -900 120 21
DS -1500 -900 -1500 0 120 21
DS -1500 0 -900 0 120 21
DS -900 0 -900 -400 120 21
DS -900 -400 900 -400 120 21
DS 900 -400 900 400 120 21
DS 900 400 -900 400 120 21
DS -900 400 -900 0 120 21
DC -200 -3000 -100 -3000 120 21
DC -900 -2500 -900 -2600 120 21
DC -900 -3500 -900 -3600 120 21
DS -200 3500 -200 -3000 120 21
DS -2200 -4000 2200 -4000 120 21
DS 2200 -4000 2200 4000 120 21
DS 2200 4000 -2200 4000 120 21
DS -2200 4000 -2200 -4000 120 21
$PAD
Sh "1" C 787 787 0 0 1800
Dr 315 0 0
At STD N 0000FFFF
Ne 0 ""
Po -1500 -3500
$EndPAD
$PAD
Sh "2" C 787 787 0 0 1800
Dr 315 0 0
At STD N 0000FFFF
Ne 0 ""
Po -1500 -2500
$EndPAD
$PAD
Sh "3" C 787 787 0 0 1800
Dr 315 0 0
At STD N 0000FFFF
Ne 0 ""
Po -1500 -1500
$EndPAD
$PAD
Sh "8" C 787 787 0 0 1800
Dr 315 0 0
At STD N 0000FFFF
Ne 0 ""
Po -1500 3500
$EndPAD
$PAD
Sh "9" C 787 787 0 0 1800
Dr 315 0 0
At STD N 0000FFFF
Ne 0 ""
Po 1500 3500
$EndPAD
$PAD
Sh "14" C 787 787 0 0 1800
Dr 315 0 0
At STD N 0000FFFF
Ne 0 ""
Po 1500 -1500
$EndPAD
$PAD
Sh "15" C 787 787 0 0 1800
Dr 315 0 0
At STD N 0000FFFF
Ne 0 ""
Po 1500 -2500
$EndPAD
$PAD
Sh "16" C 787 787 0 0 1800
Dr 315 0 0
At STD N 0000FFFF
Ne 0 ""
Po 1500 -3500
$EndPAD
$SHAPE3D
Na "walter\relay\relay_HB.wrl"
Sc 1.000000 1.000000 1.000000
Of 0.000000 0.000000 0.000000
Ro 0.000000 0.000000 0.000000
$EndSHAPE3D
$EndMODULE  relay_hb
$MODULE relay_PE
Po 0 0 0 15 4B90E21C 00000000 ~~
Li relay_PE
Cd relay, PE series
Sc 00000000
AR
Op 0 0 0
T0 0 3000 600 600 0 120 N V 21 N"relay_PE"
T1 0 -3000 600 600 0 120 N V 21 N"RLY***"
DS 2350 0 3600 -800 120 21
DS 3500 -650 3500 -1500 120 21
DS 3500 1500 3500 650 120 21
DS 500 1500 500 0 120 21
DS 500 0 2350 0 120 21
DS -3500 1500 -3500 300 120 21
DS -3500 -1500 -3500 -300 120 21
DS -3900 300 -3100 -300 120 21
DS -3900 -300 -3100 -300 120 21
DS -3100 -300 -3100 300 120 21
DS -3100 300 -3900 300 120 21
DS -3900 300 -3900 -300 120 21
DS -4000 -2000 -4000 2000 120 21
DS -4000 2000 4000 2000 120 21
DS 4000 2000 4000 -2000 120 21
DS 4000 -2000 -4000 -2000 120 21
$PAD
Sh "1" C 787 787 0 0 1800
Dr 315 0 0
At STD N 0000FFFF
Ne 0 ""
Po -3500 1500
$EndPAD
$PAD
Sh "11" C 787 787 0 0 1800
Dr 315 0 0
At STD N 0000FFFF
Ne 0 ""
Po 500 1500
$EndPAD
$PAD
Sh "14" C 787 787 0 0 1800
Dr 315 0 0
At STD N 0000FFFF
Ne 0 ""
Po 3500 1500
$EndPAD
$PAD
Sh "12" C 787 787 0 0 0
Dr 197 0 0
At STD N 0000FFFF
Ne 0 ""
Po 3500 -1500
$EndPAD
$PAD
Sh "2" C 787 787 0 0 1800
Dr 315 0 0
At STD N 0000FFFF
Ne 0 ""
Po -3500 -1500
$EndPAD
$SHAPE3D
Na "walter\relay\relay_PE.wrl"
Sc 1.000000 1.000000 1.000000
Of 0.000000 0.000000 0.000000
Ro 0.000000 0.000000 0.000000
$EndSHAPE3D
$EndMODULE  relay_PE
$MODULE relay_SY
Po 0 0 0 15 4B90E22C 00000000 ~~
Li relay_SY
Cd relay, SY series
Sc 00000000
AR
Op 0 0 0
T0 0 -4250 700 450 0 113 N V 21 N"relay_SY"
T1 250 4250 700 400 0 100 N V 21 N"RLY***"
DS -125 2400 100 2400 120 21
DS 125 2325 -125 2325 120 21
DS -150 2475 -150 2225 120 21
DS -150 2225 125 2225 120 21
DS 125 2225 150 2225 120 21
DS 150 2225 150 2500 120 21
DS 0 1400 370 2080 100 21
DS 400 0 1000 0 100 21
DS 1000 0 1000 600 100 21
DS -400 -300 -400 300 100 21
DS -400 300 400 300 100 21
DS 400 300 400 -300 100 21
DS 400 -300 -400 -300 100 21
DS -1000 600 -1000 0 100 21
DS -1000 0 -400 0 100 21
DS 600 2000 300 2000 100 21
DS -600 2000 -300 2000 100 21
DS 0 -2000 0 1400 100 21
DS -600 -2000 600 -2000 100 21
DS 1500 -2500 -1500 -2500 120 21
DS -1500 -2500 -1500 2500 120 21
DS -1500 2500 1500 2500 120 21
DS 1500 2500 1500 -2500 120 21
$PAD
Sh "1" R 787 748 0 0 0
Dr 315 0 0
At STD N 00E0FFFF
Ne 0 ""
Po -1000 -2000
$EndPAD
$PAD
Sh "4" C 787 787 0 0 0
Dr 315 0 0
At STD N 00E0FFFF
Ne 0 ""
Po -1000 1000
$EndPAD
$PAD
Sh "5" C 787 787 0 0 0
Dr 315 0 0
At STD N 00E0FFFF
Ne 0 ""
Po -1000 2000
$EndPAD
$PAD
Sh "6" C 787 787 0 0 0
Dr 315 0 0
At STD N 00E0FFFF
Ne 0 ""
Po 1000 2000
$EndPAD
$PAD
Sh "7" C 787 787 0 0 0
Dr 315 0 0
At STD N 00E0FFFF
Ne 0 ""
Po 1000 1000
$EndPAD
$PAD
Sh "10" C 787 787 0 0 0
Dr 315 0 0
At STD N 00E0FFFF
Ne 0 ""
Po 1000 -2000
$EndPAD
$SHAPE3D
Na "walter\relay\relay_SY.wrl"
Sc 1.000000 1.000000 1.000000
Of 0.000000 0.000000 0.000000
Ro 0.000000 0.000000 0.000000
$EndSHAPE3D
$EndMODULE  relay_SY
$MODULE relay_V23042
Po 0 0 0 15 4B90E23C 00000000 ~~
Li relay_V23042
Cd relay, V23042 series
Sc 00000000
AR
Op 0 0 0
T0 0 3000 600 600 0 120 N V 21 N"relay_V23042"
T1 0 -3000 600 600 0 120 N V 21 N"RLY***"
DS 1500 150 1500 250 120 21
DS 1500 -150 1500 -250 120 21
DS -500 -550 1600 -1050 120 21
DS 1500 -950 1500 -1500 120 21
DS 3500 -150 1500 -150 120 21
DS 3500 -150 3500 -1500 120 21
DS -500 -550 -500 -1500 120 21
DS -500 1500 -500 550 120 21
DS -500 550 1600 1050 120 21
DS 3500 1500 3500 150 120 21
DS 3500 150 1500 150 120 21
DS 1500 1500 1500 950 120 21
DS -2900 -950 -3300 -950 120 21
DS -2900 950 -3300 950 120 21
DS -3100 750 -3100 1150 120 21
DS -3500 1500 -3500 300 120 21
DS -3500 -1500 -3500 -300 120 21
DS -3900 300 -3100 -300 120 21
DS -3900 -300 -3100 -300 120 21
DS -3100 -300 -3100 300 120 21
DS -3100 300 -3900 300 120 21
DS -3900 300 -3900 -300 120 21
DS -4000 -2000 -4000 2000 120 21
DS -4000 2000 4000 2000 120 21
DS 4000 2000 4000 -2000 120 21
DS 4000 -2000 -4000 -2000 120 21
$PAD
Sh "1" C 787 787 0 0 0
Dr 315 0 0
At STD N 00E0FFFF
Ne 0 ""
Po -3500 1500
$EndPAD
$PAD
Sh "4" C 787 787 0 0 0
Dr 315 0 0
At STD N 00E0FFFF
Ne 0 ""
Po -500 1500
$EndPAD
$PAD
Sh "6" C 787 787 0 0 0
Dr 315 0 0
At STD N 00E0FFFF
Ne 0 ""
Po 1500 1500
$EndPAD
$PAD
Sh "8" C 787 787 0 0 0
Dr 315 0 0
At STD N 00E0FFFF
Ne 0 ""
Po 3500 1500
$EndPAD
$PAD
Sh "9" C 787 787 0 0 0
Dr 315 0 0
At STD N 00E0FFFF
Ne 0 ""
Po 3500 -1500
$EndPAD
$PAD
Sh "11" C 787 787 0 0 0
Dr 315 0 0
At STD N 00E0FFFF
Ne 0 ""
Po 1500 -1500
$EndPAD
$PAD
Sh "13" C 787 787 0 0 0
Dr 315 0 0
At STD N 00E0FFFF
Ne 0 ""
Po -500 -1500
$EndPAD
$PAD
Sh "16" C 787 787 0 0 0
Dr 315 0 0
At STD N 00E0FFFF
Ne 0 ""
Po -3500 -1500
$EndPAD
$SHAPE3D
Na "walter\relay\relay_V23042.wrl"
Sc 1.000000 1.000000 1.000000
Of 0.000000 0.000000 0.000000
Ro 0.000000 0.000000 0.000000
$EndSHAPE3D
$EndMODULE  relay_V23042
$MODULE relay_V23042-B2
Po 0 0 0 15 4B90E24E 00000000 ~~
Li relay_V23042-B2
Cd relay, V23042-B2 series
Sc 00000000
AR
Op 0 0 0
T0 0 3000 600 600 0 120 N V 21 N"relay_V23042-B2"
T1 0 -3000 600 600 0 120 N V 21 N"RLY***"
DS -2900 -300 -2900 300 120 21
DS -2100 300 -2900 300 120 21
DS -2100 -300 -2100 300 120 21
DS -2900 -300 -2100 -300 120 21
DS -2900 300 -2100 -300 120 21
DS -2500 -1500 -2500 -300 120 21
DS -2500 1500 -2500 300 120 21
DS -2100 750 -2100 1150 120 21
DS -1900 950 -2300 950 120 21
DS -1900 -950 -2300 -950 120 21
DS 1500 150 1500 250 120 21
DS 1500 -150 1500 -250 120 21
DS -500 -550 1600 -1050 120 21
DS 1500 -950 1500 -1500 120 21
DS 3500 -150 1500 -150 120 21
DS 3500 -150 3500 -1500 120 21
DS -500 -550 -500 -1500 120 21
DS -500 1500 -500 550 120 21
DS -500 550 1600 1050 120 21
DS 3500 1500 3500 150 120 21
DS 3500 150 1500 150 120 21
DS 1500 1500 1500 950 120 21
DS -2900 -950 -3300 -950 120 21
DS -2900 950 -3300 950 120 21
DS -3100 750 -3100 1150 120 21
DS -3500 1500 -3500 300 120 21
DS -3500 -1500 -3500 -300 120 21
DS -3900 300 -3100 -300 120 21
DS -3900 -300 -3100 -300 120 21
DS -3100 -300 -3100 300 120 21
DS -3100 300 -3900 300 120 21
DS -3900 300 -3900 -300 120 21
DS -4000 -2000 -4000 2000 120 21
DS -4000 2000 4000 2000 120 21
DS 4000 2000 4000 -2000 120 21
DS 4000 -2000 -4000 -2000 120 21
$PAD
Sh "1" C 787 787 0 0 0
Dr 315 0 0
At STD N 00E0FFFF
Ne 0 ""
Po -3500 1500
$EndPAD
$PAD
Sh "4" C 787 787 0 0 0
Dr 315 0 0
At STD N 00E0FFFF
Ne 0 ""
Po -500 1500
$EndPAD
$PAD
Sh "6" C 787 787 0 0 0
Dr 315 0 0
At STD N 00E0FFFF
Ne 0 ""
Po 1500 1500
$EndPAD
$PAD
Sh "8" C 787 787 0 0 0
Dr 315 0 0
At STD N 00E0FFFF
Ne 0 ""
Po 3500 1500
$EndPAD
$PAD
Sh "9" C 787 787 0 0 0
Dr 315 0 0
At STD N 00E0FFFF
Ne 0 ""
Po 3500 -1500
$EndPAD
$PAD
Sh "11" C 787 787 0 0 0
Dr 315 0 0
At STD N 00E0FFFF
Ne 0 ""
Po 1500 -1500
$EndPAD
$PAD
Sh "13" C 787 787 0 0 0
Dr 315 0 0
At STD N 00E0FFFF
Ne 0 ""
Po -500 -1500
$EndPAD
$PAD
Sh "16" C 787 787 0 0 0
Dr 315 0 0
At STD N 00E0FFFF
Ne 0 ""
Po -3500 -1500
$EndPAD
$PAD
Sh "2" C 787 787 0 0 0
Dr 315 0 0
At STD N 00E0FFFF
Ne 0 ""
Po -2500 1500
$EndPAD
$PAD
Sh "15" C 787 787 0 0 0
Dr 315 0 0
At STD N 00E0FFFF
Ne 0 ""
Po -2500 -1500
$EndPAD
$SHAPE3D
Na "walter\relay\relay_V23042-B2.wrl"
Sc 1.000000 1.000000 1.000000
Of 0.000000 0.000000 0.000000
Ro 0.000000 0.000000 0.000000
$EndSHAPE3D
$EndMODULE  relay_V23042-B2
$MODULE relay_RT1
Po 0 0 0 15 4DB29CD7 00000000 ~~
Li relay_RT1
Cd relay, RT1 series
Sc 00000000
AR 
Op 0 0 0
T0 0 -3937 600 600 0 120 N V 21 N "RLY***"
T1 0 3937 600 600 0 120 N V 21 N "relay_RT1"
DS 3661 0 4409 -374 100 21
DC 3209 0 3150 20 100 21
DS 3209 0 3661 0 100 21
DC 4213 -531 4094 -472 100 21
DC 4213 531 4075 551 100 21
DC 5197 689 5138 709 100 21
DC 1220 -689 1161 -669 100 21
DS 4213 531 4213 689 100 21
DS 5197 689 4213 689 100 21
DS 1220 -689 4213 -689 100 21
DS 4213 -689 4213 -531 100 21
DS 5197 1476 5197 -1476 100 21
DS 3209 -1476 3209 1476 100 21
DS 1220 1476 1220 -1476 100 21
DS 5709 -2500 -5709 -2500 100 21
DS -5709 -2500 -5709 2500 100 21
DS -5709 2500 5709 2500 100 21
DS 5709 2500 5709 -2500 100 21
DS -4780 1500 -4780 300 120 21
DS -4779 -1500 -4779 -300 120 21
DS -5179 300 -4379 -300 120 21
DS -5180 -300 -4380 -300 120 21
DS -4380 -300 -4380 300 120 21
DS -4380 300 -5180 300 120 21
DS -5179 300 -5179 -300 120 21
$PAD
Sh "1" C 1181 1181 0 0 0
Dr 512 0 0
At STD N 00E0FFFF
Ne 0 ""
Po -4783 1476
$EndPAD
$PAD
Sh "12" C 1181 1181 0 0 0
Dr 512 0 0
At STD N 00E0FFFF
Ne 0 ""
Po 1224 1476
$EndPAD
$PAD
Sh "11" C 1181 1181 0 0 0
Dr 512 0 0
At STD N 00E0FFFF
Ne 0 ""
Po 3209 1476
$EndPAD
$PAD
Sh "14" C 1181 1181 0 0 0
Dr 512 0 0
At STD N 00E0FFFF
Ne 0 ""
Po 5193 1476
$EndPAD
$PAD
Sh "14" C 1181 1181 0 0 0
Dr 512 0 0
At STD N 00E0FFFF
Ne 0 ""
Po 5193 -1476
$EndPAD
$PAD
Sh "11" C 1181 1181 0 0 0
Dr 512 0 0
At STD N 00E0FFFF
Ne 0 ""
Po 3209 -1476
$EndPAD
$PAD
Sh "12" C 1181 1181 0 0 0
Dr 512 0 0
At STD N 00E0FFFF
Ne 0 ""
Po 1224 -1476
$EndPAD
$PAD
Sh "2" C 1181 1181 0 0 0
Dr 512 0 0
At STD N 00E0FFFF
Ne 0 ""
Po -4783 -1476
$EndPAD
$SHAPE3D
Na "walter\relay\relay_RT1.wrl"
Sc 1.000000 1.000000 1.000000
Of 0.000000 0.000000 0.000000
Ro 0.000000 0.000000 0.000000
$EndSHAPE3D
$EndMODULE  relay_RT1
$EndLIBRARY
