PCBNEW-LibModule-V1  So 8. prosinec 2012, 18:29:32 CET
# encoding utf-8
Units deci-mils
$INDEX
Disc-9x5-RM5-d0.9
$EndINDEX
$MODULE Disc-9x5-RM5-d0.9
Po 0 0 0 15 4E8D76D1 00000000 ~~
Li Disc-9x5-RM5-d0.9
Sc 0
AR Disc-9x5-RM5-d0.9
Op 0 0 0
T0 0 -2000 600 600 0 120 N V 21 N "Disc-9x5-RM5-d0.9"
T1 0 2000 600 600 0 120 N V 21 N "VAL**"
DS -1772 -984 1772 -984 79 21
DS 1772 -984 1772 984 79 21
DS 1772 984 -1772 984 79 21
DS -1772 984 -1772 -984 79 21
$PAD
Sh "1" R 748 748 0 0 0
Dr 354 0 0
At STD N 00C0FFFF
Ne 0 ""
Po -984 -492
$EndPAD
$PAD
Sh "2" C 748 748 0 0 0
Dr 354 0 0
At STD N 00C0FFFF
Ne 0 ""
Po 984 492
$EndPAD
$SHAPE3D
Na "Vlastni\\Disc9x5-rm5.wrl"
Sc 1 1 1
Of 0 0 0
Ro 180 0 0
$EndSHAPE3D
$EndMODULE Disc-9x5-RM5-d0.9
$EndLIBRARY
