PCBNEW-LibModule-V1  24.5.2012 15:58:34
# encoding utf-8
$INDEX
USB-A
USB-B
USB-B_V
$EndINDEX
$MODULE USB-A
Po 0 0 0 15 4FBD2B3C 00000000 ~~
Li USB-A
Sc 00000000
AR USB-A
Op 0 0 0
T0 4200 -3250 394 394 0 79 N V 21 N "USB A"
T1 2500 0 394 394 0 79 N I 21 N "Value"
DS -450 -2950 5100 -2950 50 21
DS 5100 -2950 5100 2950 50 21
DS 5100 2950 -450 2950 50 21
DS -450 2950 -450 -2950 50 21
DS -450 -2950 -450 2950 50 21
DS 5100 -2950 5100 2950 50 21
$PAD
Sh "4" C 591 591 0 0 0
Dr 394 0 0
At STD N 00E0FFFF
Ne 0 ""
Po 0 -1400
$EndPAD
$PAD
Sh "3" C 591 591 0 0 0
Dr 394 0 0
At STD N 00E0FFFF
Ne 0 ""
Po 0 -400
$EndPAD
$PAD
Sh "2" C 591 591 0 0 0
Dr 394 0 0
At STD N 00E0FFFF
Ne 0 ""
Po 0 400
$EndPAD
$PAD
Sh "1" C 591 591 0 0 0
Dr 394 0 0
At STD N 00E0FFFF
Ne 0 ""
Po 0 1400
$EndPAD
$PAD
Sh "5" C 1181 1181 0 0 0
Dr 906 0 0
At STD N 00E0FFFF
Ne 0 ""
Po 1050 -2600
$EndPAD
$PAD
Sh "6" C 1181 1181 0 0 0
Dr 906 0 0
At STD N 00E0FFFF
Ne 0 ""
Po 1050 2800
$EndPAD
$SHAPE3D
Na "connectors\\USB\\CONN_USB-A.wrl"
Sc 1.000000 1.000000 1.000000
Of 0.000000 0.000000 0.000000
Ro 0.000000 0.000000 0.000000
$EndSHAPE3D
$EndMODULE  USB-A
$MODULE USB-B
Po 0 0 0 15 4FBD2C27 00000000 ~~
Li USB-B
Cd Connecteur USB type B
Kw USB
Sc 00000000
AR
Op 0 0 0
.SolderPasteRatio 3.74062e+259
T0 -2300 -2100 394 394 900 79 N V 21 N "CONN_USB-B"
T1 0 0 394 394 900 79 N I 21 N "Value"
DS 1928 -3000 -1936 -2996 120 21
DS -1936 -2996 -1936 3504 120 21
DS -1904 3520 1920 3520 120 21
DS 1920 3520 1920 -3008 120 21
$PAD
Sh "5" C 1693 1693 0 0 0
Dr 906 0 0
At STD N 00E0FFFF
Ne 1 "GND"
Po 2364 1148
$EndPAD
$PAD
Sh "6" C 1693 1693 0 0 0
Dr 906 0 0
At STD N 00E0FFFF
Ne 1 "GND"
Po -2368 1148
$EndPAD
$PAD
Sh "1" R 1200 600 0 0 0
Dr 250 -250 0
At STD N 00E0FFFF
Ne 4 "N-000004"
Po -492 3000
$EndPAD
$PAD
Sh "4" R 1200 600 0 0 0
Dr 250 -250 0
At STD N 00E0FFFF
Ne 1 "GND"
Po -492 2210
$EndPAD
$PAD
Sh "3" R 1200 600 0 0 0
Dr 250 250 0
At STD N 00E0FFFF
Ne 2 "N-000002"
Po 492 2210
$EndPAD
$PAD
Sh "2" R 1200 600 0 0 0
Dr 250 250 0
At STD N 00E0FFFF
Ne 3 "N-000003"
Po 492 3000
$EndPAD
$SHAPE3D
Na "connectors\\USB\\USB_type_B.wrl"
Sc 0.400000 0.400000 0.400000
Of 0.000000 -0.110000 0.000000
Ro 0.000000 0.000000 180.000000
$EndSHAPE3D
$EndMODULE  USB-B
$MODULE USB-B_V
Po 0 0 0 15 4FBD2D1C 00000000 ~~
Li USB-B_V
Cd Connecteur USB type B
Kw USB
Sc 00000000
AR 
Op 0 0 0
.SolderPasteRatio 1.14244e+239
T0 2400 -2600 394 394 0 79 N V 21 N "CONN_USB-B_V"
T1 2450 -1500 394 394 0 79 N I 21 N "Value"
DS 4750 2700 4750 -2100 150 21
DS 4750 -2100 0 -2100 150 21
DS 0 -2100 0 2700 150 21
DS 0 2700 4700 2700 150 21
$PAD
Sh "5" C 984 984 0 0 0
Dr 591 0 0
At STD N 00E0FFFF
Ne 1 "GND"
Po 4740 0
$EndPAD
$PAD
Sh "6" C 984 984 0 0 0
Dr 591 0 0
At STD N 00E0FFFF
Ne 1 "GND"
Po 0 0
$EndPAD
$PAD
Sh "1" R 1200 600 0 0 0
Dr 250 -250 0
At STD N 00E0FFFF
Ne 4 "N-000004"
Po 1878 1065
$EndPAD
$PAD
Sh "4" R 1200 600 0 0 0
Dr 250 -250 0
At STD N 00E0FFFF
Ne 1 "GND"
Po 1878 -199
$EndPAD
$PAD
Sh "3" R 1200 600 0 0 0
Dr 250 250 0
At STD N 00E0FFFF
Ne 2 "N-000002"
Po 2862 -199
$EndPAD
$PAD
Sh "2" R 1200 600 0 0 0
Dr 250 250 0
At STD N 00E0FFFF
Ne 3 "N-000003"
Po 2862 1065
$EndPAD
$SHAPE3D
Na "connectors/Usb-B.wrl"
Sc 2.700000 2.700000 2.700000
Of 0.000000 0.000000 0.230000
Ro 0.000000 0.000000 270.000000
$EndSHAPE3D
$EndMODULE  USB-B_V
$EndLIBRARY
