PCBNEW-LibModule-V1  mer 12 ago 2009 00:26:41 CEST
$INDEX
sot23
sot323
sot23-5
sot23-6
sot323-6
sot323-5
sc70-6
sc70-5
sc70
sot223
sot89
d-pak
d2-pak
sot143B
sot143r
tsot-6
sot428
sot404
powermite3
$EndINDEX
$MODULE d2-pak
Po 0 0 0 15 488C7FFF 00000000 ~~
Li d2-pak
Cd D2-pak
Sc 00000000
AR
Op 0 0 0
T0 0 -3290 600 600 0 120 N V 21 "D2-pak"
T1 0 2360 600 600 0 120 N I 21 "Q***"
DS -1970 -2745 -1970 -3675 50 21
DS -1970 -3675 1970 -3675 50 21
DS 1970 -3675 1970 -2745 50 21
DS 1180 2760 1180 1055 50 21
DS 785 2760 1180 2760 50 21
DS 785 1055 785 2760 50 21
DS -1180 1055 -1180 2760 50 21
DS -1180 2760 -785 2760 50 21
DS -785 2760 -785 1055 50 21
DS -2105 -2745 2105 -2745 50 21
DS 2105 -2745 2105 1055 50 21
DS 2105 1055 -2105 1055 50 21
DS -2105 1055 -2105 -2745 50 21
$PAD
Sh "1" R 709 1654 0 0 0
Dr 0 0 0
At SMD N 00888000
Ne 0 ""
Po -984 1969
$EndPAD
$PAD
Sh "3" R 709 1654 0 0 0
Dr 0 0 0
At SMD N 00888000
Ne 0 ""
Po 984 1969
$EndPAD
$PAD
Sh "2" R 3937 3740 0 0 0
Dr 0 0 0
At SMD N 00888000
Ne 0 ""
Po 0 -1969
$EndPAD
$SHAPE3D
Na "walter\smd_trans\d2-pak.wrl"
Sc 1.000000 1.000000 1.000000
Of 0.000000 0.000000 0.000000
Ro 0.000000 0.000000 0.000000
$EndSHAPE3D
$EndMODULE  d2-pak
$MODULE d-pak
Po 0 0 0 15 488C6805 00000000 ~~
Li d-pak
Cd D-pak
Sc 00000000
AR
Op 0 0 0
T0 0 -3290 600 600 0 120 N V 21 "D-pak"
T1 0 2360 600 600 0 120 N I 21 "Q***"
DS -1065 -1745 -1065 -2215 50 21
DS -1065 -2215 1065 -2215 50 21
DS 1065 -2215 1065 -1740 50 21
DS 680 620 680 1765 50 21
DS 1130 1765 1130 620 50 21
DS 680 1765 1130 1765 50 21
DS -1130 1765 -680 1765 50 21
DS -680 1765 -680 620 50 21
DS -1130 620 -1130 1765 50 21
DS 1320 620 1320 -1740 50 21
DS 1320 -1740 -1320 -1740 50 21
DS -1320 -1740 -1320 620 50 21
DS 1320 620 -1320 620 50 21
$PAD
Sh "1" R 630 1260 0 0 0
Dr 0 0 0
At SMD N 00888000
Ne 0 ""
Po -906 1230
$EndPAD
$PAD
Sh "3" R 630 1260 0 0 0
Dr 0 0 0
At SMD N 00888000
Ne 0 ""
Po 906 1230
$EndPAD
$PAD
Sh "2" R 2559 2756 0 0 0
Dr 0 0 0
At SMD N 00888000
Ne 0 ""
Po 0 -1230
$EndPAD
$SHAPE3D
Na "walter\smd_trans\d-pak.wrl"
Sc 1.000000 1.000000 1.000000
Of 0.000000 0.000000 0.000000
Ro 0.000000 0.000000 0.000000
$EndSHAPE3D
$EndMODULE  d-pak
$MODULE sc70
Po 0 0 0 15 490474B5 00000000 ~~
Li sc70
Cd SC70
Sc 00000000
AR
Op 0 0 0
T0 0 -130 118 118 0 24 N V 21 "SC70"
T1 0 130 118 118 0 24 N I 21 "Q***"
DS 0 -255 0 -475 50 21
DS 255 255 255 475 50 21
DS -255 255 -255 475 50 21
DS -435 -255 435 -255 50 21
DS 435 -255 435 255 50 21
DS 435 255 -435 255 50 21
DS -435 255 -435 -255 50 21
$PAD
Sh "1" R 180 280 0 0 0
Dr 0 0 0
At SMD N 00888000
Ne 0 ""
Po -260 400
$EndPAD
$PAD
Sh "3" R 180 280 0 0 0
Dr 0 0 0
At SMD N 00888000
Ne 0 ""
Po 260 400
$EndPAD
$PAD
Sh "2" R 180 280 0 0 0
Dr 0 0 0
At SMD N 00888000
Ne 0 ""
Po 0 -400
$EndPAD
$SHAPE3D
Na "walter\smd_trans\sc70.wrl"
Sc 1.000000 1.000000 1.000000
Of 0.000000 0.000000 0.000000
Ro 0.000000 0.000000 0.000000
$EndSHAPE3D
$EndMODULE  sc70
$MODULE sc70-5
Po 0 0 0 15 490474DD 00000000 ~~
Li sc70-5
Cd SC70-5
Sc 00000000
AR
Op 0 0 0
T0 0 -120 118 118 0 24 N V 21 "SC70-5"
T1 0 140 118 118 0 24 N I 21 "Q***"
DS -175 255 -435 -5 50 21
DS -235 255 -435 60 50 21
DS 255 -255 255 -475 50 21
DS -255 -255 -255 -475 50 21
DS 0 255 0 475 50 21
DS 255 255 255 475 50 21
DS -255 255 -255 475 50 21
DS -435 -255 435 -255 50 21
DS 435 -255 435 255 50 21
DS 435 255 -435 255 50 21
DS -435 255 -435 -255 50 21
$PAD
Sh "1" R 160 260 0 0 0
Dr 0 0 0
At SMD N 00888000
Ne 0 ""
Po -260 400
$EndPAD
$PAD
Sh "3" R 160 260 0 0 0
Dr 0 0 0
At SMD N 00888000
Ne 0 ""
Po 260 400
$EndPAD
$PAD
Sh "2" R 160 260 0 0 0
Dr 0 0 0
At SMD N 00888000
Ne 0 ""
Po 0 400
$EndPAD
$PAD
Sh "4" R 160 260 0 0 0
Dr 0 0 0
At SMD N 00888000
Ne 0 ""
Po 260 -400
$EndPAD
$PAD
Sh "5" R 160 260 0 0 0
Dr 0 0 0
At SMD N 00888000
Ne 0 ""
Po -260 -400
$EndPAD
$SHAPE3D
Na "walter\smd_trans\sc70-5.wrl"
Sc 1.000000 1.000000 1.000000
Of 0.000000 0.000000 0.000000
Ro 0.000000 0.000000 0.000000
$EndSHAPE3D
$EndMODULE  sc70-5
$MODULE sc70-6
Po 0 0 0 15 490474FF 00000000 ~~
Li sc70-6
Cd SC70-6
Sc 00000000
AR
Op 0 0 0
T0 0 -110 118 118 0 24 N V 21 "SC70-6"
T1 0 140 118 118 0 24 N I 21 "Q***"
DS 0 -255 0 -475 50 21
DS -175 255 -435 -5 50 21
DS -235 255 -435 60 50 21
DS 255 -255 255 -475 50 21
DS -255 -255 -255 -475 50 21
DS 0 255 0 475 50 21
DS 255 255 255 475 50 21
DS -255 255 -255 475 50 21
DS -435 -255 435 -255 50 21
DS 435 -255 435 255 50 21
DS 435 255 -435 255 50 21
DS -435 255 -435 -255 50 21
$PAD
Sh "1" R 160 260 0 0 0
Dr 0 0 0
At SMD N 00888000
Ne 0 ""
Po -260 400
$EndPAD
$PAD
Sh "3" R 160 260 0 0 0
Dr 0 0 0
At SMD N 00888000
Ne 0 ""
Po 260 400
$EndPAD
$PAD
Sh "2" R 160 260 0 0 0
Dr 0 0 0
At SMD N 00888000
Ne 0 ""
Po 0 400
$EndPAD
$PAD
Sh "4" R 160 260 0 0 0
Dr 0 0 0
At SMD N 00888000
Ne 0 ""
Po 260 -400
$EndPAD
$PAD
Sh "6" R 160 260 0 0 0
Dr 0 0 0
At SMD N 00888000
Ne 0 ""
Po -260 -400
$EndPAD
$PAD
Sh "5" R 160 260 0 0 0
Dr 0 0 0
At SMD N 00888000
Ne 0 ""
Po 0 -400
$EndPAD
$SHAPE3D
Na "walter\smd_trans\sc70-6.wrl"
Sc 1.000000 1.000000 1.000000
Of 0.000000 0.000000 0.000000
Ro 0.000000 0.000000 0.000000
$EndSHAPE3D
$EndMODULE  sc70-6
$MODULE sot23
Po 0 0 0 15 49047588 00000000 ~~
Li sot23
Cd SOT23
Sc 00000000
AR
Op 0 0 0
T0 10 -130 197 197 0 39 N V 21 "SOT23"
T1 0 130 197 197 0 39 N I 21 "Q***"
DS 375 275 375 535 50 21
DS -375 275 -375 535 50 21
DS 0 -275 0 -535 50 21
DS -590 -275 590 -275 50 21
DS 590 -275 590 275 50 21
DS 590 275 -590 275 50 21
DS -590 275 -590 -275 50 21
$PAD
Sh "1" R 236 394 0 0 0
Dr 0 0 0
At SMD N 00888000
Ne 0 ""
Po -375 416
$EndPAD
$PAD
Sh "2" R 236 394 0 0 0
Dr 0 0 0
At SMD N 00888000
Ne 0 ""
Po 0 -416
$EndPAD
$PAD
Sh "3" R 236 394 0 0 0
Dr 0 0 0
At SMD N 00888000
Ne 0 ""
Po 375 416
$EndPAD
$SHAPE3D
Na "walter\smd_trans\sot23.wrl"
Sc 1.000000 1.000000 1.000000
Of 0.000000 0.000000 0.000000
Ro 0.000000 0.000000 0.000000
$EndSHAPE3D
$EndMODULE  sot23
$MODULE sot23-5
Po 0 0 0 15 490475A6 00000000 ~~
Li sot23-5
Cd SOT23-5
Sc 00000000
AR
Op 0 0 0
T0 0 -810 197 197 0 39 N V 21 "SOT23-5"
T1 0 0 197 197 0 39 N I 21 "Q***"
DS -335 275 -590 20 50 21
DS -395 275 -590 80 50 21
DS 375 -275 375 -535 50 21
DS -375 -275 -375 -535 50 21
DS 0 275 0 535 50 21
DS 375 275 375 535 50 21
DS -375 275 -375 535 50 21
DS -590 -275 590 -275 50 21
DS 590 -275 590 275 50 21
DS 590 275 -590 275 50 21
DS -590 275 -590 -275 50 21
$PAD
Sh "1" R 236 394 0 0 0
Dr 0 0 0
At SMD N 00888000
Ne 0 ""
Po -375 416
$EndPAD
$PAD
Sh "3" R 236 394 0 0 0
Dr 0 0 0
At SMD N 00888000
Ne 0 ""
Po 375 416
$EndPAD
$PAD
Sh "2" R 236 394 0 0 0
Dr 0 0 0
At SMD N 00888000
Ne 0 ""
Po 0 416
$EndPAD
$PAD
Sh "4" R 236 394 0 0 0
Dr 0 0 0
At SMD N 00888000
Ne 0 ""
Po 375 -416
$EndPAD
$PAD
Sh "5" R 236 394 0 0 0
Dr 0 0 0
At SMD N 00888000
Ne 0 ""
Po -375 -416
$EndPAD
$SHAPE3D
Na "walter\smd_trans\sot23-5.wrl"
Sc 1.000000 1.000000 1.000000
Of 0.000000 0.000000 0.000000
Ro 0.000000 0.000000 0.000000
$EndSHAPE3D
$EndMODULE  sot23-5
$MODULE sot23-6
Po 0 0 0 15 490475C6 00000000 ~~
Li sot23-6
Cd SOT23-6
Sc 00000000
AR
Op 0 0 0
T0 0 -780 197 197 0 39 N V 21 "SOT23-6"
T1 0 0 197 197 0 39 N I 21 "Q***"
DS -335 275 -590 20 50 21
DS -395 275 -590 80 50 21
DS 0 -275 0 -535 50 21
DS 375 -275 375 -535 50 21
DS -375 -275 -375 -535 50 21
DS 0 275 0 535 50 21
DS 375 275 375 535 50 21
DS -375 275 -375 535 50 21
DS -590 -275 590 -275 50 21
DS 590 -275 590 275 50 21
DS 590 275 -590 275 50 21
DS -590 275 -590 -275 50 21
$PAD
Sh "1" R 236 394 0 0 0
Dr 0 0 0
At SMD N 00888000
Ne 0 ""
Po -375 416
$EndPAD
$PAD
Sh "3" R 236 394 0 0 0
Dr 0 0 0
At SMD N 00888000
Ne 0 ""
Po 375 416
$EndPAD
$PAD
Sh "2" R 236 394 0 0 0
Dr 0 0 0
At SMD N 00888000
Ne 0 ""
Po 0 416
$EndPAD
$PAD
Sh "4" R 236 394 0 0 0
Dr 0 0 0
At SMD N 00888000
Ne 0 ""
Po 375 -416
$EndPAD
$PAD
Sh "6" R 236 394 0 0 0
Dr 0 0 0
At SMD N 00888000
Ne 0 ""
Po -375 -416
$EndPAD
$PAD
Sh "5" R 236 394 0 0 0
Dr 0 0 0
At SMD N 00888000
Ne 0 ""
Po 0 -416
$EndPAD
$SHAPE3D
Na "walter\smd_trans\sot23-6.wrl"
Sc 1.000000 1.000000 1.000000
Of 0.000000 0.000000 0.000000
Ro 0.000000 0.000000 0.000000
$EndSHAPE3D
$EndMODULE  sot23-6
$MODULE sot89
Po 0 0 0 15 490475FD 00000000 ~~
Li sot89
Cd SOT89
Sc 00000000
AR
Op 0 0 0
T0 10 -1830 394 394 0 79 N V 21 "SOT89"
T1 0 -1150 394 394 0 79 N I 21 "Q***"
DS 490 985 690 985 50 21
DS 690 985 690 515 50 21
DS 490 985 490 515 50 21
DS -100 985 -100 515 50 21
DS 100 985 100 515 50 21
DS -100 985 100 985 50 21
DS -690 985 -490 985 50 21
DS -490 985 -490 515 50 21
DS -690 985 -690 515 50 21
DS -355 -710 355 -710 50 21
DS 355 -710 355 -515 50 21
DS -355 -710 -355 -515 50 21
DS -905 515 -905 -515 50 21
DS -905 -515 905 -515 50 21
DS 905 -515 905 515 50 21
DS 905 515 -905 515 50 21
$PAD
Sh "1" R 276 630 0 0 0
Dr 0 0 0
At SMD N 00888000
Ne 0 ""
Po -591 748
$EndPAD
$PAD
Sh "2" R 276 827 0 0 0
Dr 0 0 0
At SMD N 00888000
Ne 0 ""
Po 0 650
$EndPAD
$PAD
Sh "3" R 276 630 0 0 0
Dr 0 0 0
At SMD N 00888000
Ne 0 ""
Po 591 748
$EndPAD
$PAD
Sh "2" R 787 1083 0 0 0
Dr 0 0 0
At SMD N 00888000
Ne 0 ""
Po 0 -295
$EndPAD
$SHAPE3D
Na "walter\smd_trans\sot89.wrl"
Sc 1.000000 1.000000 1.000000
Of 0.000000 0.000000 0.000000
Ro 0.000000 0.000000 0.000000
$EndSHAPE3D
$EndMODULE  sot89
$MODULE sot143B
Po 0 0 0 15 49047621 00000000 ~~
Li sot143B
Cd SOT143B
Sc 00000000
AR
Op 0 0 0
T0 0 -750 197 197 0 39 N V 21 "SOT143B"
T1 0 0 197 197 0 39 N I 21 "Q***"
DS -450 535 -140 535 50 21
DS -140 275 -140 535 50 21
DS -375 -275 -375 -535 50 21
DS 375 275 375 535 50 21
DS -450 275 -450 535 50 21
DS 375 -275 375 -535 50 21
DS -590 -275 590 -275 50 21
DS 590 -275 590 275 50 21
DS 590 275 -590 275 50 21
DS -590 275 -590 -275 50 21
$PAD
Sh "1" R 394 394 0 0 0
Dr 0 0 0
At SMD N 00888000
Ne 0 ""
Po -296 416
$EndPAD
$PAD
Sh "3" R 236 394 0 0 0
Dr 0 0 0
At SMD N 00888000
Ne 0 ""
Po 375 -416
$EndPAD
$PAD
Sh "2" R 236 394 0 0 0
Dr 0 0 0
At SMD N 00888000
Ne 0 ""
Po 375 416
$EndPAD
$PAD
Sh "4" R 236 394 0 0 0
Dr 0 0 0
At SMD N 00888000
Ne 0 ""
Po -375 -416
$EndPAD
$SHAPE3D
Na "walter\smd_trans\sot143b.wrl"
Sc 1.000000 1.000000 1.000000
Of 0.000000 0.000000 0.000000
Ro 0.000000 0.000000 0.000000
$EndSHAPE3D
$EndMODULE  sot143B
$MODULE sot143r
Po 0 0 0 15 4904763D 00000000 ~~
Li sot143r
Cd SOT143R
Sc 00000000
AR
Op 0 0 0
T0 0 -780 197 197 0 39 N V 21 "SOT143R"
T1 0 0 197 197 0 39 N I 21 "Q***"
DS 140 535 450 535 50 21
DS -375 275 -375 535 50 21
DS -375 -275 -375 -535 50 21
DS 450 275 450 535 50 21
DS 140 275 140 535 50 21
DS 375 -275 375 -535 50 21
DS -590 -275 590 -275 50 21
DS 590 -275 590 275 50 21
DS 590 275 -590 275 50 21
DS -590 275 -590 -275 50 21
$PAD
Sh "2" R 236 394 0 0 0
Dr 0 0 0
At SMD N 00888000
Ne 0 ""
Po -375 416
$EndPAD
$PAD
Sh "4" R 236 394 0 0 0
Dr 0 0 0
At SMD N 00888000
Ne 0 ""
Po 375 -416
$EndPAD
$PAD
Sh "1" R 394 394 0 0 0
Dr 0 0 0
At SMD N 00888000
Ne 0 ""
Po 296 416
$EndPAD
$PAD
Sh "3" R 236 394 0 0 0
Dr 0 0 0
At SMD N 00888000
Ne 0 ""
Po -375 -416
$EndPAD
$SHAPE3D
Na "walter\smd_trans\sot143r.wrl"
Sc 1.000000 1.000000 1.000000
Of 0.000000 0.000000 0.000000
Ro 0.000000 0.000000 0.000000
$EndSHAPE3D
$EndMODULE  sot143r
$MODULE sot223
Po 0 0 0 15 49047669 00000000 ~~
Li sot223
Cd SOT223
Sc 00000000
AR
Op 0 0 0
T0 20 -330 394 394 0 79 N V 21 "SOT223"
T1 0 410 394 394 0 79 N I 21 "Q***"
DS -610 -1435 610 -1435 50 21
DS 610 -1435 610 -730 50 21
DS -610 -1435 -610 -730 50 21
DS 745 1435 1065 1435 50 21
DS 1065 1435 1065 730 50 21
DS 745 1435 745 730 50 21
DS -160 1435 -160 730 50 21
DS 160 1435 160 730 50 21
DS -160 1435 160 1435 50 21
DS -1065 1435 -745 1435 50 21
DS -745 1435 -745 730 50 21
DS -1065 1435 -1065 730 50 21
DS 1320 730 -1320 730 50 21
DS -1320 730 -1320 -730 50 21
DS -1320 -730 1320 -730 50 21
DS 1320 -730 1320 730 50 21
$PAD
Sh "1" R 512 709 0 0 0
Dr 0 0 0
At SMD N 00888000
Ne 0 ""
Po -906 1181
$EndPAD
$PAD
Sh "2" R 512 709 0 0 0
Dr 0 0 0
At SMD N 00888000
Ne 0 ""
Po 0 1181
$EndPAD
$PAD
Sh "3" R 512 709 0 0 0
Dr 0 0 0
At SMD N 00888000
Ne 0 ""
Po 906 1181
$EndPAD
$PAD
Sh "4" R 1496 709 0 0 0
Dr 0 0 0
At SMD N 00888000
Ne 0 ""
Po 0 -1181
$EndPAD
$SHAPE3D
Na "walter\smd_trans\sot223.wrl"
Sc 1.000000 1.000000 1.000000
Of 0.000000 0.000000 0.000000
Ro 0.000000 0.000000 0.000000
$EndSHAPE3D
$EndMODULE  sot223
$MODULE sot323
Po 0 0 0 15 49047690 00000000 ~~
Li sot323
Cd SOT323
Sc 00000000
AR
Op 0 0 0
T0 0 -110 118 118 0 24 N V 21 "SOT323"
T1 0 130 118 118 0 24 N I 21 "Q***"
DS 255 255 255 475 50 21
DS -255 255 -255 475 50 21
DS 0 -255 0 -475 50 21
DS -435 -255 435 -255 50 21
DS 435 -255 435 255 50 21
DS 435 255 -435 255 50 21
DS -435 255 -435 -255 50 21
$PAD
Sh "1" R 236 315 0 0 0
Dr 0 0 0
At SMD N 00888000
Ne 0 ""
Po -256 394
$EndPAD
$PAD
Sh "2" R 236 315 0 0 0
Dr 0 0 0
At SMD N 00888000
Ne 0 ""
Po 0 -394
$EndPAD
$PAD
Sh "3" R 236 315 0 0 0
Dr 0 0 0
At SMD N 00888000
Ne 0 ""
Po 256 394
$EndPAD
$SHAPE3D
Na "walter\smd_trans\sot323.wrl"
Sc 1.000000 1.000000 1.000000
Of 0.000000 0.000000 0.000000
Ro 0.000000 0.000000 0.000000
$EndSHAPE3D
$EndMODULE  sot323
$MODULE sot323-5
Po 0 0 0 15 490476AD 00000000 ~~
Li sot323-5
Cd SOT323-5
Sc 00000000
AR
Op 0 0 0
T0 0 -640 118 118 0 24 N V 21 "SOT323-5"
T1 0 0 118 118 0 24 N I 21 "Q***"
DS -175 255 -435 -5 50 21
DS -235 255 -435 60 50 21
DS 255 -255 255 -475 50 21
DS -255 -255 -255 -475 50 21
DS 0 255 0 475 50 21
DS 255 255 255 475 50 21
DS -255 255 -255 475 50 21
DS -435 -255 435 -255 50 21
DS 435 -255 435 255 50 21
DS 435 255 -435 255 50 21
DS -435 255 -435 -255 50 21
$PAD
Sh "1" R 197 315 0 0 0
Dr 0 0 0
At SMD N 00888000
Ne 0 ""
Po -256 394
$EndPAD
$PAD
Sh "3" R 197 315 0 0 0
Dr 0 0 0
At SMD N 00888000
Ne 0 ""
Po 256 394
$EndPAD
$PAD
Sh "2" R 197 315 0 0 0
Dr 0 0 0
At SMD N 00888000
Ne 0 ""
Po 0 394
$EndPAD
$PAD
Sh "4" R 197 315 0 0 0
Dr 0 0 0
At SMD N 00888000
Ne 0 ""
Po 256 -394
$EndPAD
$PAD
Sh "5" R 197 315 0 0 0
Dr 0 0 0
At SMD N 00888000
Ne 0 ""
Po -256 -394
$EndPAD
$SHAPE3D
Na "walter\smd_trans\sot323-5.wrl"
Sc 1.000000 1.000000 1.000000
Of 0.000000 0.000000 0.000000
Ro 0.000000 0.000000 0.000000
$EndSHAPE3D
$EndMODULE  sot323-5
$MODULE sot323-6
Po 0 0 0 15 490476CB 00000000 ~~
Li sot323-6
Cd SOT323-6
Sc 00000000
AR
Op 0 0 0
T0 0 -650 118 118 0 24 N V 21 "SOT323-6"
T1 0 0 118 118 0 24 N I 21 "Q***"
DS -175 255 -435 -5 50 21
DS -235 255 -435 60 50 21
DS 255 -255 255 -475 50 21
DS -255 -255 -255 -475 50 21
DS 0 255 0 475 50 21
DS 255 255 255 475 50 21
DS -255 255 -255 475 50 21
DS 0 -255 0 -475 50 21
DS -435 -255 435 -255 50 21
DS 435 -255 435 255 50 21
DS 435 255 -435 255 50 21
DS -435 255 -435 -255 50 21
$PAD
Sh "1" R 197 315 0 0 0
Dr 0 0 0
At SMD N 00888000
Ne 0 ""
Po -256 394
$EndPAD
$PAD
Sh "5" R 197 315 0 0 0
Dr 0 0 0
At SMD N 00888000
Ne 0 ""
Po 0 -394
$EndPAD
$PAD
Sh "3" R 197 315 0 0 0
Dr 0 0 0
At SMD N 00888000
Ne 0 ""
Po 256 394
$EndPAD
$PAD
Sh "2" R 197 315 0 0 0
Dr 0 0 0
At SMD N 00888000
Ne 0 ""
Po 0 394
$EndPAD
$PAD
Sh "4" R 197 315 0 0 0
Dr 0 0 0
At SMD N 00888000
Ne 0 ""
Po 256 -394
$EndPAD
$PAD
Sh "6" R 197 315 0 0 0
Dr 0 0 0
At SMD N 00888000
Ne 0 ""
Po -256 -394
$EndPAD
$SHAPE3D
Na "walter\smd_trans\sot323-6.wrl"
Sc 1.000000 1.000000 1.000000
Of 0.000000 0.000000 0.000000
Ro 0.000000 0.000000 0.000000
$EndSHAPE3D
$EndMODULE  sot323-6
$MODULE tsot-6
Po 0 0 0 15 49E9E765 00000000 ~~
Li tsot-6
Cd TSOT-6
Sc 00000000
AR
Op 0 0 0
T0 0 -780 197 197 0 39 N V 21 N"TSOT-6"
T1 0 0 197 197 0 39 N I 21 N"Q***"
DS 591 335 -591 335 50 21
DS -591 335 -591 -335 50 21
DS -591 -335 591 -335 50 21
DS 591 -335 591 335 50 21
DS -335 334 -590 79 50 21
DS -395 334 -590 139 50 21
DS 0 -338 0 -598 50 21
DS 375 -338 375 -598 50 21
DS -375 -338 -375 -598 50 21
DS 0 338 0 598 50 21
DS 375 338 375 598 50 21
DS -375 338 -375 598 50 21
$PAD
Sh "1" R 272 394 0 0 0
Dr 0 0 0
At SMD N 00888000
Ne 0 ""
Po -374 512
$EndPAD
$PAD
Sh "3" R 272 394 0 0 0
Dr 0 0 0
At SMD N 00888000
Ne 0 ""
Po 374 512
$EndPAD
$PAD
Sh "2" R 272 394 0 0 0
Dr 0 0 0
At SMD N 00888000
Ne 0 ""
Po 0 512
$EndPAD
$PAD
Sh "4" R 272 394 0 0 0
Dr 0 0 0
At SMD N 00888000
Ne 0 ""
Po 374 -512
$EndPAD
$PAD
Sh "6" R 272 394 0 0 0
Dr 0 0 0
At SMD N 00888000
Ne 0 ""
Po -374 -512
$EndPAD
$PAD
Sh "5" R 272 394 0 0 0
Dr 0 0 0
At SMD N 00888000
Ne 0 ""
Po 0 -512
$EndPAD
$SHAPE3D
Na "walter\smd_trans\tsot-6.wrl"
Sc 1.000000 1.000000 1.000000
Of 0.000000 0.000000 0.000000
Ro 0.000000 0.000000 0.000000
$EndSHAPE3D
$EndMODULE  tsot-6
$MODULE sot428
Po 0 0 0 15 4A81E49E 00000000 ~~
Li sot428
Cd SOT428
Sc 00000000
AR
Op 0 0 0
T0 0 -3290 600 600 0 120 N V 21 N"SOT428"
T1 0 2360 600 600 0 120 N I 21 N"Q***"
DS -1065 -1745 -1065 -2215 50 21
DS -1065 -2215 1065 -2215 50 21
DS 1065 -2215 1065 -1740 50 21
DS 680 620 680 1765 50 21
DS 1130 1765 1130 620 50 21
DS 680 1765 1130 1765 50 21
DS -1130 1765 -680 1765 50 21
DS -680 1765 -680 620 50 21
DS -1130 620 -1130 1765 50 21
DS 1320 620 1320 -1740 50 21
DS 1320 -1740 -1320 -1740 50 21
DS -1320 -1740 -1320 620 50 21
DS 1320 620 -1320 620 50 21
$PAD
Sh "1" R 591 984 0 0 0
Dr 0 0 0
At SMD N 00888000
Ne 0 ""
Po -896 1358
$EndPAD
$PAD
Sh "3" R 591 984 0 0 0
Dr 0 0 0
At SMD N 00888000
Ne 0 ""
Po 896 1358
$EndPAD
$PAD
Sh "2" R 2756 2756 0 0 0
Dr 0 0 0
At SMD N 00888000
Ne 0 ""
Po 0 -1358
$EndPAD
$SHAPE3D
Na "walter\smd_trans\sot428.wrl"
Sc 1.000000 1.000000 1.000000
Of 0.000000 0.000000 0.000000
Ro 0.000000 0.000000 0.000000
$EndSHAPE3D
$EndMODULE  sot428
$MODULE sot404
Po 0 0 0 15 4A81E833 00000000 ~~
Li sot404
Cd SOT404
Sc 00000000
AR
Op 0 0 0
T0 0 -3290 600 600 0 120 N V 21 N"SOT404"
T1 0 2360 600 600 0 120 N I 21 N"Q***"
DS -1970 -2745 -1970 -3675 50 21
DS -1970 -3675 1970 -3675 50 21
DS 1970 -3675 1970 -2745 50 21
DS 1180 2760 1180 1055 50 21
DS 785 2760 1180 2760 50 21
DS 785 1055 785 2760 50 21
DS -1180 1055 -1180 2760 50 21
DS -1180 2760 -785 2760 50 21
DS -785 2760 -785 1055 50 21
DS -2105 -2745 2105 -2745 50 21
DS 2105 -2745 2105 1055 50 21
DS 2105 1055 -2105 1055 50 21
DS -2105 1055 -2105 -2745 50 21
$PAD
Sh "1" R 787 1496 0 0 0
Dr 0 0 0
At SMD N 00888000
Ne 0 ""
Po -984 2185
$EndPAD
$PAD
Sh "3" R 787 1496 0 0 0
Dr 0 0 0
At SMD N 00888000
Ne 0 ""
Po 984 2185
$EndPAD
$PAD
Sh "2" R 4528 3543 0 0 0
Dr 0 0 0
At SMD N 00888000
Ne 0 ""
Po 0 -2185
$EndPAD
$SHAPE3D
Na "walter\smd_trans\sot404.wrl"
Sc 1.000000 1.000000 1.000000
Of 0.000000 0.000000 0.000000
Ro 0.000000 0.000000 0.000000
$EndSHAPE3D
$EndMODULE  sot404
$MODULE powermite3
Po 0 0 0 15 4A81F00D 00000000 ~~
Li powermite3
Cd PowerMite3
Sc 00000000
AR 
Op 0 0 0
T0 20 -330 394 394 0 79 N V 21 N"PowerMite3"
T1 0 410 394 394 0 79 N I 21 N"Q***"
DS -350 -1400 -350 -1650 50 21
DS -350 -1650 350 -1650 50 21
DS 350 -1650 350 -1400 50 21
DS -800 350 800 350 50 21
DS 800 350 800 -1400 50 21
DS 800 -1400 -800 -1400 50 21
DS -800 -1400 -800 350 50 21
DS 200 900 550 900 50 21
DS 550 900 550 350 50 21
DS 200 900 200 350 50 21
DS -550 900 -550 350 50 21
DS -550 900 -200 900 50 21
DS -200 900 -200 350 50 21
$PAD
Sh "1" R 380 500 0 0 0
Dr 0 0 0
At SMD N 00888000
Ne 0 ""
Po -360 750
$EndPAD
$PAD
Sh "2" R 1900 2100 0 0 0
Dr 0 0 0
At SMD N 00888000
Ne 0 ""
Po 0 -750
$EndPAD
$PAD
Sh "3" R 380 500 0 0 0
Dr 0 0 0
At SMD N 00888000
Ne 0 ""
Po 360 750
$EndPAD
$SHAPE3D
Na "walter\smd_trans\powermite3.wrl"
Sc 1.000000 1.000000 1.000000
Of 0.000000 0.000000 0.000000
Ro 0.000000 0.000000 0.000000
$EndSHAPE3D
$EndMODULE  powermite3
$EndLIBRARY
