PCBNEW-LibModule-V1  So 15. prosinec 2012, 12:52:16 CET
# encoding utf-8
Units deci-mils
$INDEX

NXW-02
NXW-03
NXW-04
NXW-05
NXW-06
NXW-07
NXW-08
$EndINDEX
$MODULE 
Po 0 0 0 15 4F733ADA 4F734E4F ~~
Li 
Sc 4F734E4F
AR 
Op 0 0 0
T0 0 -984 394 394 0 79 N V 21 N "NXW-02"
T1 0 1575 394 394 0 79 N I 21 N "NXW-02"
DS 780 -620 1180 -620 110 26
DS 1180 -620 1180 1110 110 26
DS 1180 1110 -1190 1110 110 26
DS -1190 1110 -1190 -620 110 26
DS -1190 -620 780 -620 110 26
DS 780 -620 1180 -620 110 21
DS 1180 -620 1180 1110 110 21
DS 1180 1110 -1190 1110 110 21
DS -1190 1110 -1190 -620 110 21
DS -1190 -620 780 -620 110 21
DS 70 1110 70 950 110 21
DS 70 950 -80 950 110 21
DS -80 950 -80 1110 110 21
DS 70 1110 70 950 110 26
DS 70 950 -80 950 110 26
DS -80 950 -80 1110 110 26
$PAD
Sh "1" R 500 500 0 0 0
Dr 300 0 0
At STD N 00E0FFFF
Ne 0 ""
Po -400 0
$EndPAD
$PAD
Sh "2" C 500 500 0 0 0
Dr 300 0 0
At STD N 00E0FFFF
Ne 0 ""
Po 390 0
$EndPAD
$EndMODULE 
$MODULE NXW-02
Po 0 0 0 15 50CC5BA9 00000000 ~~
Li NXW-02
Sc 0
AR 
Op 0 0 0
T0 0 -1260 394 394 0 79 N V 21 N "NXW-02"
T1 0 1575 394 394 0 79 N I 21 N "NXW-02"
DS 1180 -748 1180 1063 110 21
DS 1180 1063 -1190 1063 110 21
DS -1190 1063 -1190 -780 110 21
DS -1190 -777 1181 -777 110 21
DS 70 1032 70 872 110 21
DS 70 872 -80 872 110 21
DS -80 872 -80 1032 110 21
$PAD
Sh "1" R 500 500 0 0 0
Dr 300 0 0
At STD N 00E0FFFF
Ne 0 ""
Po -400 0
$EndPAD
$PAD
Sh "2" C 500 500 0 0 0
Dr 300 0 0
At STD N 00E0FFFF
Ne 0 ""
Po 390 0
$EndPAD
$SHAPE3D
Na "connectors/NXW/NXW-02.wrl"
Sc 1 1 1
Of 0 0 0
Ro 0 0 0
$EndSHAPE3D
$EndMODULE NXW-02
$MODULE NXW-03
Po 0 0 0 15 50CC641D 00000000 ~~
Li NXW-03
Sc 0
AR 
Op 0 0 0
T0 0 -1063 394 394 0 79 N V 21 N "NXW-03"
T1 0 1575 394 394 0 79 N I 21 N "NXW-03"
DS -477 1032 -477 872 70 21
DS -477 872 -317 872 70 21
DS -317 872 -317 1032 70 21
DS -397 -699 -1577 -699 70 21
DS -1577 -699 -1577 1031 70 21
DS -1577 1031 1573 1031 70 21
DS 1573 1032 1573 -698 70 21
DS 1573 -698 393 -698 70 21
DS 313 1032 313 872 70 21
DS 313 872 463 872 70 21
DS 463 872 463 1032 70 21
$PAD
Sh "1" R 500 500 0 0 0
Dr 300 0 0
At STD N 00E0FFFF
Ne 0 ""
Po -787 0
$EndPAD
$PAD
Sh "2" C 500 500 0 0 0
Dr 300 0 0
At STD N 00E0FFFF
Ne 0 ""
Po -7 0
$EndPAD
$PAD
Sh "3" C 500 500 0 0 0
Dr 300 0 0
At STD N 00E0FFFF
Ne 0 ""
Po 783 0
$EndPAD
$SHAPE3D
Na "connectors/NXW/NXW-03.wrl"
Sc 1 1 1
Of 0 0 0
Ro 0 0 0
$EndSHAPE3D
$EndMODULE NXW-03
$MODULE NXW-04
Po 0 0 0 15 4F735079 00000000 ~~
Li NXW-04
Sc 0
AR 
Op 0 0 0
T0 0 -984 394 394 0 79 N V 21 N "NXW-04"
T1 0 1575 394 394 0 79 N I 21 N "NXW-04"
DS 699 1110 699 950 70 21
DS 699 950 859 950 70 21
DS 859 950 859 1110 70 21
DS -81 1110 -81 950 70 21
DS -81 950 69 950 70 21
DS 69 950 69 1110 70 21
DS -871 1110 -871 950 70 21
DS -871 950 -711 950 70 21
DS -711 950 -711 1110 70 21
DS -791 -620 -1971 -620 70 21
DS -1971 -620 -1971 1110 70 21
DS -1971 1110 1959 1110 70 21
DS 1959 1110 1959 -620 70 21
DS 1959 -620 779 -620 70 21
$PAD
Sh "1" R 500 500 0 0 0
Dr 300 0 0
At STD N 00E0FFFF
Ne 0 ""
Po -1181 0
$EndPAD
$PAD
Sh "2" C 500 500 0 0 0
Dr 300 0 0
At STD N 00E0FFFF
Ne 0 ""
Po -401 0
$EndPAD
$PAD
Sh "3" C 500 500 0 0 0
Dr 300 0 0
At STD N 00E0FFFF
Ne 0 ""
Po 389 0
$EndPAD
$PAD
Sh "4" C 500 500 0 0 0
Dr 300 0 0
At STD N 00E0FFFF
Ne 0 ""
Po 1179 0
$EndPAD
$SHAPE3D
Na "connectors/NXW/NXW-04.wrl"
Sc 1 1 1
Of 0 0 0
Ro 0 0 0
$EndSHAPE3D
$EndMODULE NXW-04
$MODULE NXW-05
Po 0 0 0 15 4F7350D8 00000000 ~~
Li NXW-05
Sc 0
AR 
Op 0 0 0
T0 0 -984 394 394 0 79 N V 21 N "NXW-05"
T1 0 1575 394 394 0 79 N I 21 N "NXW-05"
DS 1095 1110 1095 950 70 21
DS 1095 950 1255 950 70 21
DS 1255 950 1255 1110 70 21
DS 305 1110 305 950 70 21
DS 305 950 465 950 70 21
DS 465 950 465 1110 70 21
DS -475 1110 -475 950 70 21
DS -475 950 -325 950 70 21
DS -325 950 -325 1110 70 21
DS -1265 1110 -1265 950 70 21
DS -1265 950 -1105 950 70 21
DS -1105 950 -1105 1110 70 21
DS -1185 -620 -2365 -620 70 21
DS -2365 -620 -2365 1110 70 21
DS -2365 1110 2355 1110 70 21
DS 2355 1110 2355 -620 70 21
DS 2355 -620 1175 -620 70 21
$PAD
Sh "1" R 500 500 0 0 0
Dr 300 0 0
At STD N 00E0FFFF
Ne 0 ""
Po -1575 0
$EndPAD
$PAD
Sh "2" C 500 500 0 0 0
Dr 300 0 0
At STD N 00E0FFFF
Ne 0 ""
Po -795 0
$EndPAD
$PAD
Sh "3" C 500 500 0 0 0
Dr 300 0 0
At STD N 00E0FFFF
Ne 0 ""
Po -5 0
$EndPAD
$PAD
Sh "4" C 500 500 0 0 0
Dr 300 0 0
At STD N 00E0FFFF
Ne 0 ""
Po 785 0
$EndPAD
$PAD
Sh "5" C 500 500 0 0 0
Dr 300 0 0
At STD N 00E0FFFF
Ne 0 ""
Po 1565 0
$EndPAD
$EndMODULE NXW-05
$MODULE NXW-06
Po 0 0 0 15 4F73517B 00000000 ~~
Li NXW-06
Sc 0
AR 
Op 0 0 0
T0 0 -984 394 394 0 79 N V 21 N "NXW-06"
T1 0 1575 394 394 0 79 N I 21 N "NXW-06"
DS 1491 1110 1491 950 70 21
DS 1491 950 1651 950 70 21
DS 1651 950 1651 1110 70 21
DS 701 1110 701 950 70 21
DS 701 950 861 950 70 21
DS 861 950 861 1110 70 21
DS -89 1110 -89 950 70 21
DS -89 950 71 950 70 21
DS 71 950 71 1110 70 21
DS -869 1110 -869 950 70 21
DS -869 950 -719 950 70 21
DS -719 950 -719 1110 70 21
DS -1659 1110 -1659 950 70 21
DS -1659 950 -1499 950 70 21
DS -1499 950 -1499 1110 70 21
DS -1579 -620 -2759 -620 70 21
DS -2759 -620 -2759 1110 70 21
DS -2759 1110 2751 1110 70 21
DS 2751 1110 2751 -620 70 21
DS 2751 -620 1571 -620 70 21
$PAD
Sh "1" R 500 500 0 0 0
Dr 300 0 0
At STD N 00E0FFFF
Ne 0 ""
Po -1969 0
$EndPAD
$PAD
Sh "2" C 500 500 0 0 0
Dr 300 0 0
At STD N 00E0FFFF
Ne 0 ""
Po -1189 0
$EndPAD
$PAD
Sh "3" C 500 500 0 0 0
Dr 300 0 0
At STD N 00E0FFFF
Ne 0 ""
Po -399 0
$EndPAD
$PAD
Sh "4" C 500 500 0 0 0
Dr 300 0 0
At STD N 00E0FFFF
Ne 0 ""
Po 391 0
$EndPAD
$PAD
Sh "5" C 500 500 0 0 0
Dr 300 0 0
At STD N 00E0FFFF
Ne 0 ""
Po 1171 0
$EndPAD
$PAD
Sh "6" C 500 500 0 0 0
Dr 300 0 0
At STD N 00E0FFFF
Ne 0 ""
Po 1961 0
$EndPAD
$EndMODULE NXW-06
$MODULE NXW-07
Po 0 0 0 15 4F735206 00000000 ~~
Li NXW-07
Sc 0
AR 
Op 0 0 0
T0 0 -984 394 394 0 79 N V 21 N "NXW-07"
T1 0 1575 394 394 0 79 N I 21 N "NXW-07"
DS 1888 1110 1888 950 70 21
DS 1888 950 2038 950 70 21
DS 2038 950 2038 1110 70 21
DS 1098 1110 1098 950 70 21
DS 1098 950 1258 950 70 21
DS 1258 950 1258 1110 70 21
DS 308 1110 308 950 70 21
DS 308 950 468 950 70 21
DS 468 950 468 1110 70 21
DS -482 1110 -482 950 70 21
DS -482 950 -322 950 70 21
DS -322 950 -322 1110 70 21
DS -1262 1110 -1262 950 70 21
DS -1262 950 -1112 950 70 21
DS -1112 950 -1112 1110 70 21
DS -2052 1110 -2052 950 70 21
DS -2052 950 -1892 950 70 21
DS -1892 950 -1892 1110 70 21
DS -1972 -620 -3152 -620 70 21
DS -3152 -620 -3152 1110 70 21
DS -3152 1110 3148 1110 70 21
DS 3148 1110 3148 -620 70 21
DS 3148 -620 1968 -620 70 21
$PAD
Sh "1" R 500 500 0 0 0
Dr 300 0 0
At STD N 00E0FFFF
Ne 0 ""
Po -2362 0
$EndPAD
$PAD
Sh "2" C 500 500 0 0 0
Dr 300 0 0
At STD N 00E0FFFF
Ne 0 ""
Po -1582 0
$EndPAD
$PAD
Sh "3" C 500 500 0 0 0
Dr 300 0 0
At STD N 00E0FFFF
Ne 0 ""
Po -792 0
$EndPAD
$PAD
Sh "4" C 500 500 0 0 0
Dr 300 0 0
At STD N 00E0FFFF
Ne 0 ""
Po -2 0
$EndPAD
$PAD
Sh "5" C 500 500 0 0 0
Dr 300 0 0
At STD N 00E0FFFF
Ne 0 ""
Po 778 0
$EndPAD
$PAD
Sh "6" C 500 500 0 0 0
Dr 300 0 0
At STD N 00E0FFFF
Ne 0 ""
Po 1568 0
$EndPAD
$PAD
Sh "7" C 500 500 0 0 0
Dr 300 0 0
At STD N 00E0FFFF
Ne 0 ""
Po 2358 0
$EndPAD
$EndMODULE NXW-07
$MODULE NXW-08
Po 0 0 0 15 4F7352A6 00000000 ~~
Li NXW-08
Sc 0
AR 
Op 0 0 0
T0 0 -984 394 394 0 79 N V 21 N "NXW-08"
T1 0 1575 394 394 0 79 N I 21 N "NXW-08"
DS 2274 1110 2274 950 70 21
DS 2274 950 2434 950 70 21
DS 2434 950 2434 1110 70 21
DS 1494 1110 1494 950 70 21
DS 1494 950 1644 950 70 21
DS 1644 950 1644 1110 70 21
DS 704 1110 704 950 70 21
DS 704 950 864 950 70 21
DS 864 950 864 1110 70 21
DS -86 1110 -86 950 70 21
DS -86 950 74 950 70 21
DS 74 950 74 1110 70 21
DS -876 1110 -876 950 70 21
DS -876 950 -716 950 70 21
DS -716 950 -716 1110 70 21
DS -1656 1110 -1656 950 70 21
DS -1656 950 -1506 950 70 21
DS -1506 950 -1506 1110 70 21
DS -2446 1110 -2446 950 70 21
DS -2446 950 -2286 950 70 21
DS -2286 950 -2286 1110 70 21
DS -2366 -620 -3546 -620 70 21
DS -3546 -620 -3546 1110 70 21
DS -3546 1110 3534 1110 70 21
DS 3534 1110 3534 -620 70 21
DS 3534 -620 2354 -620 70 21
$PAD
Sh "1" R 500 500 0 0 0
Dr 300 0 0
At STD N 00E0FFFF
Ne 0 ""
Po -2756 0
$EndPAD
$PAD
Sh "2" C 500 500 0 0 0
Dr 300 0 0
At STD N 00E0FFFF
Ne 0 ""
Po -1976 0
$EndPAD
$PAD
Sh "3" C 500 500 0 0 0
Dr 300 0 0
At STD N 00E0FFFF
Ne 0 ""
Po -1186 0
$EndPAD
$PAD
Sh "4" C 500 500 0 0 0
Dr 300 0 0
At STD N 00E0FFFF
Ne 0 ""
Po -396 0
$EndPAD
$PAD
Sh "5" C 500 500 0 0 0
Dr 300 0 0
At STD N 00E0FFFF
Ne 0 ""
Po 384 0
$EndPAD
$PAD
Sh "6" C 500 500 0 0 0
Dr 300 0 0
At STD N 00E0FFFF
Ne 0 ""
Po 1174 0
$EndPAD
$PAD
Sh "7" C 500 500 0 0 0
Dr 300 0 0
At STD N 00E0FFFF
Ne 0 ""
Po 1964 0
$EndPAD
$PAD
Sh "8" C 500 500 0 0 0
Dr 300 0 0
At STD N 00E0FFFF
Ne 0 ""
Po 2754 0
$EndPAD
$EndMODULE NXW-08
$EndLIBRARY
