PCBNEW-LibModule-V1  gio 08 set 2011 11:06:32 CEST
# encoding utf-8
$INDEX
so-16
so-14
so-8
TSSOP-14
TSSOP-16
TSSOP-20
TSSOP-24
TSSOP-28
SSOP-16
SSOP-48
msoic-8
msoic-10
psop-8
ssop-28
psop-24
so-28
$EndINDEX
$MODULE tssop-14
Po 0 0 0 15 49E9AE23 00000000 ~~
Li tssop-14
Cd TSSOP-14
Sc 00000000
AR
Op 0 0 0
T0 0 200 197 197 0 39 N V 21 N"TSSOP-14"
T1 0 -450 197 197 0 39 N V 21 N"U***"
DC -750 600 -800 700 50 21
DS 1000 -900 -1000 -900 50 21
DS -1000 -900 -1000 900 50 21
DS -1000 900 1000 900 50 21
DS 1000 900 1000 -900 50 21
$PAD
Sh "4" R 165 579 0 0 0
Dr 0 0 0
At SMD N 00888000
Ne 0 ""
Po 0 1102
$EndPAD
$PAD
Sh "5" R 165 579 0 0 0
Dr 0 0 0
At SMD N 00888000
Ne 0 ""
Po 256 1102
$EndPAD
$PAD
Sh "6" R 165 579 0 0 0
Dr 0 0 0
At SMD N 00888000
Ne 0 ""
Po 512 1102
$EndPAD
$PAD
Sh "7" R 165 579 0 0 0
Dr 0 0 0
At SMD N 00888000
Ne 0 ""
Po 768 1102
$EndPAD
$PAD
Sh "8" R 165 579 0 0 0
Dr 0 0 0
At SMD N 00888000
Ne 0 ""
Po 768 -1102
$EndPAD
$PAD
Sh "1" R 165 579 0 0 0
Dr 0 0 0
At SMD N 00888000
Ne 0 ""
Po -768 1102
$EndPAD
$PAD
Sh "2" R 165 579 0 0 0
Dr 0 0 0
At SMD N 00888000
Ne 0 ""
Po -512 1102
$EndPAD
$PAD
Sh "3" R 165 579 0 0 0
Dr 0 0 0
At SMD N 00888000
Ne 0 ""
Po -256 1102
$EndPAD
$PAD
Sh "9" R 165 579 0 0 0
Dr 0 0 0
At SMD N 00888000
Ne 0 ""
Po 512 -1102
$EndPAD
$PAD
Sh "10" R 165 579 0 0 0
Dr 0 0 0
At SMD N 00888000
Ne 0 ""
Po 256 -1102
$EndPAD
$PAD
Sh "11" R 165 579 0 0 0
Dr 0 0 0
At SMD N 00888000
Ne 0 ""
Po 0 -1102
$EndPAD
$PAD
Sh "12" R 165 579 0 0 0
Dr 0 0 0
At SMD N 00888000
Ne 0 ""
Po -256 -1102
$EndPAD
$PAD
Sh "13" R 165 579 0 0 0
Dr 0 0 0
At SMD N 00888000
Ne 0 ""
Po -512 -1102
$EndPAD
$PAD
Sh "14" R 165 579 0 0 0
Dr 0 0 0
At SMD N 00888000
Ne 0 ""
Po -768 -1102
$EndPAD
$SHAPE3D
Na "walter\smd_dil\tssop-14.wrl"
Sc 1.000000 1.000000 1.000000
Of 0.000000 0.000000 0.000000
Ro 0.000000 0.000000 0.000000
$EndSHAPE3D
$EndMODULE  tssop-14
$MODULE tssop-16
Po 0 0 0 15 49E9AF56 00000000 ~~
Li tssop-16
Cd TSSOP-16
Sc 00000000
AR
Op 0 0 0
T0 0 200 197 197 0 39 N V 21 N"TSSOP-16"
T1 0 -450 197 197 0 39 N V 21 N"U***"
DC -750 600 -800 700 50 21
DS 1000 -900 -1000 -900 50 21
DS -1000 -900 -1000 900 50 21
DS -1000 900 1000 900 50 21
DS 1000 900 1000 -900 50 21
$PAD
Sh "4" R 165 579 0 0 0
Dr 0 0 0
At SMD N 00888000
Ne 0 ""
Po -128 1102
$EndPAD
$PAD
Sh "5" R 165 579 0 0 0
Dr 0 0 0
At SMD N 00888000
Ne 0 ""
Po 128 1102
$EndPAD
$PAD
Sh "6" R 165 579 0 0 0
Dr 0 0 0
At SMD N 00888000
Ne 0 ""
Po 384 1102
$EndPAD
$PAD
Sh "7" R 165 579 0 0 0
Dr 0 0 0
At SMD N 00888000
Ne 0 ""
Po 640 1102
$EndPAD
$PAD
Sh "16" R 165 579 0 0 0
Dr 0 0 0
At SMD N 00888000
Ne 0 ""
Po -892 -1100
$EndPAD
$PAD
Sh "1" R 165 579 0 0 0
Dr 0 0 0
At SMD N 00888000
Ne 0 ""
Po -896 1102
$EndPAD
$PAD
Sh "2" R 165 579 0 0 0
Dr 0 0 0
At SMD N 00888000
Ne 0 ""
Po -640 1102
$EndPAD
$PAD
Sh "3" R 165 579 0 0 0
Dr 0 0 0
At SMD N 00888000
Ne 0 ""
Po -384 1102
$EndPAD
$PAD
Sh "9" R 165 579 0 0 0
Dr 0 0 0
At SMD N 00888000
Ne 0 ""
Po 896 -1102
$EndPAD
$PAD
Sh "10" R 165 579 0 0 0
Dr 0 0 0
At SMD N 00888000
Ne 0 ""
Po 640 -1102
$EndPAD
$PAD
Sh "11" R 165 579 0 0 0
Dr 0 0 0
At SMD N 00888000
Ne 0 ""
Po 384 -1102
$EndPAD
$PAD
Sh "12" R 165 579 0 0 0
Dr 0 0 0
At SMD N 00888000
Ne 0 ""
Po 128 -1102
$EndPAD
$PAD
Sh "13" R 165 579 0 0 0
Dr 0 0 0
At SMD N 00888000
Ne 0 ""
Po -128 -1102
$EndPAD
$PAD
Sh "14" R 165 579 0 0 0
Dr 0 0 0
At SMD N 00888000
Ne 0 ""
Po -384 -1102
$EndPAD
$PAD
Sh "8" R 165 579 0 0 0
Dr 0 0 0
At SMD N 00888000
Ne 0 ""
Po 896 1102
$EndPAD
$PAD
Sh "15" R 165 579 0 0 0
Dr 0 0 0
At SMD N 00888000
Ne 0 ""
Po -640 -1100
$EndPAD
$SHAPE3D
Na "walter\smd_dil\tssop-16.wrl"
Sc 1.000000 1.000000 1.000000
Of 0.000000 0.000000 0.000000
Ro 0.000000 0.000000 0.000000
$EndSHAPE3D
$EndMODULE  tssop-16
$MODULE tssop-20
Po 0 0 0 15 49E9CFE4 00000000 ~~
Li tssop-20
Cd TSSOP-20
Sc 00000000
AR
Op 0 0 0
T0 0 200 197 197 0 39 N V 21 N"TSSOP-20"
T1 0 -450 197 197 0 39 N V 21 N"U***"
DS 1300 -900 -1300 -900 50 21
DS -1300 -900 -1300 900 50 21
DS -1300 900 1300 900 50 21
DS 1300 900 1300 -900 50 21
DC -950 600 -1000 700 50 21
$PAD
Sh "5" R 165 579 0 0 0
Dr 0 0 0
At SMD N 00888000
Ne 0 ""
Po -128 1102
$EndPAD
$PAD
Sh "6" R 165 579 0 0 0
Dr 0 0 0
At SMD N 00888000
Ne 0 ""
Po 128 1102
$EndPAD
$PAD
Sh "7" R 165 579 0 0 0
Dr 0 0 0
At SMD N 00888000
Ne 0 ""
Po 384 1102
$EndPAD
$PAD
Sh "8" R 165 579 0 0 0
Dr 0 0 0
At SMD N 00888000
Ne 0 ""
Po 640 1102
$EndPAD
$PAD
Sh "19" R 165 579 0 0 0
Dr 0 0 0
At SMD N 00888000
Ne 0 ""
Po -892 -1100
$EndPAD
$PAD
Sh "2" R 165 579 0 0 0
Dr 0 0 0
At SMD N 00888000
Ne 0 ""
Po -896 1102
$EndPAD
$PAD
Sh "3" R 165 579 0 0 0
Dr 0 0 0
At SMD N 00888000
Ne 0 ""
Po -640 1102
$EndPAD
$PAD
Sh "4" R 165 579 0 0 0
Dr 0 0 0
At SMD N 00888000
Ne 0 ""
Po -384 1102
$EndPAD
$PAD
Sh "12" R 165 579 0 0 0
Dr 0 0 0
At SMD N 00888000
Ne 0 ""
Po 896 -1102
$EndPAD
$PAD
Sh "13" R 165 579 0 0 0
Dr 0 0 0
At SMD N 00888000
Ne 0 ""
Po 640 -1102
$EndPAD
$PAD
Sh "14" R 165 579 0 0 0
Dr 0 0 0
At SMD N 00888000
Ne 0 ""
Po 384 -1102
$EndPAD
$PAD
Sh "15" R 165 579 0 0 0
Dr 0 0 0
At SMD N 00888000
Ne 0 ""
Po 128 -1102
$EndPAD
$PAD
Sh "16" R 165 579 0 0 0
Dr 0 0 0
At SMD N 00888000
Ne 0 ""
Po -128 -1102
$EndPAD
$PAD
Sh "17" R 165 579 0 0 0
Dr 0 0 0
At SMD N 00888000
Ne 0 ""
Po -384 -1102
$EndPAD
$PAD
Sh "9" R 165 579 0 0 0
Dr 0 0 0
At SMD N 00888000
Ne 0 ""
Po 896 1102
$EndPAD
$PAD
Sh "18" R 165 579 0 0 0
Dr 0 0 0
At SMD N 00888000
Ne 0 ""
Po -640 -1100
$EndPAD
$PAD
Sh "1" R 165 579 0 0 0
Dr 0 0 0
At SMD N 00888000
Ne 0 ""
Po -1152 1102
$EndPAD
$PAD
Sh "10" R 165 579 0 0 0
Dr 0 0 0
At SMD N 00888000
Ne 0 ""
Po 1152 1102
$EndPAD
$PAD
Sh "11" R 165 579 0 0 0
Dr 0 0 0
At SMD N 00888000
Ne 0 ""
Po 1152 -1102
$EndPAD
$PAD
Sh "20" R 165 579 0 0 0
Dr 0 0 0
At SMD N 00888000
Ne 0 ""
Po -1152 -1102
$EndPAD
$SHAPE3D
Na "walter\smd_dil\tssop-20.wrl"
Sc 1.000000 1.000000 1.000000
Of 0.000000 0.000000 0.000000
Ro 0.000000 0.000000 0.000000
$EndSHAPE3D
$EndMODULE  tssop-20
$MODULE tssop-24
Po 0 0 0 15 49E9D12D 00000000 ~~
Li tssop-24
Cd TSSOP-24
Sc 00000000
AR
Op 0 0 0
T0 0 200 197 197 0 39 N V 21 N"TSSOP-24"
T1 0 -450 197 197 0 39 N V 21 N"U***"
DS 1550 -900 -1550 -900 50 21
DS -1550 -900 -1550 900 50 21
DS -1550 900 1550 900 50 21
DS 1550 900 1550 -900 50 21
DC -1250 600 -1300 700 50 21
$PAD
Sh "6" R 165 579 0 0 0
Dr 0 0 0
At SMD N 00888000
Ne 0 ""
Po -128 1102
$EndPAD
$PAD
Sh "7" R 165 579 0 0 0
Dr 0 0 0
At SMD N 00888000
Ne 0 ""
Po 128 1102
$EndPAD
$PAD
Sh "8" R 165 579 0 0 0
Dr 0 0 0
At SMD N 00888000
Ne 0 ""
Po 384 1102
$EndPAD
$PAD
Sh "9" R 165 579 0 0 0
Dr 0 0 0
At SMD N 00888000
Ne 0 ""
Po 640 1102
$EndPAD
$PAD
Sh "22" R 165 579 0 0 0
Dr 0 0 0
At SMD N 00888000
Ne 0 ""
Po -892 -1100
$EndPAD
$PAD
Sh "3" R 165 579 0 0 0
Dr 0 0 0
At SMD N 00888000
Ne 0 ""
Po -896 1102
$EndPAD
$PAD
Sh "4" R 165 579 0 0 0
Dr 0 0 0
At SMD N 00888000
Ne 0 ""
Po -640 1102
$EndPAD
$PAD
Sh "5" R 165 579 0 0 0
Dr 0 0 0
At SMD N 00888000
Ne 0 ""
Po -384 1102
$EndPAD
$PAD
Sh "15" R 165 579 0 0 0
Dr 0 0 0
At SMD N 00888000
Ne 0 ""
Po 896 -1102
$EndPAD
$PAD
Sh "16" R 165 579 0 0 0
Dr 0 0 0
At SMD N 00888000
Ne 0 ""
Po 640 -1102
$EndPAD
$PAD
Sh "17" R 165 579 0 0 0
Dr 0 0 0
At SMD N 00888000
Ne 0 ""
Po 384 -1102
$EndPAD
$PAD
Sh "18" R 165 579 0 0 0
Dr 0 0 0
At SMD N 00888000
Ne 0 ""
Po 128 -1102
$EndPAD
$PAD
Sh "19" R 165 579 0 0 0
Dr 0 0 0
At SMD N 00888000
Ne 0 ""
Po -128 -1102
$EndPAD
$PAD
Sh "20" R 165 579 0 0 0
Dr 0 0 0
At SMD N 00888000
Ne 0 ""
Po -384 -1102
$EndPAD
$PAD
Sh "10" R 165 579 0 0 0
Dr 0 0 0
At SMD N 00888000
Ne 0 ""
Po 896 1102
$EndPAD
$PAD
Sh "21" R 165 579 0 0 0
Dr 0 0 0
At SMD N 00888000
Ne 0 ""
Po -640 -1100
$EndPAD
$PAD
Sh "2" R 165 579 0 0 0
Dr 0 0 0
At SMD N 00888000
Ne 0 ""
Po -1152 1102
$EndPAD
$PAD
Sh "11" R 165 579 0 0 0
Dr 0 0 0
At SMD N 00888000
Ne 0 ""
Po 1152 1102
$EndPAD
$PAD
Sh "14" R 165 579 0 0 0
Dr 0 0 0
At SMD N 00888000
Ne 0 ""
Po 1152 -1102
$EndPAD
$PAD
Sh "23" R 165 579 0 0 0
Dr 0 0 0
At SMD N 00888000
Ne 0 ""
Po -1152 -1102
$EndPAD
$PAD
Sh "1" R 165 579 0 0 0
Dr 0 0 0
At SMD N 00888000
Ne 0 ""
Po -1407 1102
$EndPAD
$PAD
Sh "12" R 165 579 0 0 0
Dr 0 0 0
At SMD N 00888000
Ne 0 ""
Po 1407 1102
$EndPAD
$PAD
Sh "13" R 165 579 0 0 0
Dr 0 0 0
At SMD N 00888000
Ne 0 ""
Po 1407 -1102
$EndPAD
$PAD
Sh "24" R 165 579 0 0 0
Dr 0 0 0
At SMD N 00888000
Ne 0 ""
Po -1407 -1102
$EndPAD
$SHAPE3D
Na "walter\smd_dil\tssop-24.wrl"
Sc 1.000000 1.000000 1.000000
Of 0.000000 0.000000 0.000000
Ro 0.000000 0.000000 0.000000
$EndSHAPE3D
$EndMODULE  tssop-24
$MODULE tssop-28
Po 0 0 0 15 49E9D224 00000000 ~~
Li tssop-28
Cd TSSOP-28
Sc 00000000
AR
Op 0 0 0
T0 0 200 197 197 0 39 N V 21 N"TSSOP-28"
T1 0 -450 197 197 0 39 N V 21 N"U***"
DS 1950 -900 -1950 -900 50 21
DS -1950 -900 -1950 900 50 21
DS -1950 900 1950 900 50 21
DS 1950 900 1950 -900 50 21
DC -1600 600 -1650 700 50 21
$PAD
Sh "7" R 165 579 0 0 0
Dr 0 0 0
At SMD N 00888000
Ne 0 ""
Po -128 1102
$EndPAD
$PAD
Sh "8" R 165 579 0 0 0
Dr 0 0 0
At SMD N 00888000
Ne 0 ""
Po 128 1102
$EndPAD
$PAD
Sh "9" R 165 579 0 0 0
Dr 0 0 0
At SMD N 00888000
Ne 0 ""
Po 384 1102
$EndPAD
$PAD
Sh "10" R 165 579 0 0 0
Dr 0 0 0
At SMD N 00888000
Ne 0 ""
Po 640 1102
$EndPAD
$PAD
Sh "25" R 165 579 0 0 0
Dr 0 0 0
At SMD N 00888000
Ne 0 ""
Po -892 -1100
$EndPAD
$PAD
Sh "4" R 165 579 0 0 0
Dr 0 0 0
At SMD N 00888000
Ne 0 ""
Po -896 1102
$EndPAD
$PAD
Sh "5" R 165 579 0 0 0
Dr 0 0 0
At SMD N 00888000
Ne 0 ""
Po -640 1102
$EndPAD
$PAD
Sh "6" R 165 579 0 0 0
Dr 0 0 0
At SMD N 00888000
Ne 0 ""
Po -384 1102
$EndPAD
$PAD
Sh "18" R 165 579 0 0 0
Dr 0 0 0
At SMD N 00888000
Ne 0 ""
Po 896 -1102
$EndPAD
$PAD
Sh "19" R 165 579 0 0 0
Dr 0 0 0
At SMD N 00888000
Ne 0 ""
Po 640 -1102
$EndPAD
$PAD
Sh "20" R 165 579 0 0 0
Dr 0 0 0
At SMD N 00888000
Ne 0 ""
Po 384 -1102
$EndPAD
$PAD
Sh "21" R 165 579 0 0 0
Dr 0 0 0
At SMD N 00888000
Ne 0 ""
Po 128 -1102
$EndPAD
$PAD
Sh "22" R 165 579 0 0 0
Dr 0 0 0
At SMD N 00888000
Ne 0 ""
Po -128 -1102
$EndPAD
$PAD
Sh "23" R 165 579 0 0 0
Dr 0 0 0
At SMD N 00888000
Ne 0 ""
Po -384 -1102
$EndPAD
$PAD
Sh "11" R 165 579 0 0 0
Dr 0 0 0
At SMD N 00888000
Ne 0 ""
Po 896 1102
$EndPAD
$PAD
Sh "24" R 165 579 0 0 0
Dr 0 0 0
At SMD N 00888000
Ne 0 ""
Po -640 -1100
$EndPAD
$PAD
Sh "3" R 165 579 0 0 0
Dr 0 0 0
At SMD N 00888000
Ne 0 ""
Po -1152 1102
$EndPAD
$PAD
Sh "12" R 165 579 0 0 0
Dr 0 0 0
At SMD N 00888000
Ne 0 ""
Po 1152 1102
$EndPAD
$PAD
Sh "17" R 165 579 0 0 0
Dr 0 0 0
At SMD N 00888000
Ne 0 ""
Po 1152 -1102
$EndPAD
$PAD
Sh "26" R 165 579 0 0 0
Dr 0 0 0
At SMD N 00888000
Ne 0 ""
Po -1152 -1102
$EndPAD
$PAD
Sh "2" R 165 579 0 0 0
Dr 0 0 0
At SMD N 00888000
Ne 0 ""
Po -1407 1102
$EndPAD
$PAD
Sh "13" R 165 579 0 0 0
Dr 0 0 0
At SMD N 00888000
Ne 0 ""
Po 1407 1102
$EndPAD
$PAD
Sh "16" R 165 579 0 0 0
Dr 0 0 0
At SMD N 00888000
Ne 0 ""
Po 1407 -1102
$EndPAD
$PAD
Sh "27" R 165 579 0 0 0
Dr 0 0 0
At SMD N 00888000
Ne 0 ""
Po -1407 -1102
$EndPAD
$PAD
Sh "1" R 165 579 0 0 0
Dr 0 0 0
At SMD N 00888000
Ne 0 ""
Po -1663 1102
$EndPAD
$PAD
Sh "14" R 165 579 0 0 0
Dr 0 0 0
At SMD N 00888000
Ne 0 ""
Po 1663 1102
$EndPAD
$PAD
Sh "15" R 165 579 0 0 0
Dr 0 0 0
At SMD N 00888000
Ne 0 ""
Po 1663 -1102
$EndPAD
$PAD
Sh "28" R 165 579 0 0 0
Dr 0 0 0
At SMD N 00888000
Ne 0 ""
Po -1663 -1102
$EndPAD
$SHAPE3D
Na "walter\smd_dil\tssop-28.wrl"
Sc 1.000000 1.000000 1.000000
Of 0.000000 0.000000 0.000000
Ro 0.000000 0.000000 0.000000
$EndSHAPE3D
$EndMODULE  tssop-28
$MODULE ssop-16
Po 0 0 0 15 49E9DD72 00000000 ~~
Li ssop-16
Cd SSOP-16
Sc 00000000
AR
Op 0 0 0
T0 0 200 197 197 0 39 N V 21 N"SSOP-16"
T1 0 -450 197 197 0 39 N V 21 N"U***"
DS -975 775 975 775 50 21
DS 975 775 975 -775 50 21
DS 975 -775 -975 -775 50 21
DS -975 -775 -975 775 50 21
DC -725 525 -775 625 50 21
$PAD
Sh "4" R 160 650 0 0 0
Dr 0 0 0
At SMD N 00888000
Ne 0 ""
Po -125 1050
$EndPAD
$PAD
Sh "5" R 160 650 0 0 0
Dr 0 0 0
At SMD N 00888000
Ne 0 ""
Po 125 1050
$EndPAD
$PAD
Sh "6" R 160 650 0 0 0
Dr 0 0 0
At SMD N 00888000
Ne 0 ""
Po 375 1050
$EndPAD
$PAD
Sh "7" R 160 650 0 0 0
Dr 0 0 0
At SMD N 00888000
Ne 0 ""
Po 625 1050
$EndPAD
$PAD
Sh "16" R 160 650 0 0 0
Dr 0 0 0
At SMD N 00888000
Ne 0 ""
Po -875 -1050
$EndPAD
$PAD
Sh "1" R 160 650 0 0 0
Dr 0 0 0
At SMD N 00888000
Ne 0 ""
Po -875 1050
$EndPAD
$PAD
Sh "2" R 160 650 0 0 0
Dr 0 0 0
At SMD N 00888000
Ne 0 ""
Po -625 1050
$EndPAD
$PAD
Sh "3" R 160 650 0 0 0
Dr 0 0 0
At SMD N 00888000
Ne 0 ""
Po -375 1050
$EndPAD
$PAD
Sh "9" R 160 650 0 0 0
Dr 0 0 0
At SMD N 00888000
Ne 0 ""
Po 875 -1050
$EndPAD
$PAD
Sh "10" R 160 650 0 0 0
Dr 0 0 0
At SMD N 00888000
Ne 0 ""
Po 625 -1050
$EndPAD
$PAD
Sh "11" R 160 650 0 0 0
Dr 0 0 0
At SMD N 00888000
Ne 0 ""
Po 375 -1050
$EndPAD
$PAD
Sh "12" R 160 650 0 0 0
Dr 0 0 0
At SMD N 00888000
Ne 0 ""
Po 125 -1050
$EndPAD
$PAD
Sh "13" R 160 650 0 0 0
Dr 0 0 0
At SMD N 00888000
Ne 0 ""
Po -125 -1050
$EndPAD
$PAD
Sh "14" R 160 650 0 0 0
Dr 0 0 0
At SMD N 00888000
Ne 0 ""
Po -375 -1050
$EndPAD
$PAD
Sh "8" R 160 650 0 0 0
Dr 0 0 0
At SMD N 00888000
Ne 0 ""
Po 875 1050
$EndPAD
$PAD
Sh "15" R 160 650 0 0 0
Dr 0 0 0
At SMD N 00888000
Ne 0 ""
Po -625 -1050
$EndPAD
$SHAPE3D
Na "walter\smd_dil\ssop-16.wrl"
Sc 1.000000 1.000000 1.000000
Of 0.000000 0.000000 0.000000
Ro 0.000000 0.000000 0.000000
$EndSHAPE3D
$EndMODULE  ssop-16
$MODULE ssop-48
Po 0 0 0 15 49E9E556 00000000 ~~
Li ssop-48
Cd SSOP-48
Sc 00000000
AR
Op 0 0 0
T0 0 500 295 295 0 59 N V 21 N"SSOP-48"
T1 0 -475 295 295 0 59 N V 21 N"U***"
DC -2750 1125 -2850 1250 50 21
DS 3150 -1480 -3150 -1480 50 21
DS -3150 -1480 -3150 1480 50 21
DS -3150 1480 3150 1480 50 21
DS 3150 1480 3150 -1480 50 21
$PAD
Sh "38" R 140 740 0 0 0
Dr 0 0 0
At SMD N 00888000
Ne 0 ""
Po -375 -1900
$EndPAD
$PAD
Sh "39" R 140 740 0 0 0
Dr 0 0 0
At SMD N 00888000
Ne 0 ""
Po -625 -1900
$EndPAD
$PAD
Sh "40" R 140 740 0 0 0
Dr 0 0 0
At SMD N 00888000
Ne 0 ""
Po -875 -1900
$EndPAD
$PAD
Sh "41" R 140 740 0 0 0
Dr 0 0 0
At SMD N 00888000
Ne 0 ""
Po -1125 -1900
$EndPAD
$PAD
Sh "42" R 140 740 0 0 0
Dr 0 0 0
At SMD N 00888000
Ne 0 ""
Po -1375 -1900
$EndPAD
$PAD
Sh "43" R 140 740 0 0 0
Dr 0 0 0
At SMD N 00888000
Ne 0 ""
Po -1625 -1900
$EndPAD
$PAD
Sh "44" R 140 740 0 0 0
Dr 0 0 0
At SMD N 00888000
Ne 0 ""
Po -1875 -1900
$EndPAD
$PAD
Sh "45" R 140 740 0 0 0
Dr 0 0 0
At SMD N 00888000
Ne 0 ""
Po -2125 -1900
$EndPAD
$PAD
Sh "46" R 140 740 0 0 0
Dr 0 0 0
At SMD N 00888000
Ne 0 ""
Po -2375 -1900
$EndPAD
$PAD
Sh "47" R 140 740 0 0 0
Dr 0 0 0
At SMD N 00888000
Ne 0 ""
Po -2625 -1900
$EndPAD
$PAD
Sh "48" R 140 740 0 0 0
Dr 0 0 0
At SMD N 00888000
Ne 0 ""
Po -2875 -1900
$EndPAD
$PAD
Sh "25" R 140 740 0 0 0
Dr 0 0 0
At SMD N 00888000
Ne 0 ""
Po 2875 -1900
$EndPAD
$PAD
Sh "26" R 140 740 0 0 0
Dr 0 0 0
At SMD N 00888000
Ne 0 ""
Po 2625 -1900
$EndPAD
$PAD
Sh "27" R 140 740 0 0 0
Dr 0 0 0
At SMD N 00888000
Ne 0 ""
Po 2375 -1900
$EndPAD
$PAD
Sh "28" R 140 740 0 0 0
Dr 0 0 0
At SMD N 00888000
Ne 0 ""
Po 2125 -1900
$EndPAD
$PAD
Sh "29" R 140 740 0 0 0
Dr 0 0 0
At SMD N 00888000
Ne 0 ""
Po 1875 -1900
$EndPAD
$PAD
Sh "30" R 140 740 0 0 0
Dr 0 0 0
At SMD N 00888000
Ne 0 ""
Po 1625 -1900
$EndPAD
$PAD
Sh "31" R 140 740 0 0 0
Dr 0 0 0
At SMD N 00888000
Ne 0 ""
Po 1375 -1900
$EndPAD
$PAD
Sh "17" R 140 740 0 0 0
Dr 0 0 0
At SMD N 00888000
Ne 0 ""
Po 1125 1900
$EndPAD
$PAD
Sh "33" R 140 740 0 0 0
Dr 0 0 0
At SMD N 00888000
Ne 0 ""
Po 875 -1900
$EndPAD
$PAD
Sh "34" R 140 740 0 0 0
Dr 0 0 0
At SMD N 00888000
Ne 0 ""
Po 625 -1900
$EndPAD
$PAD
Sh "35" R 140 740 0 0 0
Dr 0 0 0
At SMD N 00888000
Ne 0 ""
Po 375 -1900
$EndPAD
$PAD
Sh "36" R 140 740 0 0 0
Dr 0 0 0
At SMD N 00888000
Ne 0 ""
Po 125 -1900
$EndPAD
$PAD
Sh "37" R 140 740 0 0 0
Dr 0 0 0
At SMD N 00888000
Ne 0 ""
Po -125 -1900
$EndPAD
$PAD
Sh "12" R 140 740 0 0 0
Dr 0 0 0
At SMD N 00888000
Ne 0 ""
Po -125 1900
$EndPAD
$PAD
Sh "13" R 140 740 0 0 0
Dr 0 0 0
At SMD N 00888000
Ne 0 ""
Po 125 1900
$EndPAD
$PAD
Sh "14" R 140 740 0 0 0
Dr 0 0 0
At SMD N 00888000
Ne 0 ""
Po 375 1900
$EndPAD
$PAD
Sh "15" R 140 740 0 0 0
Dr 0 0 0
At SMD N 00888000
Ne 0 ""
Po 625 1900
$EndPAD
$PAD
Sh "16" R 140 740 0 0 0
Dr 0 0 0
At SMD N 00888000
Ne 0 ""
Po 875 1900
$EndPAD
$PAD
Sh "32" R 140 740 0 0 0
Dr 0 0 0
At SMD N 00888000
Ne 0 ""
Po 1125 -1900
$EndPAD
$PAD
Sh "18" R 140 740 0 0 0
Dr 0 0 0
At SMD N 00888000
Ne 0 ""
Po 1375 1900
$EndPAD
$PAD
Sh "19" R 140 740 0 0 0
Dr 0 0 0
At SMD N 00888000
Ne 0 ""
Po 1625 1900
$EndPAD
$PAD
Sh "20" R 140 740 0 0 0
Dr 0 0 0
At SMD N 00888000
Ne 0 ""
Po 1875 1900
$EndPAD
$PAD
Sh "21" R 140 740 0 0 0
Dr 0 0 0
At SMD N 00888000
Ne 0 ""
Po 2125 1900
$EndPAD
$PAD
Sh "22" R 140 740 0 0 0
Dr 0 0 0
At SMD N 00888000
Ne 0 ""
Po 2375 1900
$EndPAD
$PAD
Sh "23" R 140 740 0 0 0
Dr 0 0 0
At SMD N 00888000
Ne 0 ""
Po 2625 1900
$EndPAD
$PAD
Sh "24" R 140 740 0 0 0
Dr 0 0 0
At SMD N 00888000
Ne 0 ""
Po 2875 1900
$EndPAD
$PAD
Sh "1" R 140 740 0 0 0
Dr 0 0 0
At SMD N 00888000
Ne 0 ""
Po -2875 1900
$EndPAD
$PAD
Sh "2" R 140 740 0 0 0
Dr 0 0 0
At SMD N 00888000
Ne 0 ""
Po -2625 1900
$EndPAD
$PAD
Sh "3" R 140 740 0 0 0
Dr 0 0 0
At SMD N 00888000
Ne 0 ""
Po -2375 1900
$EndPAD
$PAD
Sh "4" R 140 740 0 0 0
Dr 0 0 0
At SMD N 00888000
Ne 0 ""
Po -2125 1900
$EndPAD
$PAD
Sh "5" R 140 740 0 0 0
Dr 0 0 0
At SMD N 00888000
Ne 0 ""
Po -1875 1900
$EndPAD
$PAD
Sh "6" R 140 740 0 0 0
Dr 0 0 0
At SMD N 00888000
Ne 0 ""
Po -1625 1900
$EndPAD
$PAD
Sh "7" R 140 740 0 0 0
Dr 0 0 0
At SMD N 00888000
Ne 0 ""
Po -1375 1900
$EndPAD
$PAD
Sh "8" R 140 740 0 0 0
Dr 0 0 0
At SMD N 00888000
Ne 0 ""
Po -1125 1900
$EndPAD
$PAD
Sh "9" R 140 740 0 0 0
Dr 0 0 0
At SMD N 00888000
Ne 0 ""
Po -875 1900
$EndPAD
$PAD
Sh "10" R 140 740 0 0 0
Dr 0 0 0
At SMD N 00888000
Ne 0 ""
Po -625 1900
$EndPAD
$PAD
Sh "11" R 140 740 0 0 0
Dr 0 0 0
At SMD N 00888000
Ne 0 ""
Po -375 1900
$EndPAD
$SHAPE3D
Na "walter\smd_dil\ssop-48.wrl"
Sc 1.000000 1.000000 1.000000
Of 0.000000 0.000000 0.000000
Ro 0.000000 0.000000 0.000000
$EndSHAPE3D
$EndMODULE  ssop-48
$MODULE msoic-8
Po 0 0 0 15 49EA0BE9 00000000 ~~
Li msoic-8
Cd MSOIC-8
Sc 00000000
AR
Op 0 0 0
T0 0 -118 98 98 0 24 N V 21 N"MSOIC-8"
T1 0 118 98 98 0 20 N V 21 N"U***"
DS 130 -590 130 -950 50 21
DS -130 -590 -130 -950 50 21
DS -380 -590 -380 -950 50 21
DS 380 -590 380 -950 50 21
DS 380 590 380 950 50 21
DS 130 590 130 950 50 21
DS -380 590 -380 950 50 21
DS -130 590 -130 950 50 21
DC -354 355 -433 433 50 21
DS 591 -591 -591 -591 50 21
DS -591 -591 -591 591 50 21
DS -591 591 591 591 50 21
DS 591 591 591 -591 50 21
$PAD
Sh "1" R 161 402 0 0 0
Dr 0 0 0
At SMD N 00888000
Ne 0 ""
Po -384 906
$EndPAD
$PAD
Sh "2" R 161 402 0 0 0
Dr 0 0 0
At SMD N 00888000
Ne 0 ""
Po -128 906
$EndPAD
$PAD
Sh "3" R 161 402 0 0 0
Dr 0 0 0
At SMD N 00888000
Ne 0 ""
Po 128 906
$EndPAD
$PAD
Sh "4" R 161 402 0 0 0
Dr 0 0 0
At SMD N 00888000
Ne 0 ""
Po 384 906
$EndPAD
$PAD
Sh "5" R 161 402 0 0 0
Dr 0 0 0
At SMD N 00888000
Ne 0 ""
Po 384 -906
$EndPAD
$PAD
Sh "6" R 161 402 0 0 0
Dr 0 0 0
At SMD N 00888000
Ne 0 ""
Po 128 -906
$EndPAD
$PAD
Sh "7" R 161 402 0 0 0
Dr 0 0 0
At SMD N 00888000
Ne 0 ""
Po -128 -906
$EndPAD
$PAD
Sh "8" R 161 402 0 0 0
Dr 0 0 0
At SMD N 00888000
Ne 0 ""
Po -384 -906
$EndPAD
$SHAPE3D
Na "walter\smd_dil\msoic-8.wrl"
Sc 1.000000 1.000000 1.000000
Of 0.000000 0.000000 0.000000
Ro 0.000000 0.000000 0.000000
$EndSHAPE3D
$EndMODULE  msoic-8
$MODULE msoic-10
Po 0 0 0 15 49EA0D66 00000000 ~~
Li msoic-10
Cd MSOIC-10
Sc 00000000
AR
Op 0 0 0
T0 0 -118 98 98 0 24 N V 21 N"MSOIC-10"
T1 0 118 98 98 0 20 N V 21 N"U***"
DS -400 -950 -400 -600 50 21
DS -200 -950 -200 -600 50 21
DS 0 -950 0 -600 50 21
DS 190 -950 190 -600 50 21
DS 400 -950 400 -600 50 21
DS 400 950 400 600 50 21
DS 200 950 200 600 50 21
DS 0 950 0 600 50 21
DS -200 950 -200 600 50 21
DS -390 950 -390 600 50 21
DC -354 355 -433 433 50 21
DS 591 -591 -591 -591 50 21
DS -591 -591 -591 591 50 21
DS -591 591 591 591 50 21
DS 591 591 591 -591 50 21
$PAD
Sh "1" R 118 402 0 0 0
Dr 0 0 0
At SMD N 00888000
Ne 0 ""
Po -394 906
$EndPAD
$PAD
Sh "2" R 118 402 0 0 0
Dr 0 0 0
At SMD N 00888000
Ne 0 ""
Po -197 906
$EndPAD
$PAD
Sh "3" R 118 402 0 0 0
Dr 0 0 0
At SMD N 00888000
Ne 0 ""
Po 0 906
$EndPAD
$PAD
Sh "4" R 118 402 0 0 0
Dr 0 0 0
At SMD N 00888000
Ne 0 ""
Po 197 906
$EndPAD
$PAD
Sh "5" R 118 402 0 0 0
Dr 0 0 0
At SMD N 00888000
Ne 0 ""
Po 394 906
$EndPAD
$PAD
Sh "6" R 118 402 0 0 0
Dr 0 0 0
At SMD N 00888000
Ne 0 ""
Po 394 -906
$EndPAD
$PAD
Sh "7" R 118 402 0 0 0
Dr 0 0 0
At SMD N 00888000
Ne 0 ""
Po 197 -906
$EndPAD
$PAD
Sh "8" R 118 402 0 0 0
Dr 0 0 0
At SMD N 00888000
Ne 0 ""
Po 0 -906
$EndPAD
$PAD
Sh "9" R 118 402 0 0 0
Dr 0 0 0
At SMD N 00888000
Ne 0 ""
Po -197 -906
$EndPAD
$PAD
Sh "10" R 118 402 0 0 0
Dr 0 0 0
At SMD N 00888000
Ne 0 ""
Po -394 -906
$EndPAD
$SHAPE3D
Na "walter\smd_dil\msoic-10.wrl"
Sc 1.000000 1.000000 1.000000
Of 0.000000 0.000000 0.000000
Ro 0.000000 0.000000 0.000000
$EndSHAPE3D
$EndMODULE  msoic-10
$MODULE ssop-28
Po 0 0 0 15 4D455CB3 00000000 ~~
Li ssop-28
Cd SSOP-16
Sc 00000000
AR
Op 0 0 0
T0 0 200 197 197 0 39 N V 21 N"SSOP-28"
T1 0 -450 197 197 0 39 N V 21 N"U***"
DS 2047 -906 2047 906 59 21
DS -2047 906 -2047 -906 59 21
DS -2047 -906 2047 -906 59 21
DS 2047 906 -2047 906 59 21
DC -1748 604 -1798 704 59 21
$PAD
Sh "7" R 160 650 0 0 0
Dr 0 0 0
At SMD N 00888000
Ne 0 ""
Po -128 1417
$EndPAD
$PAD
Sh "8" R 160 650 0 0 0
Dr 0 0 0
At SMD N 00888000
Ne 0 ""
Po 128 1417
$EndPAD
$PAD
Sh "9" R 160 650 0 0 0
Dr 0 0 0
At SMD N 00888000
Ne 0 ""
Po 384 1417
$EndPAD
$PAD
Sh "10" R 160 650 0 0 0
Dr 0 0 0
At SMD N 00888000
Ne 0 ""
Po 640 1417
$EndPAD
$PAD
Sh "25" R 160 650 0 0 0
Dr 0 0 0
At SMD N 00888000
Ne 0 ""
Po -896 -1417
$EndPAD
$PAD
Sh "4" R 160 650 0 0 0
Dr 0 0 0
At SMD N 00888000
Ne 0 ""
Po -896 1417
$EndPAD
$PAD
Sh "5" R 160 650 0 0 0
Dr 0 0 0
At SMD N 00888000
Ne 0 ""
Po -640 1417
$EndPAD
$PAD
Sh "6" R 160 650 0 0 0
Dr 0 0 0
At SMD N 00888000
Ne 0 ""
Po -384 1417
$EndPAD
$PAD
Sh "18" R 160 650 0 0 0
Dr 0 0 0
At SMD N 00888000
Ne 0 ""
Po 896 -1417
$EndPAD
$PAD
Sh "19" R 160 650 0 0 0
Dr 0 0 0
At SMD N 00888000
Ne 0 ""
Po 640 -1417
$EndPAD
$PAD
Sh "20" R 160 650 0 0 0
Dr 0 0 0
At SMD N 00888000
Ne 0 ""
Po 384 -1417
$EndPAD
$PAD
Sh "21" R 160 650 0 0 0
Dr 0 0 0
At SMD N 00888000
Ne 0 ""
Po 128 -1417
$EndPAD
$PAD
Sh "22" R 160 650 0 0 0
Dr 0 0 0
At SMD N 00888000
Ne 0 ""
Po -128 -1417
$EndPAD
$PAD
Sh "23" R 160 650 0 0 0
Dr 0 0 0
At SMD N 00888000
Ne 0 ""
Po -384 -1417
$EndPAD
$PAD
Sh "11" R 160 650 0 0 0
Dr 0 0 0
At SMD N 00888000
Ne 0 ""
Po 896 1417
$EndPAD
$PAD
Sh "24" R 160 650 0 0 0
Dr 0 0 0
At SMD N 00888000
Ne 0 ""
Po -640 -1417
$EndPAD
$PAD
Sh "26" R 160 650 0 0 0
Dr 0 0 0
At SMD N 00888000
Ne 0 ""
Po -1152 -1417
$EndPAD
$PAD
Sh "27" R 160 650 0 0 0
Dr 0 0 0
At SMD N 00888000
Ne 0 ""
Po -1407 -1417
$EndPAD
$PAD
Sh "28" R 160 650 0 0 0
Dr 0 0 0
At SMD N 00888000
Ne 0 ""
Po -1663 -1417
$EndPAD
$PAD
Sh "1" R 160 650 0 0 0
Dr 0 0 0
At SMD N 00888000
Ne 0 ""
Po -1663 1417
$EndPAD
$PAD
Sh "2" R 160 650 0 0 0
Dr 0 0 0
At SMD N 00888000
Ne 0 ""
Po -1407 1417
$EndPAD
$PAD
Sh "3" R 160 650 0 0 0
Dr 0 0 0
At SMD N 00888000
Ne 0 ""
Po -1152 1417
$EndPAD
$PAD
Sh "12" R 160 650 0 0 0
Dr 0 0 0
At SMD N 00888000
Ne 0 ""
Po 1152 1417
$EndPAD
$PAD
Sh "13" R 160 650 0 0 0
Dr 0 0 0
At SMD N 00888000
Ne 0 ""
Po 1407 1417
$EndPAD
$PAD
Sh "14" R 160 650 0 0 0
Dr 0 0 0
At SMD N 00888000
Ne 0 ""
Po 1663 1417
$EndPAD
$PAD
Sh "15" R 160 650 0 0 0
Dr 0 0 0
At SMD N 00888000
Ne 0 ""
Po 1663 -1417
$EndPAD
$PAD
Sh "16" R 160 650 0 0 0
Dr 0 0 0
At SMD N 00888000
Ne 0 ""
Po 1407 -1417
$EndPAD
$PAD
Sh "17" R 160 650 0 0 0
Dr 0 0 0
At SMD N 00888000
Ne 0 ""
Po 1152 -1417
$EndPAD
$SHAPE3D
Na "walter\smd_dil\ssop-28.wrl"
Sc 1.000000 1.000000 1.000000
Of 0.000000 0.000000 0.000000
Ro 0.000000 0.000000 0.000000
$EndSHAPE3D
$EndMODULE  ssop-28
$MODULE psop-24
Po 0 0 0 15 4DEB8A8C 00000000 ~~
Li psop-24
Cd PSOP-24 - PowerPad Small-Outline
Sc 00000000
AR
Op 0 0 0
T0 0 200 197 197 0 39 N V 21 N "PSOP-24"
T1 0 -450 197 197 0 39 N V 21 N "U***"
DS -1555 886 1555 886 50 21
DS 1555 886 1555 -886 50 21
DS 1555 -886 -1555 -886 50 21
DS -1555 -886 -1555 886 50 21
DC -1206 600 -1256 700 50 21
$PAD
Sh "6" R 118 630 0 0 0
Dr 0 0 0
At SMD N 00888000
Ne 0 ""
Po -128 1102
$EndPAD
$PAD
Sh "7" R 118 630 0 0 0
Dr 0 0 0
At SMD N 00888000
Ne 0 ""
Po 128 1102
$EndPAD
$PAD
Sh "8" R 118 630 0 0 0
Dr 0 0 0
At SMD N 00888000
Ne 0 ""
Po 384 1102
$EndPAD
$PAD
Sh "9" R 118 630 0 0 0
Dr 0 0 0
At SMD N 00888000
Ne 0 ""
Po 640 1102
$EndPAD
$PAD
Sh "22" R 118 630 0 0 0
Dr 0 0 0
At SMD N 00888000
Ne 0 ""
Po -892 -1100
$EndPAD
$PAD
Sh "3" R 118 630 0 0 0
Dr 0 0 0
At SMD N 00888000
Ne 0 ""
Po -896 1102
$EndPAD
$PAD
Sh "4" R 118 630 0 0 0
Dr 0 0 0
At SMD N 00888000
Ne 0 ""
Po -640 1102
$EndPAD
$PAD
Sh "5" R 118 630 0 0 0
Dr 0 0 0
At SMD N 00888000
Ne 0 ""
Po -384 1102
$EndPAD
$PAD
Sh "15" R 118 630 0 0 0
Dr 0 0 0
At SMD N 00888000
Ne 0 ""
Po 896 -1102
$EndPAD
$PAD
Sh "16" R 118 630 0 0 0
Dr 0 0 0
At SMD N 00888000
Ne 0 ""
Po 640 -1102
$EndPAD
$PAD
Sh "17" R 118 630 0 0 0
Dr 0 0 0
At SMD N 00888000
Ne 0 ""
Po 384 -1102
$EndPAD
$PAD
Sh "18" R 118 630 0 0 0
Dr 0 0 0
At SMD N 00888000
Ne 0 ""
Po 128 -1102
$EndPAD
$PAD
Sh "19" R 118 630 0 0 0
Dr 0 0 0
At SMD N 00888000
Ne 0 ""
Po -128 -1102
$EndPAD
$PAD
Sh "20" R 118 630 0 0 0
Dr 0 0 0
At SMD N 00888000
Ne 0 ""
Po -384 -1102
$EndPAD
$PAD
Sh "10" R 118 630 0 0 0
Dr 0 0 0
At SMD N 00888000
Ne 0 ""
Po 896 1102
$EndPAD
$PAD
Sh "21" R 118 630 0 0 0
Dr 0 0 0
At SMD N 00888000
Ne 0 ""
Po -640 -1100
$EndPAD
$PAD
Sh "2" R 118 630 0 0 0
Dr 0 0 0
At SMD N 00888000
Ne 0 ""
Po -1152 1102
$EndPAD
$PAD
Sh "11" R 118 630 0 0 0
Dr 0 0 0
At SMD N 00888000
Ne 0 ""
Po 1152 1102
$EndPAD
$PAD
Sh "14" R 118 630 0 0 0
Dr 0 0 0
At SMD N 00888000
Ne 0 ""
Po 1152 -1102
$EndPAD
$PAD
Sh "23" R 118 630 0 0 0
Dr 0 0 0
At SMD N 00888000
Ne 0 ""
Po -1152 -1102
$EndPAD
$PAD
Sh "25" R 2031 945 0 0 0
Dr 0 0 0
At SMD N 00888000
Ne 0 ""
Po 0 0
$EndPAD
$PAD
Sh "1" R 118 630 0 0 0
Dr 0 0 0
At SMD N 00888000
Ne 0 ""
Po -1407 1102
$EndPAD
$PAD
Sh "12" R 118 630 0 0 0
Dr 0 0 0
At SMD N 00888000
Ne 0 ""
Po 1407 1102
.SolderMask 28
$EndPAD
$PAD
Sh "13" R 118 630 0 0 0
Dr 0 0 0
At SMD N 00888000
Ne 0 ""
Po 1407 -1102
$EndPAD
$PAD
Sh "24" R 118 630 0 0 0
Dr 0 0 0
At SMD N 00888000
Ne 0 ""
Po -1407 -1102
$EndPAD
$SHAPE3D
Na "walter\smd_dil\psop-24.wrl"
Sc 1.000000 1.000000 1.000000
Of 0.000000 0.000000 0.000000
Ro 0.000000 0.000000 0.000000
$EndSHAPE3D
$EndMODULE  psop-24
$MODULE so-28
Po 0 0 0 15 4E688468 00000000 ~~
Li so-28
Cd SO-28
Sc 00000000
AR
Op 0 0 0
T0 0 -400 295 295 0 59 N V 21 N "U***"
T1 0 400 295 295 0 59 N V 21 N "SO-28"
DS 3250 -1910 3250 -1480 50 21
DS 2750 -1910 2750 -1480 50 21
DS 2250 -1910 2250 -1480 50 21
DS 1750 -1480 1750 -1910 50 21
DS 1250 -1480 1250 -1910 50 21
DS 750 -1480 750 -1910 50 21
DS -2250 1910 -2250 1480 50 21
DS -2750 1910 -2750 1480 50 21
DS -3250 1480 -3250 1910 50 21
DS 2250 1480 2250 1910 50 21
DS 2750 1480 2750 1910 50 21
DS 3250 1480 3250 1910 50 21
DS -3524 1476 3524 1476 100 21
DS 3524 1476 3524 -1476 100 21
DS 3524 -1476 -3524 -1476 100 21
DS -3524 -1476 -3524 1476 100 21
DS -2250 -1480 -2250 -1910 50 21
DS -1750 -1480 -1750 -1910 50 21
DS -1250 -1480 -1250 -1910 50 21
DS -2750 -1480 -2750 -1910 50 21
DS -3250 -1910 -3250 -1480 50 21
DS -750 -1910 -750 -1480 50 21
DS -250 -1910 -250 -1480 50 21
DS 250 -1910 250 -1480 50 21
DS 1750 1480 1750 1910 50 21
DS 1250 1480 1250 1910 50 21
DS 750 1480 750 1910 50 21
DS -1750 1480 -1750 1910 50 21
DS -1250 1910 -1250 1480 50 21
DS 250 1910 250 1480 50 21
DS -250 1910 -250 1480 50 21
DS -750 1910 -750 1480 50 21
DC -3077 1042 -3187 1192 100 21
$PAD
Sh "1" R 236 787 0 0 0
Dr 0 0 0
At SMD N 00888000
Ne 0 ""
Po -3250 1850
$EndPAD
$PAD
Sh "2" R 236 787 0 0 0
Dr 0 0 0
At SMD N 00888000
Ne 0 ""
Po -2750 1850
$EndPAD
$PAD
Sh "3" R 236 787 0 0 0
Dr 0 0 0
At SMD N 00888000
Ne 0 ""
Po -2250 1850
$EndPAD
$PAD
Sh "4" R 236 787 0 0 0
Dr 0 0 0
At SMD N 00888000
Ne 0 ""
Po -1750 1850
$EndPAD
$PAD
Sh "5" R 236 787 0 0 0
Dr 0 0 0
At SMD N 00888000
Ne 0 ""
Po -1250 1850
$EndPAD
$PAD
Sh "6" R 236 787 0 0 0
Dr 0 0 0
At SMD N 00888000
Ne 0 ""
Po -750 1850
$EndPAD
$PAD
Sh "7" R 236 787 0 0 0
Dr 0 0 0
At SMD N 00888000
Ne 0 ""
Po -250 1850
$EndPAD
$PAD
Sh "8" R 236 787 0 0 0
Dr 0 0 0
At SMD N 00888000
Ne 0 ""
Po 250 1850
$EndPAD
$PAD
Sh "9" R 236 787 0 0 0
Dr 0 0 0
At SMD N 00888000
Ne 0 ""
Po 750 1850
$EndPAD
$PAD
Sh "10" R 236 787 0 0 0
Dr 0 0 0
At SMD N 00888000
Ne 0 ""
Po 1250 1850
$EndPAD
$PAD
Sh "11" R 236 787 0 0 0
Dr 0 0 0
At SMD N 00888000
Ne 0 ""
Po 1750 1850
$EndPAD
$PAD
Sh "12" R 236 787 0 0 0
Dr 0 0 0
At SMD N 00888000
Ne 0 ""
Po 2250 1850
$EndPAD
$PAD
Sh "13" R 236 787 0 0 0
Dr 0 0 0
At SMD N 00888000
Ne 0 ""
Po 2750 1850
$EndPAD
$PAD
Sh "14" R 236 787 0 0 0
Dr 0 0 0
At SMD N 00888000
Ne 0 ""
Po 3250 1850
$EndPAD
$PAD
Sh "15" R 236 787 0 0 0
Dr 0 0 0
At SMD N 00888000
Ne 0 ""
Po 3250 -1850
$EndPAD
$PAD
Sh "16" R 236 787 0 0 0
Dr 0 0 0
At SMD N 00888000
Ne 0 ""
Po 2750 -1850
$EndPAD
$PAD
Sh "17" R 236 787 0 0 0
Dr 0 0 0
At SMD N 00888000
Ne 0 ""
Po 2250 -1850
$EndPAD
$PAD
Sh "18" R 236 787 0 0 0
Dr 0 0 0
At SMD N 00888000
Ne 0 ""
Po 1750 -1850
$EndPAD
$PAD
Sh "19" R 236 787 0 0 0
Dr 0 0 0
At SMD N 00888000
Ne 0 ""
Po 1250 -1850
$EndPAD
$PAD
Sh "20" R 236 787 0 0 0
Dr 0 0 0
At SMD N 00888000
Ne 0 ""
Po 750 -1850
$EndPAD
$PAD
Sh "21" R 236 787 0 0 0
Dr 0 0 0
At SMD N 00888000
Ne 0 ""
Po 250 -1850
$EndPAD
$PAD
Sh "22" R 236 787 0 0 0
Dr 0 0 0
At SMD N 00888000
Ne 0 ""
Po -250 -1850
$EndPAD
$PAD
Sh "23" R 236 787 0 0 0
Dr 0 0 0
At SMD N 00888000
Ne 0 ""
Po -750 -1850
$EndPAD
$PAD
Sh "24" R 236 787 0 0 0
Dr 0 0 0
At SMD N 00888000
Ne 0 ""
Po -1250 -1850
$EndPAD
$PAD
Sh "25" R 236 787 0 0 0
Dr 0 0 0
At SMD N 00888000
Ne 0 ""
Po -1750 -1850
$EndPAD
$PAD
Sh "26" R 236 787 0 0 0
Dr 0 0 0
At SMD N 00888000
Ne 0 ""
Po -2250 -1850
$EndPAD
$PAD
Sh "27" R 236 787 0 0 0
Dr 0 0 0
At SMD N 00888000
Ne 0 ""
Po -2750 -1850
$EndPAD
$PAD
Sh "28" R 236 787 0 0 0
Dr 0 0 0
At SMD N 00888000
Ne 0 ""
Po -3250 -1850
$EndPAD
$SHAPE3D
Na "walter\smd_dil\so-28.wrl"
Sc 1.000000 1.000000 1.000000
Of 0.000000 0.000000 0.000000
Ro 0.000000 0.000000 0.000000
$EndSHAPE3D
$EndMODULE  so-28
$MODULE so-8
Po 0 0 0 15 4E68852E 00000000 ~~
Li so-8
Cd SO-8
Sc 00000000
AR
Op 0 0 0
T0 0 -400 295 295 0 59 N V 21 N "SO-8"
T1 0 400 295 295 0 59 N V 21 N "U***"
DS -950 -780 -950 780 50 21
DS -950 780 950 780 50 21
DS 950 780 950 -780 50 21
DS 950 -780 -950 -780 50 21
DS -750 -780 -750 -1210 50 21
DS -250 -780 -250 -1210 50 21
DS 250 -780 250 -1210 50 21
DS 750 -1210 750 -780 50 21
DS 750 780 750 1210 50 21
DS 250 1210 250 780 50 21
DS -250 1210 -250 780 50 21
DS -750 1210 -750 780 50 21
DC -660 490 -770 640 50 21
$PAD
Sh "1" R 236 787 0 0 0
Dr 0 0 0
At SMD N 00888000
Ne 0 ""
Po -750 1100
$EndPAD
$PAD
Sh "2" R 236 787 0 0 0
Dr 0 0 0
At SMD N 00888000
Ne 0 ""
Po -250 1100
$EndPAD
$PAD
Sh "3" R 236 787 0 0 0
Dr 0 0 0
At SMD N 00888000
Ne 0 ""
Po 250 1100
$EndPAD
$PAD
Sh "4" R 236 787 0 0 0
Dr 0 0 0
At SMD N 00888000
Ne 0 ""
Po 750 1100
$EndPAD
$PAD
Sh "5" R 236 787 0 0 0
Dr 0 0 0
At SMD N 00888000
Ne 0 ""
Po 750 -1100
$EndPAD
$PAD
Sh "6" R 236 787 0 0 0
Dr 0 0 0
At SMD N 00888000
Ne 0 ""
Po 250 -1100
$EndPAD
$PAD
Sh "7" R 236 787 0 0 0
Dr 0 0 0
At SMD N 00888000
Ne 0 ""
Po -250 -1100
$EndPAD
$PAD
Sh "8" R 236 787 0 0 0
Dr 0 0 0
At SMD N 00888000
Ne 0 ""
Po -750 -1100
$EndPAD
$SHAPE3D
Na "walter\smd_dil\so-8.wrl"
Sc 1.000000 1.000000 1.000000
Of 0.000000 0.000000 0.000000
Ro 0.000000 0.000000 0.000000
$EndSHAPE3D
$EndMODULE  so-8
$MODULE so-14
Po 0 0 0 15 4E688543 00000000 ~~
Li so-14
Cd SO-14
Sc 00000000
AR
Op 0 0 0
T0 0 -400 295 295 0 59 N V 21 N "SO-14"
T1 0 400 295 295 0 59 N V 21 N "U***"
DS -1700 -780 -1700 780 50 21
DS -1700 780 1700 780 50 21
DS 1700 780 1700 -780 50 21
DS 1700 -780 -1700 -780 50 21
DS -1000 -780 -1000 -1210 50 21
DS -500 -780 -500 -1210 50 21
DS 0 -780 0 -1210 50 21
DS -1500 -780 -1500 -1210 50 21
DS 500 -1210 500 -780 50 21
DS 1000 -1210 1000 -780 50 21
DS 1500 -1210 1500 -780 50 21
DS 1500 780 1500 1210 50 21
DS 1000 780 1000 1210 50 21
DS -1500 780 -1500 1210 50 21
DS -1000 1210 -1000 780 50 21
DS 500 1210 500 780 50 21
DS 0 1210 0 780 50 21
DS -500 1210 -500 780 50 21
DC -1410 490 -1520 640 50 21
$PAD
Sh "1" R 236 787 0 0 0
Dr 0 0 0
At SMD N 00888000
Ne 0 ""
Po -1500 1100
$EndPAD
$PAD
Sh "2" R 236 787 0 0 0
Dr 0 0 0
At SMD N 00888000
Ne 0 ""
Po -1000 1100
$EndPAD
$PAD
Sh "3" R 236 787 0 0 0
Dr 0 0 0
At SMD N 00888000
Ne 0 ""
Po -500 1100
$EndPAD
$PAD
Sh "4" R 236 787 0 0 0
Dr 0 0 0
At SMD N 00888000
Ne 0 ""
Po 0 1100
$EndPAD
$PAD
Sh "5" R 236 787 0 0 0
Dr 0 0 0
At SMD N 00888000
Ne 0 ""
Po 500 1100
$EndPAD
$PAD
Sh "6" R 236 787 0 0 0
Dr 0 0 0
At SMD N 00888000
Ne 0 ""
Po 1000 1100
$EndPAD
$PAD
Sh "7" R 236 787 0 0 0
Dr 0 0 0
At SMD N 00888000
Ne 0 ""
Po 1500 1100
$EndPAD
$PAD
Sh "8" R 236 787 0 0 0
Dr 0 0 0
At SMD N 00888000
Ne 0 ""
Po 1500 -1100
$EndPAD
$PAD
Sh "9" R 236 787 0 0 0
Dr 0 0 0
At SMD N 00888000
Ne 0 ""
Po 1000 -1100
$EndPAD
$PAD
Sh "10" R 236 787 0 0 0
Dr 0 0 0
At SMD N 00888000
Ne 0 ""
Po 500 -1100
$EndPAD
$PAD
Sh "11" R 236 787 0 0 0
Dr 0 0 0
At SMD N 00888000
Ne 0 ""
Po 0 -1100
$EndPAD
$PAD
Sh "12" R 236 787 0 0 0
Dr 0 0 0
At SMD N 00888000
Ne 0 ""
Po -500 -1100
$EndPAD
$PAD
Sh "13" R 236 787 0 0 0
Dr 0 0 0
At SMD N 00888000
Ne 0 ""
Po -1000 -1100
$EndPAD
$PAD
Sh "14" R 236 787 0 0 0
Dr 0 0 0
At SMD N 00888000
Ne 0 ""
Po -1500 -1100
$EndPAD
$SHAPE3D
Na "walter\smd_dil\so-14.wrl"
Sc 1.000000 1.000000 1.000000
Of 0.000000 0.000000 0.000000
Ro 0.000000 0.000000 0.000000
$EndSHAPE3D
$EndMODULE  so-14
$MODULE so-16
Po 0 0 0 15 4E68854F 00000000 ~~
Li so-16
Cd SO-16
Sc 00000000
AR
Op 0 0 0
T0 0 -400 295 295 0 59 N V 21 N "SO-16"
T1 0 400 295 295 0 59 N V 21 N "U***"
DS -750 -780 -750 -1210 50 21
DS -250 -780 -250 -1210 50 21
DS 250 -780 250 -1210 50 21
DS -1250 -780 -1250 -1210 50 21
DS -1750 -1210 -1750 -780 50 21
DS 750 -1210 750 -780 50 21
DS 1250 -1210 1250 -780 50 21
DS 1750 -1210 1750 -780 50 21
DS 1750 780 1750 1210 50 21
DS 1250 780 1250 1210 50 21
DS 750 780 750 1210 50 21
DS -1750 780 -1750 1210 50 21
DS -1250 1210 -1250 780 50 21
DS 250 1210 250 780 50 21
DS -250 1210 -250 780 50 21
DS -750 1210 -750 780 50 21
DC -1600 490 -1710 640 50 21
DS -1900 -780 -1900 780 50 21
DS -1900 780 1900 780 50 21
DS 1900 780 1900 -780 50 21
DS 1900 -780 -1900 -780 50 21
$PAD
Sh "1" R 236 787 0 0 0
Dr 0 0 0
At SMD N 00888000
Ne 0 ""
Po -1750 1100
$EndPAD
$PAD
Sh "2" R 236 787 0 0 0
Dr 0 0 0
At SMD N 00888000
Ne 0 ""
Po -1250 1100
$EndPAD
$PAD
Sh "3" R 236 787 0 0 0
Dr 0 0 0
At SMD N 00888000
Ne 0 ""
Po -750 1100
$EndPAD
$PAD
Sh "4" R 236 787 0 0 0
Dr 0 0 0
At SMD N 00888000
Ne 0 ""
Po -250 1100
$EndPAD
$PAD
Sh "5" R 236 787 0 0 0
Dr 0 0 0
At SMD N 00888000
Ne 0 ""
Po 250 1100
$EndPAD
$PAD
Sh "6" R 236 787 0 0 0
Dr 0 0 0
At SMD N 00888000
Ne 0 ""
Po 750 1100
$EndPAD
$PAD
Sh "7" R 236 787 0 0 0
Dr 0 0 0
At SMD N 00888000
Ne 0 ""
Po 1250 1100
$EndPAD
$PAD
Sh "8" R 236 787 0 0 0
Dr 0 0 0
At SMD N 00888000
Ne 0 ""
Po 1750 1100
$EndPAD
$PAD
Sh "9" R 236 787 0 0 0
Dr 0 0 0
At SMD N 00888000
Ne 0 ""
Po 1750 -1100
$EndPAD
$PAD
Sh "10" R 236 787 0 0 0
Dr 0 0 0
At SMD N 00888000
Ne 0 ""
Po 1250 -1100
$EndPAD
$PAD
Sh "11" R 236 787 0 0 0
Dr 0 0 0
At SMD N 00888000
Ne 0 ""
Po 750 -1100
$EndPAD
$PAD
Sh "12" R 236 787 0 0 0
Dr 0 0 0
At SMD N 00888000
Ne 0 ""
Po 250 -1100
$EndPAD
$PAD
Sh "13" R 236 787 0 0 0
Dr 0 0 0
At SMD N 00888000
Ne 0 ""
Po -250 -1100
$EndPAD
$PAD
Sh "14" R 236 787 0 0 0
Dr 0 0 0
At SMD N 00888000
Ne 0 ""
Po -750 -1100
$EndPAD
$PAD
Sh "15" R 236 787 0 0 0
Dr 0 0 0
At SMD N 00888000
Ne 0 ""
Po -1250 -1100
$EndPAD
$PAD
Sh "16" R 236 787 0 0 0
Dr 0 0 0
At SMD N 00888000
Ne 0 ""
Po -1750 -1100
$EndPAD
$SHAPE3D
Na "walter\smd_dil\so-16.wrl"
Sc 1.000000 1.000000 1.000000
Of 0.000000 0.000000 0.000000
Ro 0.000000 0.000000 0.000000
$EndSHAPE3D
$EndMODULE  so-16
$MODULE psop-8
Po 0 0 0 15 4E68858A 00000000 ~~
Li psop-8
Cd PSOP-8
Sc 00000000
AR 
Op 0 0 0
T0 0 -400 295 295 0 59 N V 21 N "psop-8"
T1 0 400 295 295 0 59 N V 21 N "U***"
DS -950 -780 -950 780 50 21
DS -950 780 950 780 50 21
DS 950 780 950 -780 50 21
DS 950 -780 -950 -780 50 21
DS -750 -780 -750 -1210 50 21
DS -250 -780 -250 -1210 50 21
DS 250 -780 250 -1210 50 21
DS 750 -1210 750 -780 50 21
DS 750 780 750 1210 50 21
DS 250 1210 250 780 50 21
DS -250 1210 -250 780 50 21
DS -750 1210 -750 780 50 21
DC -660 490 -770 640 50 21
$PAD
Sh "1" R 236 787 0 0 0
Dr 0 0 0
At SMD N 00888000
Ne 0 ""
Po -750 1100
$EndPAD
$PAD
Sh "2" R 236 787 0 0 0
Dr 0 0 0
At SMD N 00888000
Ne 0 ""
Po -250 1100
$EndPAD
$PAD
Sh "3" R 236 787 0 0 0
Dr 0 0 0
At SMD N 00888000
Ne 0 ""
Po 250 1100
$EndPAD
$PAD
Sh "4" R 236 787 0 0 0
Dr 0 0 0
At SMD N 00888000
Ne 0 ""
Po 750 1100
$EndPAD
$PAD
Sh "5" R 236 787 0 0 0
Dr 0 0 0
At SMD N 00888000
Ne 0 ""
Po 750 -1100
$EndPAD
$PAD
Sh "6" R 236 787 0 0 0
Dr 0 0 0
At SMD N 00888000
Ne 0 ""
Po 250 -1100
$EndPAD
$PAD
Sh "7" R 236 787 0 0 0
Dr 0 0 0
At SMD N 00888000
Ne 0 ""
Po -250 -1100
$EndPAD
$PAD
Sh "8" R 236 787 0 0 0
Dr 0 0 0
At SMD N 00888000
Ne 0 ""
Po -750 -1100
$EndPAD
$PAD
Sh "9" R 1260 984 0 0 0
Dr 0 0 0
At SMD N 00888000
Ne 0 ""
Po 0 0
$EndPAD
$SHAPE3D
Na "walter\smd_dil\psop-8.wrl"
Sc 1.000000 1.000000 1.000000
Of 0.000000 0.000000 0.000000
Ro 0.000000 0.000000 0.000000
$EndSHAPE3D
$EndMODULE  psop-8
$EndLIBRARY
