PCBNEW-LibModule-V1  St 27. březen 2013, 12:56:46 CET
# encoding utf-8
Units mm
$INDEX
FINDER4061
H100
H200
H800
M15E
RELSIA
RR1A
RR1U
RR2A
$EndINDEX
$MODULE FINDER4061
Po 0 0 0 15 4E8C664A 00000000 ~~
Li FINDER4061
Sc 0
AR FINDER4061
Op 0 0 0
T0 0 -16.51 1.19888 1.19888 0 0.20066 N V 21 N "Re*"
T1 0 16.51 1.19888 1.19888 0 0.20066 N I 21 N "FINDER 4061"
DS -0.8128 -7.0612 0.6858 -7.0612 0.2794 21
DS -0.8128 -7.0612 0.6858 -7.0612 0.2794 26
DS 2.1844 -13.5636 1.1684 -13.5636 0.2794 21
DS 1.1684 -13.5636 1.1684 -10.5664 0.2794 21
DS 1.1684 -10.5664 0.6858 -10.5664 0.2794 21
DS 2.1844 -3.556 1.1684 -3.556 0.2794 21
DS 1.1684 -3.556 1.1684 -6.5532 0.2794 21
DS 1.1684 -6.5532 0.6858 -6.5532 0.2794 21
DS 0.6858 -7.0612 0.6858 -7.5438 0.2794 21
DS 0.6858 -7.0612 1.1684 -7.0612 0.2794 21
DS 2.1844 -8.5598 0.6858 -7.0612 0.2794 21
DS 0.6858 -10.5664 -1.3208 -10.5664 0.2794 21
DS -1.3208 -10.5664 -1.3208 -13.5636 0.2794 21
DS -1.3208 -13.5636 -2.3114 -13.5636 0.2794 21
DS 0.6858 -6.5532 -1.3208 -6.5532 0.2794 21
DS -1.3208 -6.5532 -1.3208 -3.556 0.2794 21
DS -1.3208 -3.556 -2.3114 -3.556 0.2794 21
DS -0.8128 -7.0612 -0.8128 -7.5438 0.2794 21
DS -0.8128 -7.0612 -1.3208 -7.0612 0.2794 21
DS -2.3114 -8.5598 -0.8128 -7.0612 0.2794 21
DS 3.683 6.4516 3.683 9.9314 0.2794 21
DS -3.81 6.4516 -3.81 9.9314 0.2794 21
DA -3.0734 6.7056 -3.81 6.4516 1425 0.2794 21
DA 2.921 6.7056 2.1844 6.4516 1425 0.2794 21
DA 1.4224 6.7056 0.6858 6.4516 1425 0.2794 21
DA -0.0762 6.7056 -0.8128 6.4516 1425 0.2794 21
DA -1.5748 6.7056 -2.3114 6.4516 1425 0.2794 21
DS 2.1844 -13.5636 1.1684 -13.5636 0.2794 26
DS 1.1684 -13.5636 1.1684 -10.5664 0.2794 26
DS 1.1684 -10.5664 0.6858 -10.5664 0.2794 26
DS 2.1844 -3.556 1.1684 -3.556 0.2794 26
DS 1.1684 -3.556 1.1684 -6.5532 0.2794 26
DS 1.1684 -6.5532 0.6858 -6.5532 0.2794 26
DS 0.6858 -7.0612 0.6858 -7.5438 0.2794 26
DS 0.6858 -7.0612 1.1684 -7.0612 0.2794 26
DS 2.1844 -8.5598 0.6858 -7.0612 0.2794 26
DS 0.6858 -10.5664 -1.3208 -10.5664 0.2794 26
DS -1.3208 -10.5664 -1.3208 -13.5636 0.2794 26
DS -1.3208 -13.5636 -2.3114 -13.5636 0.2794 26
DS 0.6858 -6.5532 -1.3208 -6.5532 0.2794 26
DS -1.3208 -6.5532 -1.3208 -3.556 0.2794 26
DS -1.3208 -3.556 -2.3114 -3.556 0.2794 26
DS -0.8128 -7.0612 -0.8128 -7.5438 0.2794 26
DS -0.8128 -7.0612 -1.3208 -7.0612 0.2794 26
DS -2.3114 -8.5598 -0.8128 -7.0612 0.2794 26
DS 3.683 6.4516 3.683 9.9314 0.2794 26
DS -3.81 6.4516 -3.81 9.9314 0.2794 26
DA -3.0734 6.7056 -3.81 6.4516 1425 0.2794 26
DA 2.921 6.7056 2.1844 6.4516 1425 0.2794 26
DA 1.4224 6.7056 0.6858 6.4516 1425 0.2794 26
DA -0.0762 6.7056 -0.8128 6.4516 1425 0.2794 26
DA -1.5748 6.7056 -2.3114 6.4516 1425 0.2794 26
DS -6.3246 14.4526 6.1722 14.4526 0.2794 26
DS 6.1722 14.4526 6.1722 -15.0622 0.2794 26
DS 6.1722 -15.0622 -6.3246 -15.0622 0.2794 26
DS -6.3246 -15.0622 -6.3246 14.4526 0.2794 26
DS -6.3246 14.4526 6.1722 14.4526 0.2794 21
DS 6.1722 14.4526 6.1722 -15.0622 0.2794 21
DS 6.1722 -15.0622 -6.3246 -15.0622 0.2794 21
DS -6.3246 -15.0622 -6.3246 14.4526 0.2794 21
$PAD
Sh "1" R 1.8796 1.8796 0 0 0
Dr 1.4732 0 0
At STD N 0CC08001
Ne 0 ""
Po -3.81 11.43
$EndPAD
$PAD
Sh "2" C 1.8796 1.8796 0 0 0
Dr 1.4732 0 0
At STD N 0CC08001
Ne 0 ""
Po 3.683 11.43
$EndPAD
$PAD
Sh "3" C 1.8796 1.8796 0 0 0
Dr 1.4732 0 0
At STD N 0CC08001
Ne 0 ""
Po -3.81 -8.5598
$EndPAD
$PAD
Sh "4" C 1.8796 1.8796 0 0 0
Dr 1.4732 0 0
At STD N 0CC08001
Ne 0 ""
Po -3.81 -3.556
$EndPAD
$PAD
Sh "5" C 1.8796 1.8796 0 0 0
Dr 1.4732 0 0
At STD N 0CC08001
Ne 0 ""
Po -3.81 -13.5636
$EndPAD
$PAD
Sh "6" C 1.8796 1.8796 0 0 0
Dr 1.4732 0 0
At STD N 0CC08001
Ne 0 ""
Po 3.683 -8.5598
$EndPAD
$PAD
Sh "7" C 1.8796 1.8796 0 0 0
Dr 1.4732 0 0
At STD N 0CC08001
Ne 0 ""
Po 3.683 -13.5636
$EndPAD
$PAD
Sh "8" C 1.8796 1.8796 0 0 0
Dr 1.4732 0 0
At STD N 0CC08001
Ne 0 ""
Po 3.683 -3.556
$EndPAD
$EndMODULE FINDER4061
$MODULE H100
Po 0 0 0 15 4E8C5C0B 00000000 ~~
Li H100
Sc 0
AR 
Op 0 0 0
T0 8.89 -16.51 1.19888 1.19888 0 0.20066 N V 21 N "Re*"
T1 8.89 3.81 1.19888 1.19888 0 0.20066 N I 21 N "H100"
DA 17.272 -3.556 17.272 -4.064 900 0.20066 21
DA 17.272 -3.556 16.764 -3.556 900 0.20066 21
DA 16.256 -3.556 16.256 -4.064 900 0.20066 21
DA 16.256 -3.556 15.748 -3.556 900 0.20066 21
DA 15.24 -3.556 15.24 -4.064 900 0.20066 21
DA 15.24 -3.556 14.732 -3.556 900 0.20066 21
DA 14.224 -3.556 14.224 -4.064 900 0.20066 21
DA 14.224 -3.556 13.716 -3.556 900 0.20066 21
DA 13.208 -3.556 13.208 -4.064 900 0.20066 21
DA 13.208 -3.556 12.7 -3.556 900 0.20066 21
DS 17.78 -1.524 17.78 -3.556 0.20066 21
DS 12.7 -1.524 12.7 -3.556 0.20066 21
DS 13.97 -10.795 8.89 -9.525 0.1778 21
DS 8.89 -9.525 8.89 0 0.1778 21
DS 8.89 0 1.27 0 0.1778 21
DS 12.7 -10.795 13.335 -11.43 0.1778 21
DS 12.7 -10.795 12.065 -11.43 0.1778 21
DS 12.7 -10.795 12.7 -11.43 0.1778 21
DS 12.7 -8.89 13.335 -8.255 0.1778 21
DS 12.7 -8.89 12.065 -8.255 0.1778 21
DS 16.51 -7.62 12.7 -7.62 0.1778 21
DS 12.7 -7.62 12.7 -8.89 0.1778 21
DS -2.54 2.54 20.32 2.54 0.1778 21
DS 20.32 2.54 20.32 -15.24 0.1778 21
DS 20.32 -15.24 -2.54 -15.24 0.1778 21
DS -2.54 -15.24 -2.54 2.54 0.1778 21
$PAD
Sh "1" C 2.3876 2.3876 0 0 0
Dr 1.3716 0 0
At STD N 00C08001
Ne 0 ""
Po 17.78 0
$EndPAD
$PAD
Sh "2" C 2.3876 2.3876 0 0 0
Dr 1.3716 0 0
At STD N 00C08001
Ne 0 ""
Po 12.7 0
$EndPAD
$PAD
Sh "3" C 2.3876 2.3876 0 0 0
Dr 1.3716 0 0
At STD N 00C08001
Ne 0 ""
Po 0 0
$EndPAD
$PAD
Sh "4" C 2.3876 2.3876 0 0 0
Dr 1.3716 0 0
At STD N 00C08001
Ne 0 ""
Po 17.78 -7.62
$EndPAD
$PAD
Sh "5" C 2.3876 2.3876 0 0 0
Dr 1.3716 0 0
At STD N 00C08001
Ne 0 ""
Po 12.7 -12.7
$EndPAD
$EndMODULE H100
$MODULE H200
Po 0 0 0 15 5152DE7B 00000000 ~~
Li H200
Sc 0
AR 
Op 0 0 0
T0 0 -13 1.19888 1.19888 0 0.20066 N V 21 N "Re*"
T1 0 -10 1.19888 1.19888 0 0.20066 N I 21 N "H200"
DS -2.9972 -5.9544 -2.413 -5.3448 0.1778 21
DS -2.413 -5.3448 -2.9972 -4.7352 0.1778 21
DS -4.318 -5.3448 -2.413 -5.3448 0.1778 21
DS -8.3058 11.1398 -8.3058 -11.136 0.1778 21
DS -8.3058 -11.136 8.2804 -11.136 0.1778 21
DS 8.2804 -11.136 8.2804 11.1398 0.1778 21
DS 8.2804 11.1398 -8.3058 11.1398 0.1778 21
DS 0 6.4408 0 -1.2554 0.1778 21
DS 0 -1.2554 -2.7178 -6.6402 0.1778 21
DS 3.0734 -4.7352 2.4892 -5.3448 0.1778 21
DS 2.4892 -5.3448 3.0734 -5.9544 0.1778 21
DS 4.3942 -5.3448 2.4892 -5.3448 0.1778 21
$PAD
Sh "1" C 2.4892 2.4892 0 0 0
Dr 1.4732 0 0
At STD N 00C0FFFF
Ne 0 ""
Po -5.9944 6.8472
$EndPAD
$PAD
Sh "5" C 2.4892 2.4892 0 0 0
Dr 1.4732 0 0
At STD N 00C0FFFF
Ne 0 ""
Po -5.9944 -5.3448
$EndPAD
$PAD
Sh "2" C 2.4892 2.4892 0 0 0
Dr 1.4732 0 0
At STD N 00C08001
Ne 0 ""
Po 5.9944 6.8472
$EndPAD
$PAD
Sh "4" C 2.4892 2.4892 0 0 0
Dr 1.4732 0 0
At STD N 00C08001
Ne 0 ""
Po 5.9944 -5.3448
$EndPAD
$PAD
Sh "3" C 2.9972 2.9972 0 0 0
Dr 1.9812 0 0
At STD N 00C08001
Ne 0 ""
Po 0 8.9554
$EndPAD
$SHAPE3D
Na "Relay/relay_1g.wrl"
Sc 1.6 1.6 1.6
Of 0 -0.05 0
Ro 0 0 0
$EndSHAPE3D
$EndMODULE H200
$MODULE H800
Po 0 0 0 15 4E8C5D90 00000000 ~~
Li H800
Sc 0
AR 
Op 0 0 0
T0 13.97 -8.89 1.19888 1.19888 0 0.20066 N V 21 N "Re*"
T1 13.97 8.89 1.19888 1.19888 0 0.20066 N I 21 N "H800"
DA 2.9718 0.6096 3.0734 0 1610 0.1778 26
DA 2.9718 -0.5842 3.0734 -1.1938 1606 0.1778 26
DA 2.9718 -1.778 3.0734 -2.3876 1606 0.1778 26
DS 19.2786 -4.7752 19.9644 -1.1938 0.1778 26
DS 19.9644 -1.1938 19.9644 2.3114 0.1778 26
DS 21.1582 -4.2926 20.6756 -3.7846 0.1778 26
DS 20.6756 -3.7846 21.1582 -3.2766 0.1778 26
DS 21.971 -3.7846 20.7772 -3.7846 0.1778 26
DS 18.7706 -3.2766 19.2786 -3.7846 0.1778 26
DS 19.2786 -3.7846 18.7706 -4.2926 0.1778 26
DS 17.9578 -3.7846 19.177 -3.7846 0.1778 26
DS -2.0066 -7.493 -2.0066 7.493 0.1778 26
DS -2.0066 7.493 29.972 7.493 0.1778 26
DS 29.972 7.493 29.972 -7.493 0.1778 26
DS 29.972 -7.493 -2.0066 -7.493 0.1778 26
DS -2.0066 -7.493 -2.0066 7.493 0.1778 21
DS -2.0066 7.493 29.972 7.493 0.1778 21
DS 29.972 7.493 29.972 -7.493 0.1778 21
DS 29.972 -7.493 -2.0066 -7.493 0.1778 21
DS 3.0734 2.4384 3.0734 3.8354 0.1778 26
DS 3.0734 3.8354 1.2954 3.8354 0.1778 26
DS 3.0734 -2.3876 3.0734 -3.7846 0.1778 26
DS 3.0734 -3.7846 1.2954 -3.7846 0.1778 26
DA 2.9718 1.8034 3.0734 1.2192 1606 0.1778 26
$PAD
Sh "3" C 2.4892 2.4892 0 0 0
Dr 1.6764 0 0
At STD N 00C08001
Ne 0 ""
Po 19.9898 3.81
$EndPAD
$PAD
Sh "4" C 2.4892 2.4892 0 0 0
Dr 1.6764 0 0
At STD N 00C08001
Ne 0 ""
Po 23.495 -3.81
$EndPAD
$PAD
Sh "5" C 2.4892 2.4892 0 0 0
Dr 1.6764 0 0
At STD N 00C08001
Ne 0 ""
Po 16.4846 -3.81
$EndPAD
$PAD
Sh "2" C 1.9812 1.9812 0 0 0
Dr 1.1684 0 0
At STD N 0CC08001
Ne 0 ""
Po 0 -3.81
$EndPAD
$PAD
Sh "1" R 1.9812 1.9812 0 0 0
Dr 1.1684 0 0
At STD N 0CC08001
Ne 0 ""
Po 0 3.81
$EndPAD
$EndMODULE H800
$MODULE M15E
Po 0 0 0 15 5152A28B 00000000 ~~
Li M15E
Sc 0
AR 
Op 0 0 0
T0 12.7 -7.62 1.19888 1.19888 0 0.20066 N V 21 N "Re*"
T1 12.7 7.62 1.19888 1.19888 0 0.20066 N I 21 N "M15E"
DS -2.5146 6.3246 27.4828 6.3246 0.2794 21
DS 27.4828 6.3246 27.4828 -6.1722 0.2794 21
DS 27.4828 -6.1722 -2.5146 -6.1722 0.2794 21
DS -2.5146 -6.1722 -2.5146 6.3246 0.2794 21
DS 22.7584 -2.5654 23.9522 -2.5654 0.2794 21
DS 23.9522 -2.5654 23.9522 -0.9652 0.2794 21
DS 21.3614 -2.5654 20.1676 -2.5654 0.2794 21
DS 20.1676 -2.5654 20.1676 -0.9652 0.2794 21
DS 20.7772 -1.778 22.1742 2.032 0.2794 21
DS 3.3782 2.8194 3.3782 3.81 0.2794 21
DS 3.3782 3.81 1.397 3.81 0.2794 21
DA 3.3528 2.1336 3.3782 1.4224 1758 0.2794 21
DA 3.3528 0.7366 3.3782 0.0254 1758 0.2794 21
DA 3.3528 -0.6604 3.3782 -1.3716 1758 0.2794 21
DA 3.3528 -2.0828 3.3782 -2.7686 1758 0.2794 21
DA 3.3528 -0.6604 3.3782 -1.3716 1758 0.2794 21
DA 3.3528 -2.0828 3.3782 -2.7686 1758 0.2794 21
DS 3.3782 -2.7686 3.3782 -3.7592 0.2794 21
DS 3.3782 -3.7592 1.397 -3.7592 0.2794 21
$PAD
Sh "1" R 1.8796 1.8796 0 0 0
Dr 0.8636 0 0
At STD N 0CC08001
Ne 0 ""
Po 0 3.81
$EndPAD
$PAD
Sh "2" C 1.8796 1.8796 0 0 0
Dr 0.8636 0 0
At STD N 0CC08001
Ne 0 ""
Po 0 -3.7338
$EndPAD
$PAD
Sh "5" C 1.8796 1.8796 0 0 0
Dr 0.8636 0 0
At STD N 0CC08001
Ne 0 ""
Po 18.8976 -3.7338
$EndPAD
$PAD
Sh "3" C 1.8796 1.8796 0 0 0
Dr 0.8636 0 0
At STD N 0CC08001
Ne 0 ""
Po 22.098 3.81
$EndPAD
$PAD
Sh "4" C 1.8796 1.8796 0 0 0
Dr 0.8636 0 0
At STD N 0CC08001
Ne 0 ""
Po 25.2984 -3.7338
$EndPAD
$SHAPE3D
Na "Relay/M15E.wrl"
Sc 1 1 1
Of 0 0 0
Ro 0 0 0
$EndSHAPE3D
$EndMODULE M15E
$MODULE RELSIA
Po 0 0 0 15 4EB3B0F5 00000000 ~~
Li RELSIA
Sc 0
AR RELSIA
Op 0 0 0
T0 0 -3.81 1.19888 1.19888 0 0.20066 N V 21 N "Re*"
T1 0 3.81 1.19888 1.19888 0 0.20066 N I 21 N "RELSIA"
DA -9.4996 0 -8.99922 0 900 0.29972 21
DA -9.4996 0 -9.4996 -0.50038 900 0.29972 21
DS 7.6454 -1.2954 7.6454 -1.5748 0.2794 21
DS 7.6454 -1.5748 0.762 -1.5748 0.2794 21
DS 0.6604 -2.0828 -0.7366 -1.5748 0.2794 21
DS -0.7366 -1.5748 -7.62 -1.5748 0.2794 21
DS -7.62 -1.5748 -7.62 -1.2954 0.2794 21
DS -0.4318 0 0.4572 0 0.9906 21
DS 1.27 0 0.8636 0 0.2794 21
DS -1.2446 0 -0.8382 0 0.2794 21
DS -9.525 2.5146 9.4742 2.5146 0.2794 26
DS 9.4742 2.5146 9.4742 -2.4892 0.2794 26
DS 9.4742 -2.4892 -9.525 -2.4892 0.2794 26
DS -9.525 -2.4892 -9.525 2.5146 0.2794 26
DS -9.525 2.5146 -9.525 -2.4892 0.2794 21
DS -9.525 -2.4892 9.4742 -2.4892 0.2794 21
DS 9.4742 -2.4892 9.4742 2.5146 0.2794 21
DS 9.4742 2.5146 -9.525 2.5146 0.2794 21
$PAD
Sh "1" R 1.778 1.778 0 0 0
Dr 0.762 0 0
At STD N 00E0FFFF
Ne 0 ""
Po -7.62 0
$EndPAD
$PAD
Sh "2" C 1.778 1.778 0 0 0
Dr 0.762 0 0
At STD N 00E0FFFF
Ne 0 ""
Po -2.54 0
$EndPAD
$PAD
Sh "3" C 1.778 1.778 0 0 0
Dr 0.762 0 0
At STD N 00E0FFFF
Ne 0 ""
Po 2.54 0
$EndPAD
$PAD
Sh "4" C 1.778 1.778 0 0 0
Dr 0.762 0 0
At STD N 00E0FFFF
Ne 0 ""
Po 7.62 0
$EndPAD
$SHAPE3D
Na "Vlastni\\Relsia.wrl"
Sc 1 1 1
Of 0 0 0
Ro 0 0 0
$EndSHAPE3D
$EndMODULE RELSIA
$MODULE RR1A
Po 0 0 0 15 4E8C6680 00000000 ~~
Li RR1A
Sc 0
AR 
Op 0 0 0
T0 0 -6.35 1.19888 1.19888 0 0.20066 N V 21 N "Re*"
T1 0 6.35 1.19888 1.19888 0 0.20066 N I 21 N "RR1A"
DS 5.08 1.27 1.778 1.27 0.2794 21
DA 1.27 1.27 0.762 1.27 900 0.2794 21
DA 1.27 1.27 1.27 0.762 900 0.2794 21
DA -1.778 1.27 -2.286 1.27 900 0.2794 21
DA -1.778 1.27 -1.778 0.762 900 0.2794 21
DA -0.762 1.27 -0.762 0.762 900 0.2794 21
DA -0.762 1.27 -1.27 1.27 900 0.2794 21
DA 0.254 1.27 0.254 0.762 900 0.2794 21
DA 0.254 1.27 -0.254 1.27 900 0.2794 21
DA -10.16 0 -10.16 -1.27 900 0.2794 21
DA -10.16 0 -8.89 0 900 0.2794 21
DS -10.16 -1.27 -10.16 -5.08 0.2794 26
DS -10.16 -5.08 10.16 -5.08 0.2794 26
DS 10.16 -5.08 10.16 5.08 0.2794 26
DS 10.16 5.08 -10.16 5.08 0.2794 26
DS -10.16 5.08 -10.16 1.27 0.2794 26
DS -7.62 -1.27 -1.905 -1.27 0.2794 26
DS -1.905 -1.27 1.27 -2.54 0.2794 26
DS 7.62 -2.54 7.62 2.54 0.2794 26
DC -4.953 1.27 -5.207 1.397 0.2794 26
DS -7.62 -2.54 -7.62 2.54 0.2794 26
DS 5.08 1.27 5.08 2.54 0.2794 26
DS -4.826 1.27 -2.286 1.27 0.2794 26
DS -5.08 -2.54 -5.08 2.54 0.2794 26
DS 7.62 -1.27 1.27 -1.27 0.2794 26
DS 7.62 -1.27 1.27 -1.27 0.2794 21
DS -7.62 -1.27 -1.905 -1.27 0.2794 21
DS -1.905 -1.27 1.27 -2.54 0.2794 21
DS 7.62 -2.54 7.62 2.54 0.2794 21
DC -4.953 1.27 -5.207 1.397 0.2794 21
DS -7.62 -2.54 -7.62 2.54 0.2794 21
DS 5.08 1.27 5.08 2.54 0.2794 21
DS -4.826 1.27 -2.286 1.27 0.2794 21
DS -5.08 -2.54 -5.08 2.54 0.2794 21
DS -10.16 -1.27 -10.16 -5.08 0.2794 21
DS -10.16 -5.08 10.16 -5.08 0.2794 21
DS 10.16 -5.08 10.16 5.08 0.2794 21
DS 10.16 5.08 -10.16 5.08 0.2794 21
DS -10.16 5.08 -10.16 1.27 0.2794 21
$PAD
Sh "1" R 1.5748 1.5748 0 0 0
Dr 0.762 0 0
At STD N 0CC08001
Ne 0 ""
Po -7.62 3.81
$EndPAD
$PAD
Sh "2" C 1.5748 1.5748 0 0 0
Dr 0.762 0 0
At STD N 0CC08001
Ne 0 ""
Po -5.08 3.81
$EndPAD
$PAD
Sh "3" C 1.5748 1.5748 0 0 0
Dr 0.762 0 0
At STD N 0CC08001
Ne 0 ""
Po 5.08 3.81
$EndPAD
$PAD
Sh "4" C 1.5748 1.5748 0 0 0
Dr 0.762 0 0
At STD N 0CC08001
Ne 0 ""
Po 7.62 3.81
$EndPAD
$PAD
Sh "5" C 1.5748 1.5748 0 0 0
Dr 0.762 0 0
At STD N 0CC08001
Ne 0 ""
Po 7.62 -3.81
$EndPAD
$PAD
Sh "6" C 1.5748 1.5748 0 0 0
Dr 0.762 0 0
At STD N 0CC08001
Ne 0 ""
Po 5.08 -3.81
$EndPAD
$PAD
Sh "7" C 1.5748 1.5748 0 0 0
Dr 0.762 0 0
At STD N 0CC08001
Ne 0 ""
Po -5.08 -3.81
$EndPAD
$PAD
Sh "8" C 1.5748 1.5748 0 0 0
Dr 0.762 0 0
At STD N 0CC08001
Ne 0 ""
Po -7.62 -3.81
$EndPAD
$SHAPE3D
Na "Vlastni\\RR2A.wrl"
Sc 1 1 1
Of 0 0 0
Ro 0 0 0
$EndSHAPE3D
$EndMODULE RR1A
$MODULE RR1U
Po 0 0 0 15 4E8C625E 00000000 ~~
Li RR1U
Sc 0
AR 
Op 0 0 0
T0 0 -6.35 1.19888 1.19888 0 0.20066 N V 21 N "Re*"
T1 0 6.35 1.19888 1.19888 0 0.20066 N I 21 N "RR1U"
DA -10.16 0 -8.89 0 900 0.2794 21
DA -10.16 0 -10.16 -1.27 900 0.2794 21
DC 7.62 0 7.366 0.127 0.2794 21
DS 5.08 1.778 1.524 1.778 0.2794 21
DA 1.016 1.778 1.016 1.27 900 0.2794 21
DA 1.016 1.778 0.508 1.778 900 0.2794 21
DA 0 1.778 0 1.27 900 0.2794 21
DA 0 1.778 -0.508 1.778 900 0.2794 21
DA -1.016 1.778 -1.016 1.27 900 0.2794 21
DA -1.016 1.778 -1.524 1.778 900 0.2794 21
DA -2.032 1.778 -2.032 1.27 900 0.2794 21
DA -2.032 1.778 -2.54 1.778 900 0.2794 21
DS 5.08 1.778 5.08 2.54 0.2794 21
DS 7.62 -2.54 7.62 2.54 0.2794 26
DS -7.62 1.27 -7.62 2.54 0.2794 26
DS -5.08 -2.54 -5.08 2.54 0.2794 26
DS -8.255 0.635 -5.715 0 0.2794 26
DS -5.715 0 7.62 0 0.2794 26
DS -8.255 0.635 -5.715 0 0.2794 21
DS -5.715 0 7.62 0 0.2794 21
DS -10.16 -1.27 -10.16 -5.08 0.2794 26
DS -10.16 -5.08 10.16 -5.08 0.2794 26
DS 10.16 -5.08 10.16 5.08 0.2794 26
DS 10.16 5.08 -10.16 5.08 0.2794 26
DS -10.16 5.08 -10.16 1.27 0.2794 26
DS 7.62 -2.54 7.62 2.54 0.2794 21
DC -5.08 1.778 -5.334 1.905 0.2794 21
DS -7.62 1.27 -7.62 2.54 0.2794 21
DS -5.08 1.778 -2.54 1.778 0.2794 21
DS -5.08 -2.54 -5.08 2.54 0.2794 21
DS -10.16 -1.27 -10.16 -5.08 0.2794 21
DS -10.16 -5.08 10.16 -5.08 0.2794 21
DS 10.16 -5.08 10.16 5.08 0.2794 21
DS 10.16 5.08 -10.16 5.08 0.2794 21
DS -10.16 5.08 -10.16 1.27 0.2794 21
DS -7.62 -2.54 -7.62 -1.27 0.2794 26
DS -7.62 -2.54 -7.62 -1.27 0.2794 21
$PAD
Sh "1" R 1.5748 1.5748 0 0 0
Dr 0.762 0 0
At STD N 0CC08001
Ne 0 ""
Po -7.62 3.81
$EndPAD
$PAD
Sh "2" C 1.5748 1.5748 0 0 0
Dr 0.762 0 0
At STD N 0CC08001
Ne 0 ""
Po -5.08 3.81
$EndPAD
$PAD
Sh "3" C 1.5748 1.5748 0 0 0
Dr 0.762 0 0
At STD N 0CC08001
Ne 0 ""
Po 5.08 3.81
$EndPAD
$PAD
Sh "4" C 1.5748 1.5748 0 0 0
Dr 0.762 0 0
At STD N 0CC08001
Ne 0 ""
Po 7.62 3.81
$EndPAD
$PAD
Sh "5" C 1.5748 1.5748 0 0 0
Dr 0.762 0 0
At STD N 0CC08001
Ne 0 ""
Po 7.62 -3.81
$EndPAD
$PAD
Sh "6" C 1.5748 1.5748 0 0 0
Dr 0.762 0 0
At STD N 0CC08001
Ne 0 ""
Po 5.08 -3.81
$EndPAD
$PAD
Sh "7" C 1.5748 1.5748 0 0 0
Dr 0.762 0 0
At STD N 0CC08001
Ne 0 ""
Po -5.08 -3.81
$EndPAD
$PAD
Sh "8" C 1.5748 1.5748 0 0 0
Dr 0.762 0 0
At STD N 0CC08001
Ne 0 ""
Po -7.62 -3.81
$EndPAD
$SHAPE3D
Na "Vlastni\\RR2A.wrl"
Sc 1 1 1
Of 0 0 0
Ro 0 0 0
$EndSHAPE3D
$EndMODULE RR1U
$MODULE RR2A
Po 0 0 0 15 4E8C6397 00000000 ~~
Li RR2A
Sc 0
AR 
Op 0 0 0
T0 0 -6.35 1.19888 1.19888 0 0.20066 N V 21 N "Re*"
T1 0 6.35 1.19888 1.19888 0 0.20066 N I 21 N "RR2A"
DS 2.286 1.524 5.08 1.524 0.2794 21
DS 5.08 1.524 5.08 2.54 0.2794 21
DA 1.778 1.524 1.778 1.016 900 0.2794 21
DA 1.778 1.524 1.27 1.524 900 0.2794 21
DA 0.762 1.524 0.762 1.016 900 0.2794 21
DA 0.762 1.524 0.254 1.524 900 0.2794 21
DA -0.254 1.524 -0.254 1.016 900 0.2794 21
DA -0.254 1.524 -0.762 1.524 900 0.2794 21
DA -1.27 1.524 -1.27 1.016 900 0.2794 21
DA -1.27 1.524 -1.778 1.524 900 0.2794 21
DS -5.08 1.524 -1.778 1.524 0.2794 21
DA -10.16 0 -8.89 0 900 0.2794 21
DA -10.16 0 -10.16 -1.27 900 0.2794 21
DS 7.62 0 7.62 2.54 0.2794 26
DS -10.16 -1.27 -10.16 -5.08 0.2794 26
DS -10.16 -5.08 10.16 -5.08 0.2794 26
DS 10.16 -5.08 10.16 5.08 0.2794 26
DS 10.16 5.08 -10.16 5.08 0.2794 26
DS -10.16 5.08 -10.16 1.27 0.2794 26
DS 7.62 0 7.62 2.54 0.2794 21
DC -5.08 1.524 -5.334 1.651 0.2794 21
DS -5.08 -2.54 -5.08 2.54 0.2794 21
DS -10.16 -1.27 -10.16 -5.08 0.2794 21
DS -10.16 -5.08 10.16 -5.08 0.2794 21
DS 10.16 -5.08 10.16 5.08 0.2794 21
DS 10.16 5.08 -10.16 5.08 0.2794 21
DS -10.16 5.08 -10.16 1.27 0.2794 21
DS 1.27 -1.905 7.62 -1.905 0.2794 26
DS 7.62 -1.905 7.62 -2.54 0.2794 26
DS -7.62 -2.54 -7.62 -1.905 0.2794 26
DS -7.62 -1.905 -1.27 -1.905 0.2794 26
DS -1.27 -1.905 1.27 -2.54 0.2794 26
DS 1.27 -1.905 7.62 -1.905 0.2794 21
DS 7.62 -1.905 7.62 -2.54 0.2794 21
DS 1.27 -2.54 -1.27 -1.905 0.2794 21
DS -1.27 -1.905 -7.62 -1.905 0.2794 21
DS -7.62 -1.905 -7.62 -2.54 0.2794 21
DS 1.27 0 7.62 0 0.2794 26
DS 1.27 -0.635 -1.27 0 0.2794 26
DS -1.27 0 -7.62 0 0.2794 26
DS -7.62 0 -7.62 2.54 0.2794 26
DS 1.27 0 7.62 0 0.2794 21
DS 1.27 -0.635 -1.27 0 0.2794 21
DS -1.27 0 -7.62 0 0.2794 21
DS -7.62 0 -7.62 2.54 0.2794 21
DS -5.08 -2.54 -5.08 2.54 0.2794 26
$PAD
Sh "1" R 1.5748 1.5748 0 0 0
Dr 0.762 0 0
At STD N 0CC08001
Ne 0 ""
Po -7.62 3.81
$EndPAD
$PAD
Sh "2" C 1.5748 1.5748 0 0 0
Dr 0.762 0 0
At STD N 0CC08001
Ne 0 ""
Po -5.08 3.81
$EndPAD
$PAD
Sh "3" C 1.5748 1.5748 0 0 0
Dr 0.762 0 0
At STD N 0CC08001
Ne 0 ""
Po 5.08 3.81
$EndPAD
$PAD
Sh "4" C 1.5748 1.5748 0 0 0
Dr 0.762 0 0
At STD N 0CC08001
Ne 0 ""
Po 7.62 3.81
$EndPAD
$PAD
Sh "5" C 1.5748 1.5748 0 0 0
Dr 0.762 0 0
At STD N 0CC08001
Ne 0 ""
Po 7.62 -3.81
$EndPAD
$PAD
Sh "6" C 1.5748 1.5748 0 0 0
Dr 0.762 0 0
At STD N 0CC08001
Ne 0 ""
Po 5.08 -3.81
$EndPAD
$PAD
Sh "7" C 1.5748 1.5748 0 0 0
Dr 0.762 0 0
At STD N 0CC08001
Ne 0 ""
Po -5.08 -3.81
$EndPAD
$PAD
Sh "8" C 1.5748 1.5748 0 0 0
Dr 0.762 0 0
At STD N 0CC08001
Ne 0 ""
Po -7.62 -3.81
$EndPAD
$SHAPE3D
Na "Vlastni\\RR2A.wrl"
Sc 1 1 1
Of 0 0 0
Ro 0 0 0
$EndSHAPE3D
$EndMODULE RR2A
$EndLIBRARY
