PCBNEW-LibModule-V1  Po 11. červen 2012, 22:28:45 CEST
# encoding utf-8
Units deci-mils
$INDEX
PPPN162FFKP
conn2-switch
conn220
$EndINDEX
$MODULE PPPN162FFKP
Po 0 0 0 15 4FD654F1 00000000 ~~
Li PPPN162FFKP
Sc 0
AR 
Op 0 0 0
T0 0 -2000 393 393 0 78 N V 21 N "PPPN162FFKP"
T1 0 2000 393 393 0 78 N I 21 N "Value"
DS 3540 660 3060 1270 60 21
DS 3540 -1260 3540 670 60 21
DS -3540 -1270 -3540 1280 60 21
DS 3056 -1260 3536 -1260 60 21
DS -3064 1280 -3544 1280 60 21
DS -3046 -1268 -3542 -1268 60 21
$PAD
Sh "7" R 350 800 0 0 0
Dr 0 0 0
At SMD N 00888000
Ne 0 ""
Po 380 890
$EndPAD
$PAD
Sh "9" R 350 800 0 0 0
Dr 0 0 0
At SMD N 00888000
Ne 0 ""
Po -380 890
$EndPAD
$PAD
Sh "11" R 350 800 0 0 0
Dr 0 0 0
At SMD N 00888000
Ne 0 ""
Po -1180 890
$EndPAD
$PAD
Sh "13" R 350 800 0 0 0
Dr 0 0 0
At SMD N 00888000
Ne 0 ""
Po -1950 890
$EndPAD
$PAD
Sh "15" R 350 800 0 0 0
Dr 0 0 0
At SMD N 00888000
Ne 0 ""
Po -2750 890
$EndPAD
$PAD
Sh "16" R 350 800 0 0 0
Dr 0 0 0
At SMD N 00888000
Ne 0 ""
Po -2750 -880
$EndPAD
$PAD
Sh "14" R 350 800 0 0 0
Dr 0 0 0
At SMD N 00888000
Ne 0 ""
Po -1950 -880
$EndPAD
$PAD
Sh "12" R 350 800 0 0 0
Dr 0 0 0
At SMD N 00888000
Ne 0 ""
Po -1180 -880
$EndPAD
$PAD
Sh "10" R 350 800 0 0 0
Dr 0 0 0
At SMD N 00888000
Ne 0 ""
Po -380 -880
$EndPAD
$PAD
Sh "8" R 350 800 0 0 0
Dr 0 0 0
At SMD N 00888000
Ne 0 ""
Po 380 -880
$EndPAD
$PAD
Sh "6" R 350 800 0 0 0
Dr 0 0 0
At SMD N 00888000
Ne 0 ""
Po 1180 -880
$EndPAD
$PAD
Sh "4" R 350 800 0 0 0
Dr 0 0 0
At SMD N 00888000
Ne 0 ""
Po 1990 -880
$EndPAD
$PAD
Sh "2" R 350 800 0 0 0
Dr 0 0 0
At SMD N 00888000
Ne 0 ""
Po 2750 -880
$EndPAD
$PAD
Sh "1" R 350 800 0 0 0
Dr 0 0 0
At SMD N 00888000
Ne 0 ""
Po 2750 900
$EndPAD
$PAD
Sh "3" R 350 800 0 0 0
Dr 0 0 0
At SMD N 00888000
Ne 0 ""
Po 1990 890
$EndPAD
$PAD
Sh "5" R 350 800 0 0 0
Dr 0 0 0
At SMD N 00888000
Ne 0 ""
Po 1180 890
$EndPAD
$PAD
Sh "" C 472 472 0 0 0
Dr 350 0 0
At HOLE N 00F0FFFF
Ne 0 ""
Po -2365 0
$EndPAD
$PAD
Sh "18" C 472 472 0 0 0
Dr 350 0 0
At HOLE N 00F0FFFF
Ne 0 ""
Po 2366 0
$EndPAD
$EndMODULE PPPN162FFKP
$MODULE conn2-switch
Po 0 0 0 15 4FD0DA1B 00000000 ~~
Li conn2-switch
Sc 0
AR 
Op 0 0 0
T0 0 -2100 392 392 0 77 N V 21 N "conn2/switch"
T1 0 1400 392 392 0 77 N I 21 N "Value"
DS -500 -1250 -500 -1500 50 21
DS -500 -1500 -1750 -1500 50 21
DS -1750 -1500 -1750 -1250 50 21
DS -1750 -1250 -500 -1250 50 21
DS 1500 -1250 1500 -1500 50 21
DS 1500 -1500 250 -1500 50 21
DS 250 -1500 250 -1250 50 21
DS 250 -1250 1500 -1250 50 21
DS 2000 -1000 2000 -1750 50 21
DS 2000 -1750 -2000 -1750 50 21
DS -2000 -1750 -2000 -1000 50 21
DS 2000 1000 -2000 1000 50 21
DS -2000 1000 -2000 -1000 50 21
DS -2000 -1000 2000 -1000 50 21
DS 2000 -1000 2000 1000 50 21
$PAD
Sh "1" R 1250 1250 0 0 1800
Dr 250 0 0
At STD N 00E0FFFF
Ne 0 ""
Po 1000 0
$EndPAD
$PAD
Sh "2" R 1250 1250 0 0 1800
Dr 250 0 0
At STD N 00E0FFFF
Ne 0 ""
Po -1000 0
$EndPAD
$EndMODULE conn2-switch
$MODULE conn220
Po 0 0 0 15 4FD0DA5D 00000000 ~~
Li conn220
Sc 0
AR 
Op 0 0 0
T0 0 -1900 393 393 0 78 N V 21 N "conn220"
T1 0 -1000 393 393 0 78 N I 21 N "Value"
DS 1500 1500 1500 2000 150 21
DS 1500 2000 2500 2000 150 21
DS 2500 2000 2500 1500 150 21
DS 2500 1500 1500 1500 150 21
DS -500 1500 -500 2000 150 21
DS -500 2000 500 2000 150 21
DS 500 2000 500 1500 150 21
DS 500 1500 -500 1500 150 21
DS -1500 1500 -2500 1500 150 21
DS -1500 2000 -1500 1500 150 21
DS -2500 2000 -1500 2000 150 21
DS -2500 1500 -2500 2000 150 21
DS -2500 1500 -2500 2000 150 21
DS -2500 2000 -1500 2000 150 21
DS -1500 2000 -1500 1500 150 21
DS -1500 1500 -2500 1500 150 21
DS -3000 -1500 -3500 -1500 150 21
DS -3500 -1500 -3500 2500 150 21
DS -3500 2500 3500 2500 150 21
DS 3500 2500 3500 -1500 150 21
DS 3500 -1500 3000 -1500 150 21
DS 3000 -1500 -3000 -1500 150 21
DS -3000 -1500 -3000 1000 150 21
DS -3000 1000 3000 1000 150 21
DS 3000 1000 3000 -1500 150 21
$PAD
Sh "1" O 1250 1500 0 0 0
Dr 320 0 0
At STD N 00E0FFFF
Ne 0 ""
Po -2000 0
$EndPAD
$PAD
Sh "3" R 750 750 0 0 0
Dr 320 0 0
At STD N 00E0FFFF
Ne 0 ""
Po 0 0
$EndPAD
$PAD
Sh "2" O 1250 1500 0 0 0
Dr 320 0 0
At STD N 00E0FFFF
Ne 0 ""
Po 2000 0
$EndPAD
$EndMODULE conn220
$EndLIBRARY
