PCBNEW-LibModule-V1  Čt 21. červen 2012, 22:34:03 CEST
# encoding utf-8
Units deci-mils
$INDEX
CRYSTAL_SMD_5x3.2MM
HC-18UH
HC-18UV
OSC_DIP14
OSC_DIP8
Resonator-3pin
XO-14S
$EndINDEX
$MODULE CRYSTAL_SMD_5x3.2MM
Po 0 0 0 15 4FE378E8 00000000 ~~
Li CRYSTAL_SMD_5x3.2MM
Sc 0
AR 
Op 0 0 0
T0 0 -1142 394 394 0 79 N V 21 N "CRYSTAL_SMD_5x3.2MM"
T1 0 1200 394 394 0 79 N I 21 N "VAL**"
DS -1378 -709 1378 -709 100 21
DS 1378 -709 1378 709 100 21
DS 1378 709 -1378 709 100 21
DS -1378 709 -1378 -709 100 21
DS -1378 -709 1378 -709 100 26
DS 1378 -709 1378 709 100 26
DS 1378 709 -1378 709 100 26
DS -1378 709 -1378 -709 100 26
$PAD
Sh "1" R 787 945 0 0 0
Dr 0 0 0
At SMD N 00888000
Ne 0 ""
Po -787 0
$EndPAD
$PAD
Sh "2" R 787 945 0 0 0
Dr 0 0 0
At SMD N 00888000
Ne 0 ""
Po 787 0
$EndPAD
$EndMODULE CRYSTAL_SMD_5x3.2MM
$MODULE HC-18UH
Po 0 0 0 15 4FD0ED2F 00000000 ~~
Li HC-18UH
Cd Quartz boitier HC-18 horizontal
Kw QUARTZ DEV
Sc 0
AR 
Op 0 0 0
T0 -2500 4100 400 400 900 78 N V 21 N "HC-18UH"
T1 0 4100 400 400 900 78 N I 21 N "Value"
DS 1850 6700 -1850 6700 150 21
DS -2250 1600 2250 1600 150 21
DS 2250 1300 -2250 1300 150 21
DS 2050 1600 2050 6500 150 21
DS -2250 1600 -2250 1300 150 21
DS 2250 1600 2250 1300 150 21
DS -1000 500 -1000 1300 150 21
DS 1000 500 1000 1300 150 21
DS -2050 1600 -2050 6500 150 21
DS 2050 6500 1850 6700 150 21
DS -1850 6700 -2050 6500 150 21
$PAD
Sh "1" C 700 700 0 0 0
Dr 314 0 0
At STD N 00E0FFFF
Ne 0 ""
Po -1000 0
$EndPAD
$PAD
Sh "2" C 700 700 0 0 0
Dr 314 0 0
At STD N 00E0FFFF
Ne 0 ""
Po 1000 0
$EndPAD
$SHAPE3D
Na "discret/crystal_hc18u_horizontal.wrl"
Sc 1 1 1
Of 0 0 0
Ro 0 0 0
$EndSHAPE3D
$EndMODULE HC-18UH
$MODULE HC-18UV
Po 0 0 0 15 4FD0ED7D 00000000 ~~
Li HC-18UV
Cd Quartz boitier HC-18U vertical
Kw QUARTZ DEV
Sc 0
AR 
Op 0 A 0
T0 0 -1400 393 393 0 78 N V 21 N "HC-18UV"
T1 0 700 393 393 0 78 N I 21 N "HC-18UV"
DS -2750 -500 -2250 -1000 60 21
DS 2250 -1000 2750 -500 60 21
DS 2750 500 2250 1000 60 21
DS -2750 500 -2250 1000 60 21
DS -2250 -1000 2250 -1000 60 21
DS -2750 -500 -2750 500 60 21
DS -2250 1000 2250 1000 60 21
DS 2750 500 2750 -500 60 21
$PAD
Sh "1" C 700 700 0 0 0
Dr 314 0 0
At STD N 00E0FFFF
Ne 0 ""
Po -1000 0
$EndPAD
$PAD
Sh "2" C 700 700 0 0 0
Dr 314 0 0
At STD N 00E0FFFF
Ne 0 ""
Po 1000 0
$EndPAD
$SHAPE3D
Na "discret/crystal_hc18u_vertical.wrl"
Sc 1 1 1
Of 0 0 0
Ro 0 0 0
$EndSHAPE3D
$EndMODULE HC-18UV
$MODULE OSC_DIP14
Po 0 0 0 15 4FD64D35 00000000 ~~
Li OSC_DIP14
Cd Module Dil 14 pins, pads elliptiques
Kw DIL
Sc 0
AR 
Op 0 0 0
T0 0 -3000 393 393 0 78 N V 21 N "OSC_DIP14"
T1 0 0 393 393 0 78 N I 21 N "Value"
DS 4000 -900 4000 1000 120 21
DS -4000 -1000 -4000 1000 120 21
DS -3700 -1800 -3300 -2200 120 21
DS -3300 -2200 3300 -2200 120 21
DS 3300 -2200 3700 -1800 120 21
DS 3700 -1800 3700 1800 120 21
DS 3700 1800 3400 2200 120 21
DS 3400 2200 -3700 2200 120 21
DS -3700 2200 -3700 -1800 120 21
DS 4000 1000 4000 2000 120 21
DS 4000 2000 3500 2500 120 21
DS 3500 2500 -4000 2500 120 21
DS -4000 2500 -4000 1000 120 21
DS -4000 -1000 -4000 -2000 120 21
DS -4000 -2000 -3500 -2500 120 21
DS -3500 -2500 3500 -2500 120 21
DS 3500 -2500 4000 -2000 120 21
DS 4000 -2000 4000 -1000 120 21
$PAD
Sh "1" R 620 900 0 0 0
Dr 320 0 0
At STD N 00E0FFFF
Ne 0 ""
Po -3000 1500
$EndPAD
$PAD
Sh "7" O 620 900 0 0 0
Dr 320 0 0
At STD N 00E0FFFF
Ne 0 ""
Po 3000 1500
$EndPAD
$PAD
Sh "8" O 620 900 0 0 0
Dr 320 0 0
At STD N 00E0FFFF
Ne 0 ""
Po 3000 -1500
$EndPAD
$PAD
Sh "14" O 620 900 0 0 0
Dr 320 0 0
At STD N 00E0FFFF
Ne 0 ""
Po -3000 -1500
$EndPAD
$SHAPE3D
Na "discret/xtal/xtal_rect.wrl"
Sc 1 1 1
Of 0 0 0
Ro 0 0 0
$EndSHAPE3D
$EndMODULE OSC_DIP14
$MODULE OSC_DIP8
Po 0 0 0 15 4FE1F9BE 00000000 ~~
Li OSC_DIP8
Cd Oscillateur - taille DIP8
Sc 0
AR 
Op 0 0 0
T0 0 -3000 393 393 0 80 N V 21 N "OSC_DIP8"
T1 0 0 393 393 0 80 N I 21 N "Value"
DS -2250 -2350 -2350 -2250 80 21
DS -2350 -2250 -2350 2250 80 21
DS -2350 2250 -2250 2350 80 21
DS -2250 2350 2250 2350 80 21
DS 2250 2350 2350 2250 80 21
DS 2350 2250 2350 -2250 80 21
DS 2350 -2250 2250 -2350 80 21
DS 2250 -2350 -2250 -2350 80 21
DS -2250 -2600 -2600 -2250 80 21
DS -2600 -2250 -2600 2600 80 21
DS -2600 2600 2250 2600 80 21
DS 2250 2600 2600 2250 80 21
DS 2600 2250 2600 -2250 80 21
DS 2600 -2250 2250 -2600 80 21
DS 2250 -2600 -2250 -2600 80 21
$PAD
Sh "1" R 650 650 0 0 0
Dr 320 0 0
At STD N 00E0FFFF
Ne 0 ""
Po -1500 1500
$EndPAD
$PAD
Sh "14" C 650 650 0 0 0
Dr 320 0 0
At STD N 00E0FFFF
Ne 0 ""
Po -1500 -1500
$EndPAD
$PAD
Sh "8" C 650 650 0 0 0
Dr 320 0 0
At STD N 00E0FFFF
Ne 0 ""
Po 1500 -1500
$EndPAD
$PAD
Sh "7" C 650 650 0 0 0
Dr 320 0 0
At STD N 00E0FFFF
Ne 0 ""
Po 1500 1500
$EndPAD
$SHAPE3D
Na "discret/xtal/xtal_quad.wrl"
Sc 1 1 1
Of 0 0 0
Ro 0 0 0
$EndSHAPE3D
$EndMODULE OSC_DIP8
$MODULE Resonator-3pin
Po 0 0 0 15 4FE3840F 00000000 ~~
Li Resonator-3pin
Kw CMS DPACK
Sc 0
AR 
Op 0 0 0
T0 0 1250 393 393 0 78 N I 21 N "Y2"
T1 0 -1300 393 393 0 78 N V 21 N "Resonator-3pin"
DS -1750 -750 1750 -750 150 21
DS 1750 -750 1750 750 150 21
DS 1750 750 -1750 750 150 21
DS -1750 750 -1750 -750 150 21
$PAD
Sh "2" R 472 1500 0 0 0
Dr 0 0 0
At SMD N 00888000
Ne 0 ""
Po 0 0
$EndPAD
$PAD
Sh "1" R 472 1500 0 0 0
Dr 0 0 0
At SMD N 00888000
Ne 0 ""
Po -1000 0
$EndPAD
$PAD
Sh "3" R 472 1500 0 0 0
Dr 0 0 0
At SMD N 00888000
Ne 0 ""
Po 1000 0
$EndPAD
$SHAPE3D
Na "device/bornier_3.wrl"
Sc 0.5 0.5 0.5
Of 0 0 0
Ro 0 0 0
$EndSHAPE3D
$EndMODULE Resonator-3pin
$MODULE XO-14S
Po 0 0 0 15 4FC46D53 00000000 ~~
Li XO-14S
Cd http://www.4timing.com
Kw quartz
Sc 0
AR XO-14S
Op 0 0 0
T0 0 0 394 394 0 79 N I 21 N "XO-14S"
T1 0 -2756 394 394 0 79 N V 21 N "X**"
DS 3490 2300 -3810 2300 100 21
DA 3490 2000 3490 2300 -900 100 21
DA 3390 -1900 3790 -1900 -900 100 21
DS 3790 -2000 3790 2000 100 21
DS -3410 -2300 3390 -2300 100 21
DA -3210 -1700 -3210 -2100 -900 100 21
DS -3810 2300 -3810 -1900 100 21
DS -3210 2100 3190 2100 100 21
DA 3190 1700 3190 2100 -900 100 21
DS 3590 -1600 3590 1700 100 21
DA 3090 -1600 3590 -1600 -900 100 21
DS -3210 -2100 3190 -2100 100 21
DA -3410 -1900 -3410 -2300 -900 100 21
DS -3210 2100 -3610 1700 100 21
DS -3610 1700 -3610 -1700 100 21
$PAD
Sh "7" C 787 787 0 0 1800
Dr 320 0 0
At STD N 00E0FFFF
Ne 0 ""
Po 2990 1500
$EndPAD
$PAD
Sh "1" R 787 787 0 0 1800
Dr 320 0 0
At STD N 00E0FFFF
Ne 0 ""
Po -3010 1500
$EndPAD
$PAD
Sh "14" C 787 787 0 0 1800
Dr 320 0 0
At STD N 00E0FFFF
Ne 0 ""
Po -3010 -1500
$EndPAD
$PAD
Sh "8" C 787 787 0 0 1800
Dr 320 0 0
At STD N 00E0FFFF
Ne 0 ""
Po 2990 -1500
$EndPAD
$EndMODULE XO-14S
$EndLIBRARY
