PCBNEW-LibModule-V1  Út 12. červen 2012, 19:08:27 CEST
# encoding utf-8
Units deci-mils
$INDEX
SW_SPDT_vert
$EndINDEX
$MODULE SW_SPDT_vert
Po 0 0 0 15 4FD776E3 00000000 ~~
Li SW_SPDT_vert
Cd Switch inverseur
Kw SWITCH DEV
Sc 0
AR 
Op 0 0 0
T0 0 -3500 400 400 0 80 N V 21 N "Switch-Lever-vertical"
T1 0 3500 400 400 0 80 N I 21 N "Value"
DS -1250 -3000 1250 -3000 150 21
DS 1250 -3000 1250 3000 150 21
DS 1250 3000 -1250 3000 150 21
DS -1250 3000 -1250 -3000 150 21
$PAD
Sh "1" R 1500 1000 0 0 0
Dr 500 0 0
At STD N 00E0FFFF
Ne 0 ""
Po 0 0
$EndPAD
$PAD
Sh "2" R 1500 1000 0 0 0
Dr 500 0 0
At STD N 00E0FFFF
Ne 0 ""
Po 0 -2000
$EndPAD
$PAD
Sh "3" R 1500 1000 0 0 0
Dr 500 0 0
At STD N 00E0FFFF
Ne 0 ""
Po 0 2000
$EndPAD
$SHAPE3D
Na "Switch/sw_spdt_vert.wrl"
Sc 1 1 1
Of 0 0 0
Ro 0 0 0
$EndSHAPE3D
$EndMODULE SW_SPDT_vert
$EndLIBRARY
