PCBNEW-LibModule-V1  Čt 21. červen 2012, 21:51:34 CEST
# encoding utf-8
Units deci-mils
$INDEX
CASON8
CC6-xF-E
FSBB20CH60C
RN_41
$EndINDEX
$MODULE CASON8
Po 0 0 0 15 4FE377F2 00000000 ~~
Li CASON8
Sc 0
AR 
Op 0 0 0
T0 0 -1614 315 315 0 78 N V 21 N "CASON8"
T1 0 1600 315 315 0 78 N I 21 N "VAL**"
DS -240 -1180 -240 -1000 100 21
DS -240 -1000 240 -1000 100 21
DS 240 -1000 240 -1180 100 21
DC -1535 -1457 -1496 -1575 100 21
DS -984 -1260 -984 1260 100 21
DS -984 1260 984 1260 100 21
DS 984 1260 984 -1260 100 21
DS 984 -1260 -984 -1260 100 21
$PAD
Sh "1" R 528 201 0 0 0
Dr 0 0 0
At SMD N 00888000
Ne 0 ""
Po -1535 -750
$EndPAD
$PAD
Sh "2" R 528 201 0 0 0
Dr 0 0 0
At SMD N 00888000
Ne 0 ""
Po -1535 -250
$EndPAD
$PAD
Sh "3" R 528 201 0 0 0
Dr 0 0 0
At SMD N 00888000
Ne 0 ""
Po -1535 250
$EndPAD
$PAD
Sh "4" R 528 201 0 0 0
Dr 0 0 0
At SMD N 00888000
Ne 0 ""
Po -1535 750
$EndPAD
$PAD
Sh "5" R 528 201 0 0 0
Dr 0 0 0
At SMD N 00888000
Ne 0 ""
Po 1535 750
$EndPAD
$PAD
Sh "6" R 528 201 0 0 0
Dr 0 0 0
At SMD N 00888000
Ne 0 ""
Po 1535 250
$EndPAD
$PAD
Sh "7" R 528 201 0 0 0
Dr 0 0 0
At SMD N 00888000
Ne 0 ""
Po 1535 -250
$EndPAD
$PAD
Sh "8" R 528 201 0 0 0
Dr 0 0 0
At SMD N 00888000
Ne 0 ""
Po 1535 -750
$EndPAD
$EndMODULE CASON8
$MODULE CC6-xF-E
Po 0 0 0 15 4A8FB283 00000000 ~~
Li CC6-xF-E
Sc 0
AR 
Op 0 0 0
T0 0 -5240 591 591 0 147 N V 21 N "CC6-xF-E"
T1 0 -6060 591 591 0 147 N I 21 N "VAL**"
DS -4200 2400 -4000 2400 100 27
DS -4200 2200 -4100 2000 100 27
DS -4100 2000 -4100 2400 100 27
DS -3937 -2756 -3150 -2756 100 27
DS -3543 2362 -3543 3150 100 27
DS -3937 2756 -3150 2756 100 27
DS 3150 -1181 3937 -1181 100 27
DS 3150 2756 3937 2756 100 27
DS 3543 3150 3543 2362 100 27
DS -5700 3794 -5500 3794 100 21
DS -5700 3594 -5600 3394 100 21
DS -5600 3394 -5600 3794 100 21
DS -5039 -4567 -5039 4567 100 21
DS -5039 4567 5039 4567 100 21
DS 5039 4567 5039 -4567 100 21
DS 5039 -4567 -5039 -4567 100 21
DS -5039 -4567 -5039 4567 100 26
DS -5039 4567 5039 4567 100 26
DS 5039 4567 5039 -4567 100 26
DS 5039 -4567 -5039 -4567 100 26
DS 1969 4213 4488 4213 100 27
DS -906 4213 906 4213 100 27
DS -1969 4213 -4488 4213 100 27
DS 1969 -4213 4488 -4213 100 27
DS -906 -4213 906 -4213 100 27
DS -4488 -4213 -1969 -4213 100 27
DS 1969 4213 1969 4409 100 27
DS 1969 4409 906 4409 100 27
DS 906 4409 906 4213 100 27
DS -1969 4213 -1969 4409 100 27
DS -1969 4409 -906 4409 100 27
DS -906 4409 -906 4213 100 27
DS 1969 -4213 1969 -4409 100 27
DS 1969 -4409 906 -4409 100 27
DS 906 -4409 906 -4213 100 27
DS -1969 -4213 -1969 -4409 100 27
DS -1969 -4409 -906 -4409 100 27
DS -906 -4409 -906 -4213 100 27
DS 4500 4193 4500 -4193 100 27
DS -4500 -4193 -4500 4193 100 27
$PAD
Sh "1" C 787 787 0 0 0
Dr 591 0 0
At STD N 00C0FFFF
Ne 0 ""
Po -4500 3000
$EndPAD
$PAD
Sh "2" C 787 787 0 0 0
Dr 591 0 0
At STD N 00C0FFFF
Ne 0 ""
Po -4500 -1000
$EndPAD
$PAD
Sh "3" C 787 787 0 0 0
Dr 591 0 0
At STD N 00C0FFFF
Ne 0 ""
Po -4500 -3000
$EndPAD
$PAD
Sh "4" C 787 787 0 0 0
Dr 591 0 0
At STD N 00C0FFFF
Ne 0 ""
Po 4500 -3000
$EndPAD
$PAD
Sh "5" C 787 787 0 0 0
Dr 591 0 0
At STD N 00C0FFFF
Ne 0 ""
Po 4500 -1000
$EndPAD
$PAD
Sh "6" C 787 787 0 0 0
Dr 591 0 0
At STD N 00C0FFFF
Ne 0 ""
Po 4500 1000
$EndPAD
$PAD
Sh "7" C 787 787 0 0 0
Dr 591 0 0
At STD N 00C0FFFF
Ne 0 ""
Po 4500 3000
$EndPAD
$PAD
Sh "10" C 787 787 0 0 0
Dr 591 0 0
At STD N 00C0FFFF
Ne 0 ""
Po -3500 -4035
$EndPAD
$PAD
Sh "11" C 787 787 0 0 0
Dr 591 0 0
At STD N 00C0FFFF
Ne 0 ""
Po 3500 -4035
$EndPAD
$PAD
Sh "12" C 787 787 0 0 0
Dr 591 0 0
At STD N 00C0FFFF
Ne 0 ""
Po 3500 4035
$EndPAD
$PAD
Sh "9" C 787 787 0 0 0
Dr 591 0 0
At STD N 00C0FFFF
Ne 0 ""
Po -3500 4035
$EndPAD
$EndMODULE CC6-xF-E
$MODULE FSBB20CH60C
Po 0 0 0 15 4A9BD75F 00000000 ~~
Li FSBB20CH60C
Sc 0
AR 
Op 0 0 0
T0 0 -7756 472 472 0 100 N V 21 N "FSBB20CH60C"
T1 0 -8583 472 472 0 100 N I 21 N "VAL**"
DS -8780 -6654 8780 -6654 100 26
DS 8780 -6654 8780 6969 100 26
DS 8780 6969 -8780 6969 100 26
DS -8780 6969 -8780 -6654 100 26
DS 8661 -6654 8780 -6654 100 21
DS 8780 -6654 8780 6969 100 21
DS 8780 6969 -8780 6969 100 21
DS -8780 6969 -8780 -6654 100 21
DS -8780 -6654 8780 -6654 100 21
DS 8661 -5276 8661 5276 100 27
DS 8661 5276 -8661 5276 100 27
DS -8661 5276 -8661 -5276 100 27
DS -8661 -5276 -6575 -5276 100 27
DS -6575 -5276 -6575 -3937 100 27
DS -6575 -3937 -4764 -3937 100 27
DS -4764 -3937 -4764 -5276 100 27
DS -4764 -5276 -3031 -5276 100 27
DS -3031 -5276 -3031 -3937 100 27
DS -3031 -3937 -1260 -3937 100 27
DS -1260 -3937 -1260 -5276 100 27
DS -1260 -5276 433 -5276 100 27
DS 433 -5276 433 -3937 100 27
DS 433 -3937 2362 -3937 100 27
DS 2362 -3937 2362 -5276 100 27
DS 2362 -5276 8622 -5276 100 27
T2 7874 5118 472 472 0 100 N V 21 N "Nu"
T2 6299 5118 472 472 0 100 N V 21 N "Nv"
T2 4331 5118 472 472 0 100 N V 21 N "Nw"
T2 1575 5118 472 472 0 100 N V 21 N "U"
T2 -1575 5118 472 472 0 100 N V 21 N "V"
T2 -4331 5118 472 472 0 100 N V 21 N "W"
T2 -7480 5118 472 472 0 100 N V 21 N "P"
DA 7880 540 7900 1200 900 100 27
DA 7880 540 7240 540 900 100 27
DS 8660 1200 7880 1200 100 27
DS 8660 -100 7880 -100 100 27
DA -7880 540 -7220 580 900 100 27
DA -7880 560 -7880 -100 900 100 27
DS -8660 -100 -7880 -100 100 27
DS -8660 1200 -7880 1200 100 27
$PAD
Sh "1" C 591 591 0 0 0
Dr 394 0 0
At STD N 00C0FFFF
Ne 0 ""
Po 7996 -6220
$EndPAD
$PAD
Sh "2" C 591 591 0 0 0
Dr 394 0 0
At STD N 00C0FFFF
Ne 0 ""
Po 7296 -6220
$EndPAD
$PAD
Sh "3" C 591 591 0 0 0
Dr 394 0 0
At STD N 00C0FFFF
Ne 0 ""
Po 6596 -6220
$EndPAD
$PAD
Sh "4" C 591 591 0 0 0
Dr 394 0 0
At STD N 00C0FFFF
Ne 0 ""
Po 5896 -6220
$EndPAD
$PAD
Sh "5" C 591 591 0 0 0
Dr 394 0 0
At STD N 00C0FFFF
Ne 0 ""
Po 5196 -6220
$EndPAD
$PAD
Sh "6" C 591 591 0 0 0
Dr 394 0 0
At STD N 00C0FFFF
Ne 0 ""
Po 4496 -6220
$EndPAD
$PAD
Sh "7" C 591 591 0 0 0
Dr 394 0 0
At STD N 00C0FFFF
Ne 0 ""
Po 3796 -6220
$EndPAD
$PAD
Sh "8" C 591 591 0 0 0
Dr 394 0 0
At STD N 00C0FFFF
Ne 0 ""
Po 3096 -6220
$EndPAD
$PAD
Sh "9" C 591 591 0 0 0
Dr 394 0 0
At STD N 00C0FFFF
Ne 0 ""
Po 1696 -4606
$EndPAD
$PAD
Sh "10" C 591 591 0 0 0
Dr 394 0 0
At STD N 00C0FFFF
Ne 0 ""
Po 996 -4606
$EndPAD
$PAD
Sh "11" C 591 591 0 0 0
Dr 394 0 0
At STD N 00C0FFFF
Ne 0 ""
Po 0 -6220
$EndPAD
$PAD
Sh "12" C 591 591 0 0 0
Dr 394 0 0
At STD N 00C0FFFF
Ne 0 ""
Po -807 -6220
$EndPAD
$PAD
Sh "13" C 591 591 0 0 0
Dr 394 0 0
At STD N 00C0FFFF
Ne 0 ""
Po -1804 -4606
$EndPAD
$PAD
Sh "14" C 591 591 0 0 0
Dr 394 0 0
At STD N 00C0FFFF
Ne 0 ""
Po -2504 -4606
$EndPAD
$PAD
Sh "15" C 591 591 0 0 0
Dr 394 0 0
At STD N 00C0FFFF
Ne 0 ""
Po -3500 -6220
$EndPAD
$PAD
Sh "16" C 591 591 0 0 0
Dr 394 0 0
At STD N 00C0FFFF
Ne 0 ""
Po -4307 -6220
$EndPAD
$PAD
Sh "17" C 591 591 0 0 0
Dr 394 0 0
At STD N 00C0FFFF
Ne 0 ""
Po -5304 -4606
$EndPAD
$PAD
Sh "18" C 591 591 0 0 0
Dr 394 0 0
At STD N 00C0FFFF
Ne 0 ""
Po -6004 -4606
$EndPAD
$PAD
Sh "19" C 591 591 0 0 0
Dr 394 0 0
At STD N 00C0FFFF
Ne 0 ""
Po -7000 -6220
$EndPAD
$PAD
Sh "20" C 591 591 0 0 0
Dr 394 0 0
At STD N 00C0FFFF
Ne 0 ""
Po -7807 -6220
$EndPAD
$PAD
Sh "21" C 1181 1181 0 0 0
Dr 906 0 0
At STD N 00C0FFFF
Ne 0 ""
Po 7575 6220
$EndPAD
$PAD
Sh "22" C 1181 1181 0 0 0
Dr 906 0 0
At STD N 00C0FFFF
Ne 0 ""
Po 6000 6220
$EndPAD
$PAD
Sh "23" C 1181 1181 0 0 0
Dr 906 0 0
At STD N 00C0FFFF
Ne 0 ""
Po 4425 6220
$EndPAD
$PAD
Sh "24" C 1181 1181 0 0 0
Dr 906 0 0
At STD N 00C0FFFF
Ne 0 ""
Po 1425 6220
$EndPAD
$PAD
Sh "25" C 1181 1181 0 0 0
Dr 906 0 0
At STD N 00C0FFFF
Ne 0 ""
Po -1575 6220
$EndPAD
$PAD
Sh "26" C 1181 1181 0 0 0
Dr 906 0 0
At STD N 00C0FFFF
Ne 0 ""
Po -4575 6220
$EndPAD
$PAD
Sh "27" C 1181 1181 0 0 0
Dr 906 0 0
At STD N 00C0FFFF
Ne 0 ""
Po -7575 6220
$EndPAD
$EndMODULE FSBB20CH60C
$MODULE RN_41
Po 0 0 0 15 4FE37B22 00000000 ~~
Li RN_41
Sc 0
AR 
Op 0 0 0
T0 0 -3328 472 472 0 100 N V 21 N "RN_41"
T1 0 0 472 472 0 100 N I 21 N "VAL**"
DS -3150 -2913 -3543 -2913 100 21
DS -3150 2913 -3543 2913 100 21
DS 3543 2913 4213 2913 100 21
DS 4213 2913 4213 2756 100 21
DS 3543 -2913 4213 -2913 100 21
DS 4213 -2913 4213 -2756 100 21
DS 4213 -2913 4213 2913 100 26
DS 4213 2913 -6299 2913 100 26
DS -6299 2913 -6299 -2913 100 26
DS -6299 -2913 4213 -2913 100 26
DS -5079 -1732 -5079 1417 100 27
DS -5079 1417 -5591 1417 100 27
DS -5591 1417 -5591 -1732 100 27
DS -5591 -1732 -5079 -1732 100 27
DS 4055 2638 -6102 2638 100 27
DS -6102 2638 -6102 -2638 100 27
DS -6102 -2638 4055 -2638 100 27
DS 4055 -2638 4055 2638 100 27
$PAD
Sh "1" R 315 512 0 0 0
Dr 0 0 0
At SMD N 00888000
Ne 0 ""
Po -2598 2598
$EndPAD
$PAD
Sh "2" R 315 512 0 0 0
Dr 0 0 0
At SMD N 00888000
Ne 0 ""
Po -2126 2598
$EndPAD
$PAD
Sh "3" R 315 512 0 0 0
Dr 0 0 0
At SMD N 00888000
Ne 0 ""
Po -1654 2598
$EndPAD
$PAD
Sh "4" R 315 512 0 0 0
Dr 0 0 0
At SMD N 00888000
Ne 0 ""
Po -1181 2598
$EndPAD
$PAD
Sh "5" R 315 512 0 0 0
Dr 0 0 0
At SMD N 00888000
Ne 0 ""
Po -709 2598
$EndPAD
$PAD
Sh "6" R 315 512 0 0 0
Dr 0 0 0
At SMD N 00888000
Ne 0 ""
Po -236 2598
$EndPAD
$PAD
Sh "7" R 315 512 0 0 0
Dr 0 0 0
At SMD N 00888000
Ne 0 ""
Po 236 2598
$EndPAD
$PAD
Sh "8" R 315 512 0 0 0
Dr 0 0 0
At SMD N 00888000
Ne 0 ""
Po 709 2598
$EndPAD
$PAD
Sh "9" R 315 512 0 0 0
Dr 0 0 0
At SMD N 00888000
Ne 0 ""
Po 1181 2598
$EndPAD
$PAD
Sh "10" R 315 512 0 0 0
Dr 0 0 0
At SMD N 00888000
Ne 0 ""
Po 1654 2598
$EndPAD
$PAD
Sh "11" R 315 512 0 0 0
Dr 0 0 0
At SMD N 00888000
Ne 0 ""
Po 2126 2598
$EndPAD
$PAD
Sh "12" R 315 512 0 0 0
Dr 0 0 0
At SMD N 00888000
Ne 0 ""
Po 2598 2598
$EndPAD
$PAD
Sh "13" R 315 512 0 0 0
Dr 0 0 0
At SMD N 00888000
Ne 0 ""
Po 2598 -2598
$EndPAD
$PAD
Sh "14" R 315 512 0 0 0
Dr 0 0 0
At SMD N 00888000
Ne 0 ""
Po 2126 -2598
$EndPAD
$PAD
Sh "15" R 315 512 0 0 0
Dr 0 0 0
At SMD N 00888000
Ne 0 ""
Po 1654 -2598
$EndPAD
$PAD
Sh "16" R 315 512 0 0 0
Dr 0 0 0
At SMD N 00888000
Ne 0 ""
Po 1181 -2598
$EndPAD
$PAD
Sh "17" R 315 512 0 0 0
Dr 0 0 0
At SMD N 00888000
Ne 0 ""
Po 709 -2598
$EndPAD
$PAD
Sh "18" R 315 512 0 0 0
Dr 0 0 0
At SMD N 00888000
Ne 0 ""
Po 236 -2598
$EndPAD
$PAD
Sh "19" R 315 512 0 0 0
Dr 0 0 0
At SMD N 00888000
Ne 0 ""
Po -236 -2598
$EndPAD
$PAD
Sh "20" R 315 512 0 0 0
Dr 0 0 0
At SMD N 00888000
Ne 0 ""
Po -709 -2598
$EndPAD
$PAD
Sh "21" R 315 512 0 0 0
Dr 0 0 0
At SMD N 00888000
Ne 0 ""
Po -1181 -2598
$EndPAD
$PAD
Sh "22" R 315 512 0 0 0
Dr 0 0 0
At SMD N 00888000
Ne 0 ""
Po -1654 -2598
$EndPAD
$PAD
Sh "23" R 315 512 0 0 0
Dr 0 0 0
At SMD N 00888000
Ne 0 ""
Po -2126 -2598
$EndPAD
$PAD
Sh "24" R 315 512 0 0 0
Dr 0 0 0
At SMD N 00888000
Ne 0 ""
Po -2598 -2598
$EndPAD
$PAD
Sh "25" R 512 315 0 0 0
Dr 0 0 0
At SMD N 00888000
Ne 0 ""
Po -3465 -1811
$EndPAD
$PAD
Sh "27" R 512 315 0 0 0
Dr 0 0 0
At SMD N 00888000
Ne 0 ""
Po -3465 -551
$EndPAD
$PAD
Sh "28" R 512 315 0 0 0
Dr 0 0 0
At SMD N 00888000
Ne 0 ""
Po 3701 -1220
$EndPAD
$PAD
Sh "29" R 512 315 0 0 0
Dr 0 0 0
At SMD N 00888000
Ne 0 ""
Po 3701 1220
$EndPAD
$EndMODULE RN_41
$EndLIBRARY
