PCBNEW-LibModule-V1  Po 29. říjen 2012, 19:52:51 CET
# encoding utf-8
Units deci-mils
$INDEX
MCE100
Microphone
$EndINDEX
$MODULE MCE100
Po 0 0 0 15 4FE88987 00000000 ~~
Li MCE100
Sc 0
AR 
Op 0 0 0
T0 0 -2264 392 392 0 77 N V 21 N "MCE100"
T1 0 -787 393 393 0 78 N I 21 N "Value"
DC 0 0 1870 0 150 21
T2 -1000 200 393 393 0 78 N V 21 N "+"
$PAD
Sh "1" R 580 580 0 0 0
Dr 275 0 0
At STD N 00E0FFFF
Ne 0 ""
Po -500 787
$EndPAD
$PAD
Sh "2" C 590 590 0 0 0
Dr 275 0 0
At STD N 00E0FFFF
Ne 0 ""
Po 500 787
$EndPAD
$SHAPE3D
Na "Vlastni/MCE100.wrl"
Sc 1 1 1
Of 0 0 0
Ro 0 0 0
$EndSHAPE3D
$EndMODULE MCE100
$MODULE Microphone
Po 0 0 0 15 4FE889D0 00000000 ~~
Li Microphone
Sc 0
AR 
Op 0 0 0
T0 0 -2264 392 392 0 77 N V 21 N "Microphone"
T1 0 -787 393 393 0 78 N I 21 N "Value"
DC 0 0 1870 0 150 21
T2 -1000 200 393 393 0 78 N V 21 N "+"
$PAD
Sh "1" R 580 580 0 0 0
Dr 275 0 0
At STD N 00E0FFFF
Ne 0 ""
Po -500 787
$EndPAD
$PAD
Sh "2" C 590 590 0 0 0
Dr 275 0 0
At STD N 00E0FFFF
Ne 0 ""
Po 500 787
$EndPAD
$SHAPE3D
Na "Vlastni/MCE100.wrl"
Sc 1 1 1
Of 0 0 0
Ro 0 0 0
$EndSHAPE3D
$EndMODULE Microphone
$EndLIBRARY
