PCBNEW-LibModule-V1  10.4.2012 18:11:11
# encoding utf-8
$INDEX

MC1602E
MC1602J
PC0802A
$EndINDEX
$MODULE
Po 0 0 0 15 4F7AB760 4F7AB722 ~~
Li
Sc 4F7AB722
AR
Op 0 0 0
T0 0 -7000 600 600 0 120 N V 21 N "PC0802A"
T1 0 0 600 600 0 120 N I 21 N "Value"
DS -8710 5120 8700 5120 190 26
DS 8700 5120 8700 -5110 190 26
DS 8700 -5110 -8710 -5110 190 26
DS -8710 -5110 -8710 5120 190 26
DS -11420 6300 11410 6300 190 26
DS 11410 6300 11410 -6290 190 26
DS 11410 -6290 -11420 -6290 190 26
DS -11420 -6290 -11420 6300 190 26
DS -7490 3150 7480 3150 190 26
DS 7480 3150 7480 -3140 190 26
DS 7480 -3140 -7490 -3140 190 26
DS -7490 -3140 -7490 3150 190 26
DS -8710 5120 8700 5120 190 21
DS 8700 5120 8700 -5110 190 21
DS 8700 -5110 -8710 -5110 190 21
DS -8710 -5110 -8710 5120 190 21
DS -11420 6300 11410 6300 190 21
DS 11410 6300 11410 -6290 190 21
DS 11410 -6290 -11420 -6290 190 21
DS -11420 -6290 -11420 6300 190 21
$PAD
Sh "1" C 700 700 0 0 0
Dr 540 0 0
At STD N 0CC08001
Ne 0 ""
Po -9750 3000
$EndPAD
$PAD
Sh "2" C 700 700 0 0 0
Dr 540 0 0
At STD N 0CC08001
Ne 0 ""
Po -10750 3000
$EndPAD
$PAD
Sh "3" C 700 700 0 0 0
Dr 540 0 0
At STD N 0CC08001
Ne 0 ""
Po -9750 2000
$EndPAD
$PAD
Sh "4" C 700 700 0 0 0
Dr 540 0 0
At STD N 0CC08001
Ne 0 ""
Po -10750 2000
$EndPAD
$PAD
Sh "5" C 700 700 0 0 0
Dr 540 0 0
At STD N 0CC08001
Ne 0 ""
Po -9750 1000
$EndPAD
$PAD
Sh "6" C 700 700 0 0 0
Dr 540 0 0
At STD N 0CC08001
Ne 0 ""
Po -10750 1000
$EndPAD
$PAD
Sh "7" C 700 700 0 0 0
Dr 540 0 0
At STD N 0CC08001
Ne 0 ""
Po -9750 0
$EndPAD
$PAD
Sh "8" C 700 700 0 0 0
Dr 540 0 0
At STD N 0CC08001
Ne 0 ""
Po -10750 0
$EndPAD
$PAD
Sh "9" C 700 700 0 0 0
Dr 540 0 0
At STD N 0CC08001
Ne 0 ""
Po -9750 -1000
$EndPAD
$PAD
Sh "10" C 700 700 0 0 0
Dr 540 0 0
At STD N 0CC08001
Ne 0 ""
Po -10750 -1000
$EndPAD
$PAD
Sh "11" C 700 700 0 0 0
Dr 540 0 0
At STD N 0CC08001
Ne 0 ""
Po -9750 -2000
$EndPAD
$PAD
Sh "12" C 700 700 0 0 0
Dr 540 0 0
At STD N 0CC08001
Ne 0 ""
Po -10750 -2000
$EndPAD
$PAD
Sh "13" C 700 700 0 0 0
Dr 540 0 0
At STD N 0CC08001
Ne 0 ""
Po -9750 -3000
$EndPAD
$PAD
Sh "14" C 700 700 0 0 0
Dr 540 0 0
At STD N 0CC08001
Ne 0 ""
Po -10750 -3000
$EndPAD
$PAD
Sh "D1" C 1360 1360 0 0 0
Dr 980 0 0
At STD N 0CC08001
Ne 0 ""
Po -10440 5320
$EndPAD
$PAD
Sh "D2" C 1360 1360 0 0 0
Dr 980 0 0
At STD N 0CC08001
Ne 0 ""
Po 10430 5320
$EndPAD
$PAD
Sh "D3" C 1360 1360 0 0 0
Dr 980 0 0
At STD N 0CC08001
Ne 0 ""
Po 10430 -5310
$EndPAD
$PAD
Sh "D4" C 1360 1360 0 0 0
Dr 980 0 0
At STD N 0CC08001
Ne 0 ""
Po -10440 -5310
$EndPAD
$EndMODULE
$MODULE PC0802A
Po 0 0 0 15 4F845922 00000000 ~~
Li PC0802A
Sc 00000000
AR
Op 0 0 0
T0 0 -7000 600 600 0 120 N V 21 N "PC0802A"
T1 0 0 600 600 0 120 N I 21 N "Value"
DS -8710 5120 8700 5120 190 26
DS 8700 5120 8700 -5110 190 26
DS 8700 -5110 -8710 -5110 190 26
DS -8710 -5110 -8710 5120 190 26
DS -11420 6300 11410 6300 190 26
DS 11410 6300 11410 -6290 190 26
DS 11410 -6290 -11420 -6290 190 26
DS -11420 -6290 -11420 6300 190 26
DS -7490 3150 7480 3150 190 24
DS 7480 3150 7480 -3140 190 24
DS 7480 -3140 -7490 -3140 190 24
DS -7490 -3140 -7490 3150 190 24
DS -8710 5120 8700 5120 190 21
DS 8700 5120 8700 -5110 190 21
DS 8700 -5110 -8710 -5110 190 21
DS -8710 -5110 -8710 5120 190 21
DS -11420 6300 11410 6300 190 21
DS 11410 6300 11410 -6290 190 21
DS 11410 -6290 -11420 -6290 190 21
DS -11420 -6290 -11420 6300 190 21
$PAD
Sh "1" C 700 700 0 0 0
Dr 540 0 0
At STD N 00E0FFFF
Ne 0 ""
Po -9750 3000
$EndPAD
$PAD
Sh "2" C 700 700 0 0 0
Dr 540 0 0
At STD N 00E0FFFF
Ne 0 ""
Po -10750 3000
$EndPAD
$PAD
Sh "3" C 700 700 0 0 0
Dr 540 0 0
At STD N 00E0FFFF
Ne 0 ""
Po -9750 2000
$EndPAD
$PAD
Sh "4" C 700 700 0 0 0
Dr 540 0 0
At STD N 00E0FFFF
Ne 0 ""
Po -10750 2000
$EndPAD
$PAD
Sh "5" C 700 700 0 0 0
Dr 540 0 0
At STD N 00E0FFFF
Ne 0 ""
Po -9750 1000
$EndPAD
$PAD
Sh "6" C 700 700 0 0 0
Dr 540 0 0
At STD N 00E0FFFF
Ne 0 ""
Po -10750 1000
$EndPAD
$PAD
Sh "7" C 700 700 0 0 0
Dr 540 0 0
At STD N 00E0FFFF
Ne 0 ""
Po -9750 0
$EndPAD
$PAD
Sh "8" C 700 700 0 0 0
Dr 540 0 0
At STD N 00E0FFFF
Ne 0 ""
Po -10750 0
$EndPAD
$PAD
Sh "9" C 700 700 0 0 0
Dr 540 0 0
At STD N 00E0FFFF
Ne 0 ""
Po -9750 -1000
$EndPAD
$PAD
Sh "10" C 700 700 0 0 0
Dr 540 0 0
At STD N 00E0FFFF
Ne 0 ""
Po -10750 -1000
$EndPAD
$PAD
Sh "11" C 700 700 0 0 0
Dr 540 0 0
At STD N 00E0FFFF
Ne 0 ""
Po -9750 -2000
$EndPAD
$PAD
Sh "12" C 700 700 0 0 0
Dr 540 0 0
At STD N 00E0FFFF
Ne 0 ""
Po -10750 -2000
$EndPAD
$PAD
Sh "13" C 700 700 0 0 0
Dr 540 0 0
At STD N 00E0FFFF
Ne 0 ""
Po -9750 -3000
$EndPAD
$PAD
Sh "14" C 700 700 0 0 0
Dr 540 0 0
At STD N 00E0FFFF
Ne 0 ""
Po -10750 -3000
$EndPAD
$PAD
Sh "D1" C 1360 1360 0 0 0
Dr 980 0 0
At STD N 00E0FFFF
Ne 0 ""
Po -10440 5320
$EndPAD
$PAD
Sh "D2" C 1360 1360 0 0 0
Dr 980 0 0
At STD N 00E0FFFF
Ne 0 ""
Po 10430 5320
$EndPAD
$PAD
Sh "D3" C 1360 1360 0 0 0
Dr 980 0 0
At STD N 00E0FFFF
Ne 0 ""
Po 10430 -5310
$EndPAD
$PAD
Sh "D4" C 1360 1360 0 0 0
Dr 980 0 0
At STD N 00E0FFFF
Ne 0 ""
Po -10440 -5310
$EndPAD
$EndMODULE  PC0802A
$MODULE MC1602E
Po 0 0 0 15 4F845B79 00000000 ~~
Li MC1602E
Sc 00000000
AR MC1602J
Op 0 0 0
T0 2000 -18000 600 600 0 120 N V 21 N "MC1602E"
T1 17000 -9000 600 600 0 120 N I 21 N "Value"
DS 0 -16250 0 -17330 110 26
DS 33070 -17330 33070 -16250 110 26
DS 4130 -6100 4130 -12410 118 24
DS 4130 -12410 29550 -12410 110 24
DS 29550 -12410 29550 -6100 110 24
DS 29550 -6100 4130 -6100 110 24
DS 2850 -4520 2850 -13970 110 24
DS 2850 -13970 30800 -13970 110 24
DS 30800 -13970 30800 -4520 110 24
DS 30800 -4520 2850 -4520 110 24
DS 0 0 33070 0 110 21
DS 33070 0 33070 -15260 110 21
DS 33070 -15260 32070 -15260 110 21
DA 32030 -15760 32070 -15260 1707 110 21
DS 32070 -16250 33070 -16250 110 21
DS 33070 -16250 33070 -17330 110 21
DS 33070 -17330 0 -17330 110 21
DS 0 -17330 0 -16250 110 21
DS 0 -16250 980 -16250 110 21
DA 1000 -15760 980 -16250 1753 110 21
DS 980 -15260 0 -15260 110 21
DS 0 -15260 0 0 110 21
$PAD
Sh "14" C 700 700 0 0 0
Dr 460 0 0
At STD N 00E0FFFF
Ne 0 ""
Po 4010 -1000
$EndPAD
$PAD
Sh "13" C 700 700 0 0 0
Dr 460 0 0
At STD N 00E0FFFF
Ne 0 ""
Po 5010 -1000
$EndPAD
$PAD
Sh "12" C 700 700 0 0 0
Dr 460 0 0
At STD N 00E0FFFF
Ne 0 ""
Po 6010 -1000
$EndPAD
$PAD
Sh "11" C 700 700 0 0 0
Dr 460 0 0
At STD N 00E0FFFF
Ne 0 ""
Po 7010 -1000
$EndPAD
$PAD
Sh "10" C 700 700 0 0 0
Dr 460 0 0
At STD N 00E0FFFF
Ne 0 ""
Po 8010 -1000
$EndPAD
$PAD
Sh "9" C 700 700 0 0 0
Dr 460 0 0
At STD N 00E0FFFF
Ne 0 ""
Po 9010 -1000
$EndPAD
$PAD
Sh "4" C 700 700 0 0 0
Dr 460 0 0
At STD N 00E0FFFF
Ne 0 ""
Po 14010 -1000
$EndPAD
$PAD
Sh "1" R 700 700 0 0 0
Dr 460 0 0
At STD N 00E0FFFF
Ne 0 ""
Po 17010 -1000
$EndPAD
$PAD
Sh "2" C 700 700 0 0 0
Dr 460 0 0
At STD N 00E0FFFF
Ne 0 ""
Po 16010 -1000
$EndPAD
$PAD
Sh "3" C 700 700 0 0 0
Dr 460 0 0
At STD N 00E0FFFF
Ne 0 ""
Po 15010 -1000
$EndPAD
$PAD
Sh "5" C 700 700 0 0 0
Dr 460 0 0
At STD N 00E0FFFF
Ne 0 ""
Po 13010 -1000
$EndPAD
$PAD
Sh "6" C 700 700 0 0 0
Dr 460 0 0
At STD N 00E0FFFF
Ne 0 ""
Po 12010 -1000
$EndPAD
$PAD
Sh "7" C 700 700 0 0 0
Dr 460 0 0
At STD N 00E0FFFF
Ne 0 ""
Po 11010 -1000
$EndPAD
$PAD
Sh "8" C 700 700 0 0 0
Dr 460 0 0
At STD N 00E0FFFF
Ne 0 ""
Po 10010 -1000
$EndPAD
$PAD
Sh "D1" C 1360 1360 0 0 0
Dr 1020 0 0
At STD N 00E0FFFF
Ne 0 ""
Po 1570 -1570
$EndPAD
$PAD
Sh "D2" C 1360 1360 0 0 0
Dr 1020 0 0
At STD N 00E0FFFF
Ne 0 ""
Po 31490 -1570
$EndPAD
$PAD
Sh "D3" C 1360 1360 0 0 0
Dr 1020 0 0
At STD N 00E0FFFF
Ne 0 ""
Po 980 -15740
$EndPAD
$PAD
Sh "D4" C 1360 1360 0 0 0
Dr 1020 0 0
At STD N 00E0FFFF
Ne 0 ""
Po 32080 -15740
$EndPAD
$PAD
Sh "15" C 700 700 0 0 0
Dr 460 0 0
At STD N 00E0FFFF
Ne 0 ""
Po 18000 -1000
$EndPAD
$PAD
Sh "16" C 700 700 0 0 0
Dr 460 0 0
At STD N 00E0FFFF
Ne 0 ""
Po 19000 -1000
$EndPAD
$EndMODULE  MC1602E
$MODULE MC1602J
Po 0 0 0 15 4F845B9C 00000000 ~~
Li MC1602J
Sc 00000000
AR MC1602J
Op 0 0 0
T0 2000 -18000 600 600 0 120 N V 21 N "MC1602J"
T1 17000 -9000 600 600 0 120 N I 21 N "Value"
DS 0 -16250 0 -17330 110 26
DS 33070 -17330 33070 -16250 110 26
DS 4130 -6100 4130 -12410 118 24
DS 4130 -12410 29550 -12410 110 24
DS 29550 -12410 29550 -6100 110 24
DS 29550 -6100 4130 -6100 110 24
DS 2850 -4520 2850 -13970 110 24
DS 2850 -13970 30800 -13970 110 24
DS 30800 -13970 30800 -4520 110 24
DS 30800 -4520 2850 -4520 110 24
DS 0 0 33070 0 110 21
DS 33070 0 33070 -15260 110 21
DS 33070 -15260 32070 -15260 110 21
DA 32030 -15760 32070 -15260 1707 110 21
DS 32070 -16250 33070 -16250 110 21
DS 33070 -16250 33070 -17330 110 21
DS 33070 -17330 0 -17330 110 21
DS 0 -17330 0 -16250 110 21
DS 0 -16250 980 -16250 110 21
DA 1000 -15760 980 -16250 1753 110 21
DS 980 -15260 0 -15260 110 21
DS 0 -15260 0 0 110 21
$PAD
Sh "14" C 700 700 0 0 0
Dr 460 0 0
At STD N 00E0FFFF
Ne 0 ""
Po 4010 -1000
$EndPAD
$PAD
Sh "13" C 700 700 0 0 0
Dr 460 0 0
At STD N 00E0FFFF
Ne 0 ""
Po 5010 -1000
$EndPAD
$PAD
Sh "12" C 700 700 0 0 0
Dr 460 0 0
At STD N 00E0FFFF
Ne 0 ""
Po 6010 -1000
$EndPAD
$PAD
Sh "11" C 700 700 0 0 0
Dr 460 0 0
At STD N 00E0FFFF
Ne 0 ""
Po 7010 -1000
$EndPAD
$PAD
Sh "10" C 700 700 0 0 0
Dr 460 0 0
At STD N 00E0FFFF
Ne 0 ""
Po 8010 -1000
$EndPAD
$PAD
Sh "9" C 700 700 0 0 0
Dr 460 0 0
At STD N 00E0FFFF
Ne 0 ""
Po 9010 -1000
$EndPAD
$PAD
Sh "4" C 700 700 0 0 0
Dr 460 0 0
At STD N 00E0FFFF
Ne 0 ""
Po 14010 -1000
$EndPAD
$PAD
Sh "1" R 700 700 0 0 0
Dr 460 0 0
At STD N 00E0FFFF
Ne 0 ""
Po 17010 -1000
$EndPAD
$PAD
Sh "2" C 700 700 0 0 0
Dr 460 0 0
At STD N 00E0FFFF
Ne 0 ""
Po 16010 -1000
$EndPAD
$PAD
Sh "3" C 700 700 0 0 0
Dr 460 0 0
At STD N 00E0FFFF
Ne 0 ""
Po 15010 -1000
$EndPAD
$PAD
Sh "5" C 700 700 0 0 0
Dr 460 0 0
At STD N 00E0FFFF
Ne 0 ""
Po 13010 -1000
$EndPAD
$PAD
Sh "6" C 700 700 0 0 0
Dr 460 0 0
At STD N 00E0FFFF
Ne 0 ""
Po 12010 -1000
$EndPAD
$PAD
Sh "7" C 700 700 0 0 0
Dr 460 0 0
At STD N 00E0FFFF
Ne 0 ""
Po 11010 -1000
$EndPAD
$PAD
Sh "8" C 700 700 0 0 0
Dr 460 0 0
At STD N 00E0FFFF
Ne 0 ""
Po 10010 -1000
$EndPAD
$PAD
Sh "D1" C 1360 1360 0 0 0
Dr 1020 0 0
At STD N 00E0FFFF
Ne 0 ""
Po 1570 -1570
$EndPAD
$PAD
Sh "D2" C 1360 1360 0 0 0
Dr 1020 0 0
At STD N 00E0FFFF
Ne 0 ""
Po 31490 -1570
$EndPAD
$PAD
Sh "D3" C 1360 1360 0 0 0
Dr 1020 0 0
At STD N 00E0FFFF
Ne 0 ""
Po 980 -15740
$EndPAD
$PAD
Sh "D4" C 1360 1360 0 0 0
Dr 1020 0 0
At STD N 00E0FFFF
Ne 0 ""
Po 32080 -15740
$EndPAD
$EndMODULE  MC1602J
$EndLIBRARY
