PCBNEW-LibModule-V1  13.5.2012 22:02:03
# encoding utf-8
$INDEX
con-lumberg-1501_03
con-lumberg-1501_05
con-lumberg-1501_06
con-lumberg-1502_01
con-lumberg-1503_02
con-lumberg-KLBR1
con-lumberg-KLBR4
$EndINDEX
$MODULE con-lumberg-1503_02
Po 0 0 0 15 4FAD6E83 00000000 ~~
Li con-lumberg-1503_02
Cd JACK CONNECTORS ACCORDING TO JISC 6560,
Kw JACK CONNECTORS ACCORDING TO JISC 6560,
Sc 00000000
AR
Op 0 0 0
At SMD
T0 -2559 2362 500 500 900 35 N V 21 N "1503_02"
T1 0 2461 500 500 900 35 N I 21 N ">VALUE"
DS -1240 4488 -1240 39 80 21
DS -1240 39 1240 39 80 21
DS 1240 39 1240 4488 80 21
DS 1240 4488 -1240 4488 80 21
DS -944 -944 944 -944 80 21
DS -944 0 -944 -944 80 21
DS 944 0 944 -944 80 21
DS -1751 472 -1318 472 236 21
DS -1318 472 -1318 1023 236 21
DS -1318 1023 -1751 1023 236 21
DS 1751 1023 1318 1023 236 21
DS 1318 1023 1318 472 236 21
DS 1318 472 1751 472 236 21
DS -1751 4055 -1318 4055 236 21
DS -1318 4055 -1318 4409 236 21
DS -1318 4409 -1751 4409 236 21
DS 1751 4409 1318 4409 236 21
DS 1318 4409 1318 4055 236 21
DS 1318 4055 1751 4055 236 21
DS -1240 3700 -1240 1417 80 21
DS 1240 1417 1240 3700 80 21
DS 846 4488 -846 4488 80 21
DC -984 2755 -1082 2853 50 21
DS -1181 2755 -787 2755 50 21
DS -984 2952 -984 2559 50 21
DC 984 2755 1082 2853 50 21
DS 787 2755 1181 2755 50 21
DS 984 2952 984 2559 50 21
$PAD
Sh "1" R 984 590 0 0 0
Dr 0 0 0
At SMD N 00888000
Ne 0 ""
Po 1476 4232
$EndPAD
$PAD
Sh "2" R 984 787 0 0 0
Dr 0 0 0
At SMD N 00888000
Ne 0 ""
Po -1476 748
$EndPAD
$PAD
Sh "2@2" R 984 787 0 0 0
Dr 0 0 0
At SMD N 00888000
Ne 0 ""
Po 1476 748
$EndPAD
$PAD
Sh "3" R 984 590 0 0 0
Dr 0 0 0
At SMD N 00888000
Ne 0 ""
Po -1476 4232
$EndPAD
$SHAPE3D
Na "Connectors\\Audio\\lumberg-1503-02.wrl"
Sc 1.000000 1.000000 1.000000
Of 0.000000 0.000000 0.000000
Ro 0.000000 0.000000 0.000000
$EndSHAPE3D
$EndMODULE  con-lumberg-1503_02
$MODULE con-lumberg-1501_03
Po 0 0 0 15 4FB011CA 00000000 ~~
Li con-lumberg-1501_03
Cd JACK CONNECTORS ACCORDING TO JISC 6560,
Kw JACK CONNECTORS ACCORDING TO JISC 6560,
Sc 00000000
AR
Op 0 0 0
At VIRTUAL
T0 -1500 1175 500 500 900 35 N V 21 N "1501_03"
T1 1500 925 500 500 900 35 N I 21 N ">VALUE"
DS -748 -1535 748 -1535 80 21
DS -748 -1535 -748 -984 80 21
DS -944 -944 944 -944 80 21
DS 944 2716 -944 2716 80 21
DS 748 -1535 748 -984 80 21
DS -944 2716 -944 -944 80 21
DS 944 -944 944 2716 80 21
DS -944 2716 -944 2555 80 21
DS 944 -944 944 -33 80 21
DS 944 805 944 2716 80 21
DS -944 -533 -944 -944 80 21
DS -944 1716 -944 305 80 21
DC 0 0 -108 108 50 21
DS -216 0 216 0 50 21
DS 0 216 0 -216 50 21
DC 0 2362 -108 2470 50 21
DS -216 2362 216 2362 50 21
DS 0 2578 0 2145 50 21
$PAD
Sh "1" C 669 669 0 0 0
Dr 433 0 0
At STD N 00E0FFFF
Ne 0 ""
Po -728 -118
$EndPAD
$PAD
Sh "2" C 669 669 0 0 0
Dr 433 0 0
At STD N 00E0FFFF
Ne 0 ""
Po 728 393
$EndPAD
$PAD
Sh "3" C 669 669 0 0 0
Dr 433 0 0
At STD N 00E0FFFF
Ne 0 ""
Po -728 2244
$EndPAD
$SHAPE3D
Na "Connectors\\Audio\\lumberg-1501-03.wrl"
Sc 1.000000 1.000000 1.000000
Of 0.000000 0.000000 0.000000
Ro 0.000000 0.000000 0.000000
$EndSHAPE3D
$EndMODULE  con-lumberg-1501_03
$MODULE con-lumberg-1501_05
Po 0 0 0 15 4FB011E1 00000000 ~~
Li con-lumberg-1501_05
Cd JACK CONNECTORS ACCORDING TO JISC 6560,
Kw JACK CONNECTORS ACCORDING TO JISC 6560,
Sc 00000000
AR
Op 0 0 0
At VIRTUAL
T0 -1500 2750 500 500 900 35 N V 21 N "1501_05"
T1 1500 2500 500 500 900 35 N I 21 N ">VALUE"
DS -748 39 748 39 80 21
DS -748 39 -748 590 80 21
DS -944 629 944 629 80 21
DS 944 4488 -944 4488 80 21
DS 748 39 748 590 80 21
DS -944 4291 -944 629 80 21
DS 944 629 944 4291 80 21
DS -944 4488 -944 3736 80 21
DS 944 629 944 1108 80 21
DS 944 3757 944 4488 80 21
DS -944 1100 -944 629 80 21
DS 944 2897 944 1879 80 21
DS -1023 1141 -551 1141 1 21
DS -551 1141 -551 1811 1 21
DS -551 1811 -1023 1811 1 21
DS -1023 1811 -1023 1141 1 21
DS 551 1141 1023 1141 1 21
DS 1023 1141 1023 1811 1 21
DS 1023 1811 551 1811 1 21
DS 551 1811 551 1141 1 21
DS -944 3051 -551 3051 1 21
DS -551 3051 -551 3641 1 21
DS -551 3641 -944 3641 1 21
DS -944 3641 -944 3051 1 21
DS 551 3051 944 3051 1 21
DS 944 3051 944 3641 1 21
DS 944 3641 551 3641 1 21
DS 551 3641 551 3051 1 21
DS -295 4724 295 4724 1 21
DS 295 4724 295 4330 1 21
DS 295 4330 -295 4330 1 21
DS -295 4330 -295 4724 1 21
DS -944 2897 -944 1879 80 21
DC -787 1476 -905 1594 50 21
DS -1023 1476 -551 1476 50 21
DS -787 1712 -787 1240 50 21
DC 787 1476 905 1594 50 21
DS 551 1476 1023 1476 50 21
DS 787 1712 787 1240 50 21
$PAD
Sh "1" O 551 1102 0 0 0
Dr 433 0 0
At STD N 00E0FFFF
Ne 0 ""
Po -748 3346
$EndPAD
$PAD
Sh "2" O 551 1102 0 0 0
Dr 433 0 0
At STD N 00E0FFFF
Ne 0 ""
Po 0 4527
$EndPAD
$PAD
Sh "3" O 551 1102 0 0 0
Dr 433 0 0
At STD N 00E0FFFF
Ne 0 ""
Po 748 3346
$EndPAD
$SHAPE3D
Na "Connectors\\Audio\\lumberg-1501-05.wrl"
Sc 1.000000 1.000000 1.000000
Of 0.000000 0.000000 0.000000
Ro 0.000000 0.000000 0.000000
$EndSHAPE3D
$EndMODULE  con-lumberg-1501_05
$MODULE con-lumberg-1501_06
Po 0 0 0 15 4FB011EF 00000000 ~~
Li con-lumberg-1501_06
Cd JACK CONNECTORS ACCORDING TO JISC 6560,
Kw JACK CONNECTORS ACCORDING TO JISC 6560,
Sc 00000000
AR
Op 0 0 0
At VIRTUAL
T0 -2362 1772 500 500 900 35 N V 21 N "1501_06"
T1 2461 1969 500 500 900 35 N I 21 N ">VALUE"
DS -1929 39 1929 39 80 21
DS 1929 39 1929 3700 80 21
DS 1929 3700 -1929 3700 80 21
DS -1929 3700 -1929 39 80 21
DS -944 0 -944 -944 80 21
DS -944 -944 944 -944 80 21
DS 944 -944 944 0 80 21
DC -787 1377 -944 1534 50 21
DS -1102 1377 -472 1377 50 21
DS -787 1692 -787 1062 50 21
DC -787 2952 -944 3109 50 21
DS -1102 2952 -472 2952 50 21
DS -787 3267 -787 2637 50 21
DC 787 1771 944 1928 50 21
DS 472 1771 1102 1771 50 21
DS 787 2086 787 1456 50 21
$PAD
Sh "1" C 590 590 0 0 0
Dr 354 0 0
At STD N 00E0FFFF
Ne 0 ""
Po 787 984
$EndPAD
$PAD
Sh "2" C 590 590 0 0 0
Dr 354 0 0
At STD N 00E0FFFF
Ne 0 ""
Po 1574 1377
$EndPAD
$PAD
Sh "4" C 590 590 0 0 0
Dr 354 0 0
At STD N 00E0FFFF
Ne 0 ""
Po -1574 1771
$EndPAD
$SHAPE3D
Na "Connectors\\Audio\\lumberg-1501-06.wrl"
Sc 1.000000 1.000000 1.000000
Of 0.000000 0.000000 0.000000
Ro 0.000000 0.000000 0.000000
$EndSHAPE3D
$EndMODULE  con-lumberg-1501_06
$MODULE con-lumberg-1502_01
Po 0 0 0 15 4FB01200 00000000 ~~
Li con-lumberg-1502_01
Cd JACK CONNECTORS ACCORDING TO JISC 6560,
Kw JACK CONNECTORS ACCORDING TO JISC 6560,
Sc 00000000
AR
Op 0 0 0
At VIRTUAL
T0 -2000 0 500 500 900 35 N V 21 N "1502_01"
T1 2000 -250 500 500 900 35 N I 21 N ">VALUE"
DS -137 -1082 137 -1082 1 21
DS 137 -767 -137 -767 1 21
DS -767 -157 -767 -433 1 21
DS -1082 -433 -1082 -157 1 21
DS 767 -157 767 -433 1 21
DS 1082 -433 1082 -157 1 21
DS -511 -1141 511 -1141 80 21
DS 511 -1141 1141 -1141 80 21
DS 1535 -748 1535 748 80 21
DS 1141 1141 -1141 1141 80 21
DS -1535 748 -1535 -748 80 21
DS -1141 -1141 -511 -1141 80 21
DC 0 0 -334 334 40 21
DC 0 0 -531 531 40 21
DC 0 984 -118 1102 50 21
DS -236 984 236 984 50 21
DS 0 1220 0 748 50 21
DA -137 -925 -295 -925 900 1 21
DA 137 -925 137 -1082 900 1 21
DA 137 -925 295 -925 900 1 21
DA -137 -925 -137 -767 900 1 21
DA -925 -157 -767 -157 900 1 21
DA -925 -433 -925 -590 900 1 21
DA -925 -433 -1082 -433 900 1 21
DA -925 -157 -925 0 900 1 21
DA 925 -157 925 0 900 1 21
DA 925 -433 767 -433 900 1 21
DA 925 -433 925 -590 900 1 21
DA 925 -157 1082 -157 900 1 21
DA 1141 -748 1141 -1141 900 80 21
DA 1141 748 1535 748 900 80 21
DA -1141 748 -1141 1141 900 80 21
DA -1141 -748 -1535 -748 900 80 21
$PAD
Sh "1" O 472 944 0 0 0
Dr 314 0 0
At STD N 00E0FFFF
Ne 0 ""
Po 0 -925
$EndPAD
$PAD
Sh "2" O 472 944 0 0 0
Dr 314 0 0
At STD N 00E0FFFF
Ne 0 ""
Po -925 -295
$EndPAD
$PAD
Sh "3" O 472 944 0 0 0
Dr 314 0 0
At STD N 00E0FFFF
Ne 0 ""
Po 925 -295
$EndPAD
$SHAPE3D
Na "Connectors\\Audio\\lumberg-1502-01.wrl"
Sc 1.000000 1.000000 1.000000
Of 0.000000 0.000000 0.000000
Ro 0.000000 0.000000 0.000000
$EndSHAPE3D
$EndMODULE  con-lumberg-1502_01
$MODULE con-lumberg-KLBR1
Po 0 0 0 15 4FB0121D 00000000 ~~
Li con-lumberg-KLBR1
Cd JACK CONNECTORS ACCORDING TO JISC 6560,
Kw JACK CONNECTORS ACCORDING TO JISC 6560,
Sc 00000000
AR
Op 0 0 0
At VIRTUAL
T0 -2500 500 500 500 900 35 N V 21 N "KLBR1"
T1 2500 250 500 500 900 35 N I 21 N ">VALUE"
DS -295 -2047 295 -2047 1 21
DS 295 -1653 -295 -1653 1 21
DS -295 1653 295 1653 1 21
DS 295 2047 -295 2047 1 21
DS -1771 1673 -1771 1082 1 21
DS -1377 1082 -1377 1673 1 21
DS -1141 -3041 -1141 -3541 80 21
DS -748 -4336 748 -4336 80 21
DS 1141 -3541 1141 -3041 80 21
DS -944 -2781 944 -2781 80 21
DS 1929 -2348 1929 1712 80 21
DS 1929 1712 885 1712 80 21
DS 885 1712 -885 1712 80 21
DS -885 1712 -1614 1712 80 21
DS -1614 1712 -1929 1712 80 21
DS -1929 1712 -1929 669 80 21
DS -1929 669 -1929 -2348 80 21
DS -1141 -3541 -748 -3541 80 21
DS -748 -3541 748 -3541 80 21
DS 748 -3541 1141 -3541 80 21
DS -1141 -3041 -748 -3041 80 21
DS -748 -3041 748 -3041 80 21
DS 748 -3041 1141 -3041 80 21
DS -748 -3541 -748 -4336 80 21
DS 748 -4336 748 -3541 80 21
DS -748 -2820 -748 -3041 80 21
DS 748 -3041 748 -2820 80 21
DS -1929 -2348 -944 -2348 80 21
DS -944 -2348 944 -2348 80 21
DS 944 -2348 1929 -2348 80 21
DS -944 -2348 -944 -2781 80 21
DS 944 -2781 944 -2348 80 21
DA -295 -1850 -492 -1850 900 1 21
DA 295 -1850 295 -2047 900 1 21
DA 295 -1850 492 -1850 900 1 21
DA -295 -1850 -295 -1653 900 1 21
DA -295 1850 -492 1850 900 1 21
DA 295 1850 295 1653 900 1 21
DA 295 1850 492 1850 900 1 21
DA -295 1850 -295 2047 900 1 21
DA -1574 1673 -1574 1870 900 1 21
DA -1574 1082 -1771 1082 900 1 21
DA -1574 1082 -1574 885 900 1 21
DA -1574 1673 -1377 1673 900 1 21
$PAD
Sh "3" O 708 1417 0 0 0
Dr 393 0 0
At STD N 00E0FFFF
Ne 0 ""
Po 0 1850
$EndPAD
$PAD
Sh "4" O 708 1417 0 0 0
Dr 393 0 0
At STD N 00E0FFFF
Ne 0 ""
Po -1574 1377
$EndPAD
$PAD
Sh "5" O 708 1417 0 0 0
Dr 393 0 0
At STD N 00E0FFFF
Ne 0 ""
Po 0 -1850
$EndPAD
$SHAPE3D
Na "Connectors\\Audio\\lumberg-KLBR1.wrl"
Sc 1.000000 1.000000 1.000000
Of 0.000000 0.000000 0.000000
Ro 0.000000 0.000000 0.000000
$EndSHAPE3D
$EndMODULE  con-lumberg-KLBR1
$MODULE con-lumberg-KLBR4
Po 0 0 0 15 4FB012A6 00000000 ~~
Li con-lumberg-KLBR4
Cd JACK CONNECTORS ACCORDING TO JISC 6560,
Kw JACK CONNECTORS ACCORDING TO JISC 6560,
Sc 00000000
AR 
Op 0 0 0
At VIRTUAL 
T0 -2750 1000 500 500 900 35 N V 21 N "KLBR4"
T1 2750 750 500 500 900 35 N I 21 N ">VALUE"
DS -2322 -2322 2322 -2322 80 21
DS 2322 -2322 2322 2322 80 21
DS 2322 2322 1240 2322 80 21
DS 1240 2322 -2322 2322 80 21
DS -2322 2322 -2322 -2322 80 21
DS -1141 -2362 -1141 -3700 80 21
DS -1141 -3700 1141 -3700 80 21
DS 1141 -3700 1141 -2362 80 21
$PAD
Sh "B" O 472 944 0 0 0
Dr 393 0 0
At STD N 00E0FFFF
Ne 0 ""
Po -944 984
$EndPAD
$PAD
Sh "R" O 472 944 0 0 0
Dr 393 0 0
At STD N 00E0FFFF
Ne 0 ""
Po 1771 2283
$EndPAD
$PAD
Sh "S" O 472 944 0 0 0
Dr 393 0 0
At STD N 00E0FFFF
Ne 0 ""
Po -866 -1377
$EndPAD
$PAD
Sh "T" O 472 944 0 0 0
Dr 393 0 0
At STD N 00E0FFFF
Ne 0 ""
Po -1772 1673
$EndPAD
$SHAPE3D
Na "Connectors\\Audio\\lumberg-KLBR4.wrl"
Sc 1.000000 1.000000 1.000000
Of 0.000000 0.000000 0.000000
Ro 0.000000 0.000000 0.000000
$EndSHAPE3D
$EndMODULE  con-lumberg-KLBR4
$EndLIBRARY
