PCBNEW-LibModule-V1  27/11/2008-08:04:28
$INDEX
SRA_1
$EndINDEX
$MODULE SRA_1
Po 0 0 0 15 492E542F 492E5163 ~~
Li SRA_1
Kw Frequency Mixer
Sc 492E5163
AR 
Op 0 0 0
T0 0 2800 600 600 0 98 N V 21 "SRA_1"
T1 0 -2800 600 600 0 98 N V 21 "MIX**"
DS 4000 2000 -4000 2000 100 21
DS -4000 2000 -4000 -1900 100 21
DS -4000 -1900 -4000 -2000 100 21
DS -4000 -2000 4000 -2000 100 21
DS 4000 -2000 4000 2000 100 21
$PAD
Sh "7" C 709 709 0 0 1800
Dr 320 0 0
At STD N 00E0FFFF
Ne 0 ""
Po 3000 1000
$EndPAD
$PAD
Sh "5" C 709 709 0 0 1800
Dr 320 0 0
At STD N 00E0FFFF
Ne 0 ""
Po 1000 1000
$EndPAD
$PAD
Sh "3" C 709 709 0 0 1800
Dr 320 0 0
At STD N 00E0FFFF
Ne 0 ""
Po -1000 1000
$EndPAD
$PAD
Sh "1" C 787 787 0 0 1800
Dr 320 0 0
At STD N 00E0FFFF
Ne 0 ""
Po -3000 1000
$EndPAD
$PAD
Sh "2" C 709 709 0 0 1800
Dr 320 0 0
At STD N 00E0FFFF
Ne 0 ""
Po -3000 -1000
$EndPAD
$PAD
Sh "4" C 709 709 0 0 1800
Dr 320 0 0
At STD N 00E0FFFF
Ne 0 ""
Po -1000 -1000
$EndPAD
$PAD
Sh "6" C 709 709 0 0 1800
Dr 320 0 0
At STD N 00E0FFFF
Ne 0 ""
Po 1000 -1000
$EndPAD
$PAD
Sh "8" C 709 709 0 0 1800
Dr 320 0 0
At STD N 00E0FFFF
Ne 0 ""
Po 3000 -1000
$EndPAD
$EndMODULE  SRA_1
$EndLIBRARY
