PCBNEW-LibModule-V1  Út 12. červen 2012, 19:01:51 CEST
# encoding utf-8
Units deci-mils
$INDEX
Switch-shift-h2
switch-shift-h
$EndINDEX
$MODULE Switch-shift-h2
Po 0 0 0 15 4FD775E1 00000000 ~~
Li Switch-shift-h2
Sc 0
AR 
Op 0 0 0
T0 0 -2750 393 393 0 78 N V 21 N "Switch-shift-h2"
T1 0 2600 392 392 0 77 N I 21 N "Value"
DC -5000 0 -4950 -900 150 21
DC 4650 0 4850 -900 150 21
DS -3300 1950 -6550 1950 150 21
DS -6550 1950 -6600 1950 150 21
DS -6600 1950 -6600 -2150 150 21
DS -3300 -2150 -6600 -2150 150 21
DS 3100 1950 6200 1950 150 21
DS 3100 -2150 6200 -2150 150 21
DS 6200 -2150 6200 1850 150 21
DS -3250 -2150 3100 -2150 150 21
DS 3100 -2150 3100 1950 150 21
DS 3100 1950 -3300 1950 150 21
DS -3300 1950 -3300 -2150 150 21
$PAD
Sh "2" C 1181 1181 0 0 0
Dr 590 0 0
At STD N 00E0FFFF
Ne 0 ""
Po 0 1000
$EndPAD
$PAD
Sh "5" C 1181 1181 0 0 0
Dr 590 0 0
At STD N 00E0FFFF
Ne 0 ""
Po 0 -1000
$EndPAD
$PAD
Sh "6" C 1181 1181 0 0 0
Dr 590 0 0
At STD N 00E0FFFF
Ne 0 ""
Po 2000 -1000
$EndPAD
$PAD
Sh "3" C 1181 1181 0 0 0
Dr 590 0 0
At STD N 00E0FFFF
Ne 0 ""
Po 2000 1000
$EndPAD
$PAD
Sh "4" C 1181 1181 0 0 0
Dr 590 0 0
At STD N 00E0FFFF
Ne 0 ""
Po -2000 -1000
$EndPAD
$PAD
Sh "1" R 1180 1180 0 0 0
Dr 590 0 0
At STD N 00E0FFFF
Ne 0 ""
Po -2000 1000
$EndPAD
$SHAPE3D
Na "Switch/Chave_hh.wrl"
Sc 1 1 1
Of 0 0 0
Ro 0 0 0
$EndSHAPE3D
$EndMODULE Switch-shift-h2
$MODULE switch-shift-h
Po 0 0 0 15 4FD7749B 00000000 ~~
Li switch-shift-h
Cd Connecteur 3 pins
Kw CONN DEV
Sc 0
AR 
Op 0 0 0
T0 0 -1400 392 392 0 77 N V 21 N "switch_h"
T1 0 1300 393 393 0 78 N I 21 N "Value"
DS 1600 700 1600 -800 150 21
DS -1500 600 -1500 -700 150 21
DS -2800 700 -2800 -800 150 21
DS 2900 700 2900 -800 150 21
DS 2900 -800 2700 -800 150 21
DC -2200 0 -1800 100 150 21
DC 2300 0 2700 0 150 21
DS 1700 -800 2700 -800 150 21
DS 2900 700 1700 700 150 21
DS -1900 -800 1700 -800 150 21
DS 1700 700 -1600 700 150 21
DS -1600 -800 -2800 -800 150 21
DS -2800 700 -1600 700 150 21
$PAD
Sh "1" R 787 1574 0 0 0
Dr 550 0 0
At STD N 00E0FFFF
Ne 0 ""
Po -1000 0
$EndPAD
$PAD
Sh "2" O 787 1574 0 0 0
Dr 550 0 0
At STD N 00E0FFFF
Ne 0 ""
Po 0 0
$EndPAD
$PAD
Sh "3" O 787 1574 0 0 0
Dr 550 0 0
At STD N 00E0FFFF
Ne 0 ""
Po 1000 0
$EndPAD
$SHAPE3D
Na "Switch/Chave_h.wrl"
Sc 1 1 1
Of 0 0 0
Ro 0 0 0
$EndSHAPE3D
$EndMODULE switch-shift-h
$EndLIBRARY
