PCBNEW-LibModule-V1  Út 12. červen 2012, 21:51:02 CEST
# encoding utf-8
Units deci-mils
$INDEX
RCA1
RCA2
RCA3
$EndINDEX
$MODULE RCA1
Po 0 0 0 15 4FD79C46 00000000 ~~
Li RCA1
Sc 0
AR 
Op 0 0 0
T0 0 -4000 393 393 0 78 N V 21 N "RCA1"
T1 0 3250 393 393 900 78 N I 21 N "Value"
DS -1500 1000 -1500 5000 150 21
DS -1500 5000 -1000 5500 150 21
DS -1000 5500 1000 5500 150 21
DS 1000 5500 1500 5000 150 21
DS 1500 5000 1500 1000 150 21
DS -2000 500 -2000 -2500 150 21
DS -2000 -2500 -2000 -3500 150 21
DS -2000 -3500 2000 -3500 150 21
DS 2000 -3500 2000 1000 150 21
DS 2000 1000 -2000 1000 150 21
DS -2000 1000 -2000 500 150 21
$PAD
Sh "b" O 1181 1574 0 0 0
Dr 709 0 0
At STD N 00E0FFFF
Ne 0 ""
Po -2000 -750
$EndPAD
$PAD
Sh "a" O 1181 1574 0 0 0
Dr 709 0 0
At STD N 00E0FFFF
Ne 0 ""
Po 2000 -750
$EndPAD
$PAD
Sh "1" C 787 787 0 0 0
Dr 394 0 0
At STD N 00E0FFFF
Ne 0 ""
Po 0 -750
$EndPAD
$PAD
Sh "2" C 787 787 0 0 0
Dr 394 0 0
At STD N 00E0FFFF
Ne 0 ""
Po 0 -3000
$EndPAD
$SHAPE3D
Na "connectors/Cinch/rca1_red.wrl"
Sc 1 1 1
Of 0 0 0
Ro 0 0 0
$EndSHAPE3D
$EndMODULE RCA1
$MODULE RCA2
Po 0 0 0 15 4FD79D1D 00000000 ~~
Li RCA2
Sc 0
AR 
Op 0 0 0
T0 0 -4000 393 393 0 78 N V 21 N "RCA2"
T1 0 3000 393 393 900 78 N I 21 N "Value"
DS -1500 1000 -1500 5000 150 21
DS -1500 5000 -1000 5500 150 21
DS -1000 5500 1000 5500 150 21
DS 1000 5500 1500 5000 150 21
DS 1500 5000 1500 1000 150 21
DS -2000 500 -2000 -2500 150 21
DS -2000 -2500 -2000 -3500 150 21
DS -2000 -3500 2000 -3500 150 21
DS 2000 -3500 2000 1000 150 21
DS 2000 1000 -2000 1000 150 21
DS -2000 1000 -2000 500 150 21
$PAD
Sh "b" O 1180 1574 0 0 0
Dr 709 0 0
At STD N 00E0FFFF
Ne 0 ""
Po -2000 500
$EndPAD
$PAD
Sh "a" O 1181 1574 0 0 0
Dr 709 0 0
At STD N 00E0FFFF
Ne 0 ""
Po 2000 500
$EndPAD
$PAD
Sh "1" C 787 787 0 0 0
Dr 394 0 0
At STD N 00E0FFFF
Ne 0 ""
Po 0 -750
$EndPAD
$PAD
Sh "2" C 787 787 0 0 0
Dr 394 0 0
At STD N 00E0FFFF
Ne 0 ""
Po 2000 -3000
$EndPAD
$PAD
Sh "3" C 787 787 0 0 0
Dr 394 0 0
At STD N 00E0FFFF
Ne 0 ""
Po -2000 -3000
$EndPAD
$SHAPE3D
Na "connectors/Cinch/rca2_red.wrl"
Sc 1 1 1
Of 0 0 0
Ro 0 0 0
$EndSHAPE3D
$EndMODULE RCA2
$MODULE RCA3
Po 0 0 0 15 4FD79D89 00000000 ~~
Li RCA3
Sc 0
AR 
Op 0 0 0
T0 0 -3500 392 392 0 77 N V 21 N "RCA3"
T1 0 3750 393 393 900 78 N I 21 N "Value"
DS -1500 1500 -1500 5500 150 21
DS -1500 5500 -1000 6000 150 21
DS -1000 6000 1000 6000 150 21
DS 1000 6000 1500 5500 150 21
DS 1500 5500 1500 1500 150 21
DS -2000 1000 -2000 -2000 150 21
DS -2000 -2000 -2000 -3000 150 21
DS -2000 -3000 2000 -3000 150 21
DS 2000 -3000 2000 1500 150 21
DS 2000 1500 -2000 1500 150 21
DS -2000 1500 -2000 1000 150 21
$PAD
Sh "b" O 1181 1574 0 0 0
Dr 709 0 0
At STD N 00E0FFFF
Ne 0 ""
Po -2000 500
$EndPAD
$PAD
Sh "a" O 1181 1574 0 0 0
Dr 709 0 0
At STD N 00E0FFFF
Ne 0 ""
Po 2000 500
$EndPAD
$PAD
Sh "1" C 787 787 0 0 0
Dr 394 0 0
At STD N 00E0FFFF
Ne 0 ""
Po 0 500
$EndPAD
$PAD
Sh "2" C 787 787 0 0 0
Dr 394 0 0
At STD N 00E0FFFF
Ne 0 ""
Po -2000 -2500
$EndPAD
$SHAPE3D
Na "connectors/Cinch/rca3_red.wrl"
Sc 1 1 1
Of 0 0 0
Ro 0 0 0
$EndSHAPE3D
$EndMODULE RCA3
$EndLIBRARY
