PCBNEW-LibModule-V1  15.10.2012 16:36:47
# encoding utf-8
Units deci-mils
$INDEX
DO1
DisTO220-10H
DisTO220-18H
HSTO220-10V
HSTO220-18V
V4330D
V4330K
V4330N
V5224C
V71101
V71101-T
V71102
V71102-T
V71103
V71103-T
V7131
V7142
V7143
$EndINDEX
$MODULE DO1
Po 0 0 0 15 507C1780 00000000 ~~
Li DO1
Sc 0
AR 
Op 0 0 0
T0 0 1772 392 392 0 77 N V 21 N "DO1"
T1 0 2657 392 392 0 77 N I 21 N "Value"
DS 2362 5197 2362 4409 393 21
DS 2362 3543 2362 2835 393 21
DS 2362 1969 2362 1181 393 21
DS 2362 315 2362 -394 393 21
DS 2362 -1280 2362 -2067 393 21
DS -2362 -1280 -2362 -2067 393 21
DS -2362 295 -2362 -394 393 21
DS -2362 1969 -2362 1181 393 21
DS -2362 3543 -2362 2854 393 21
DS -2362 5217 -2362 4429 393 21
DS 2110 5315 2620 5315 196 21
DS 2620 5315 2620 -2195 196 21
DS 2620 -2195 2110 -2195 196 21
DS 2110 -2195 2110 5315 196 21
DS -2610 -1135 -2610 -2195 196 21
DS -2100 -2195 -2100 -1135 196 21
DS -2100 -1135 -2610 -1135 196 21
DS -2610 475 -2610 -585 196 21
DS -2610 -585 -2100 -585 196 21
DS -2100 -585 -2100 475 196 21
DS -2100 475 -2610 475 196 21
DS -2610 2095 -2610 1025 196 21
DS -2610 1025 -2100 1025 196 21
DS -2100 1025 -2100 2095 196 21
DS -2100 2095 -2610 2095 196 21
DS -2610 3705 -2610 2645 196 21
DS -2610 2645 -2100 2645 196 21
DS -2100 2645 -2100 3705 196 21
DS -2100 3705 -2610 3705 196 21
DS -2610 5315 -2610 4255 196 21
DS -2610 4255 -2100 4255 196 21
DS -2100 4255 -2100 5315 196 21
DS -2100 5315 -2610 5315 196 21
DS -2100 5315 -2100 -2195 196 21
DS -2100 -2195 -2610 -2195 196 21
DS -2610 -2195 -2610 5315 196 21
DC 0 6 1140 65 78 25
DC 0 5 730 5 196 25
DS -2610 5315 -2610 -2195 196 21
DS -2610 -2194 2620 -2194 196 21
DS 2620 -2195 2620 5315 196 21
DS 2620 5315 2110 5315 196 21
DS 2110 5315 2110 3785 196 21
DS 2109 3785 -2100 3785 196 21
DS -2100 3785 -2100 5315 196 21
DC 0 5 730 5 196 21
DS 2110 -1135 2110 -2195 196 21
DS 2110 -2195 2620 -2195 196 21
DS 2620 -2195 2620 -1135 196 21
DS 2620 -1135 2110 -1135 196 21
DS 2110 475 2110 -585 196 21
DS 2110 -585 2620 -585 196 21
DS 2620 -585 2620 475 196 21
DS 2620 475 2110 475 196 21
DS 2110 2095 2110 1025 196 21
DS 2110 1025 2620 1025 196 21
DS 2620 1025 2620 2095 196 21
DS 2620 2095 2110 2095 196 21
DS 2110 3705 2110 2645 196 21
DS 2110 2645 2620 2645 196 21
DS 2620 2645 2620 3705 196 21
DS 2620 3705 2110 3705 196 21
DS 2110 5315 2110 4255 196 21
DS 2110 4255 2620 4255 196 21
DS 2620 4255 2620 5315 196 21
DS 2620 5315 2110 5315 196 21
$EndMODULE DO1
$MODULE DisTO220-10H
Po 0 0 0 15 4FD0EAB5 00000000 ~~
Li DisTO220-10H
Sc 0
AR 
Op 0 0 0
T0 0 -5500 393 393 0 78 N I 21 N "DisTO220-10H"
T1 0 -4500 393 393 0 78 N I 21 N "Value"
DS 4500 8000 4500 -6500 250 21
DS 7500 -6500 7500 8000 250 21
DS 7500 8000 4000 8000 250 21
DS 4000 8000 4000 6000 250 21
DC 0 0 0 2000 250 21
DS -5000 8000 -4000 8000 250 21
DS -4000 8000 -4000 6000 250 21
DS -4000 6000 4000 6000 250 21
DS -7500 8000 -5000 8000 250 21
DS -4500 8000 -4500 -6500 250 21
DS 7500 -6500 -7500 -6500 250 21
DS -7500 -6500 -7500 8000 250 21
$PAD
Sh "1" C 2500 2500 0 0 0
Dr 320 0 0
At STD N 00E0FFFF
Ne 0 ""
Po 0 0
$EndPAD
$EndMODULE DisTO220-10H
$MODULE DisTO220-18H
Po 0 0 0 15 4FD0EAF1 00000000 ~~
Li DisTO220-18H
Sc 0
AR 
Op 0 0 0
T0 0 3500 393 393 0 78 N I 21 N "DisTO220-18H"
T1 0 4300 392 392 0 77 N I 21 N "Value"
DS 2500 7500 2500 -3000 250 21
DS -2500 7500 -2500 -3000 250 21
DS -3000 7500 -3000 -3000 250 21
DS -3000 -3000 3000 -3000 250 21
DS 3000 -3000 3000 7500 250 21
DS 2000 7500 3000 7500 250 21
DS -3000 7500 -2000 7500 250 21
DS -2000 5500 2000 5500 250 21
DS 2000 5500 2000 7500 250 21
DC 0 0 0 2000 250 21
DS -2000 7500 -2000 5500 250 21
$PAD
Sh "1" C 2500 2500 0 0 0
Dr 320 0 0
At STD N 00E0FFFF
Ne 0 ""
Po 0 0
$EndPAD
$EndMODULE DisTO220-18H
$MODULE HSTO220-10V
Po 0 0 0 15 4FD0EDE0 00000000 ~~
Li HSTO220-10V
Sc 0
AR 
Op 0 0 0
T0 0 -5500 393 393 0 78 N I 21 N "HS TO220-10V"
T1 0 -3900 393 393 0 78 N I 21 N "Value"
DS -7500 1000 -7500 1750 250 21
DS -5250 -750 -5250 1000 250 21
DS -5250 -3250 -5250 -1500 250 21
DS -5250 -5750 -5250 -4000 250 21
DS 7500 1000 7500 1750 250 21
DS 5250 -750 5250 1000 250 21
DS 5250 -3250 5250 -1500 250 21
DS 7500 1000 5250 1000 250 21
DS 5250 -750 7500 -750 250 21
DS 7500 -750 7500 -1500 250 21
DS 7500 -1500 5250 -1500 250 21
DS 5250 -3250 7500 -3250 250 21
DS 7500 -3250 7500 -4000 250 21
DS 7500 -4000 5250 -4000 250 21
DS 5250 -4000 5250 -5750 250 21
DS 5250 -5750 7500 -5750 250 21
DS 7500 -5750 7500 -6500 250 21
DS -7500 -4000 -7500 -3250 250 21
DS -7500 -3250 -5250 -3250 250 21
DS -5250 -1500 -7500 -1500 250 21
DS -7500 -1500 -7500 -750 250 21
DS -7500 -750 -5250 -750 250 21
DS -5250 1000 -7500 1000 250 21
DS -7500 1750 -4500 1750 250 21
DS -7500 -6500 -7500 -5750 250 21
DS -7500 -5750 -5250 -5750 250 21
DS -7500 -4000 -5250 -4000 250 21
DS 4500 -6500 4500 1750 250 21
DS -4500 -6500 -4500 1750 250 21
DS 4000 -4750 4500 -4750 250 21
DS -4000 -4750 -4500 -4750 250 21
DS 4500 1750 7500 1750 250 21
DS -4000 -4750 4000 -4750 250 21
DS 7500 -6500 -7500 -6500 250 21
$EndMODULE HSTO220-10V
$MODULE HSTO220-18V
Po 0 0 0 15 4FD0EE1B 00000000 ~~
Li HSTO220-18V
Sc 0
AR 
Op 0 0 0
T0 0 -3500 393 393 0 47 N I 21 N "HS TO220-18V"
T1 0 -1600 393 393 0 78 N I 21 N "Value"
DS 2250 5000 3000 5000 250 21
DS -2250 -2250 2250 -2250 250 21
DS -3000 5000 -2250 5000 250 21
DS -2250 5000 -2250 -2250 250 21
DS 2250 5000 2250 -2250 250 21
DS 3000 -3000 3000 5000 250 21
DS -3000 -3000 -3000 5000 250 21
DS -3000 -3000 3000 -3000 250 21
$EndMODULE HSTO220-18V
$MODULE V4330D
Po 0 0 0 15 507C1770 00000000 ~~
Li V4330D
Sc 0
AR 
Op 0 0 0
T0 0 -6004 392 392 0 77 N V 21 N "V4330D"
T1 0 -3051 392 392 0 77 N I 21 N "Value"
DA -1182 -689 -1182 -1476 -900 118 21
DA -1182 -689 -1970 -689 -900 118 21
DA 1181 -689 1969 -689 900 118 21
DA 1181 -689 1181 -1476 900 118 21
DS -1181 -1476 1181 -1476 118 21
DS -1181 98 1181 98 118 21
DS 5031 7776 5701 7776 30 21
DS 5701 7776 5701 -6984 30 21
DS 5701 -6984 5031 -6984 30 21
DS 5031 -6984 5031 7776 30 21
DS 3691 7776 4361 7776 30 21
DS 4361 7776 4361 -6984 30 21
DS 4361 -6984 3691 -6984 30 21
DS 3691 -6984 3691 7776 30 21
DS 2361 7776 3021 7776 30 21
DS 3021 7776 3021 -6984 30 21
DS 3021 -6984 2361 -6984 30 21
DS 2361 -6984 2361 7776 30 21
DS -3039 7776 -2369 7776 30 21
DS -2369 7776 -2369 -6984 30 21
DS -2369 -6984 -3039 -6984 30 21
DS -3039 -6984 -3039 7776 30 21
DS -4379 7776 -3709 7776 30 21
DS -3709 7776 -3709 -6984 30 21
DS -3709 -6984 -4379 -6984 30 21
DS -4379 -6984 -4379 7776 30 21
DS -5709 7776 -5049 7776 30 21
DS -5049 7776 -5049 -6984 30 21
DS -5049 -6984 -5709 -6984 30 21
DS -5709 -6984 -5709 7776 30 21
DC -9 -4444 621 -4444 110 21
DS -5679 7776 5701 7776 110 21
DS 5701 7776 5701 -6984 110 21
DS 5701 -6984 -5709 -6984 110 21
DS -5709 -6984 -5709 7776 110 21
DS -5709 7776 -5679 7776 110 21
DC -9 5166 621 5166 110 21
$EndMODULE V4330D
$MODULE V4330K
Po 0 0 0 15 507C1821 00000000 ~~
Li V4330K
Sc 0
AR 
Op 0 0 0
T0 0 -6004 392 392 0 77 N V 21 N "V4330K"
T1 0 -3051 392 392 0 77 N I 21 N "Value"
DS 5031 7776 5701 7776 30 21
DS 5701 7776 5701 -6984 30 21
DS 5701 -6984 5031 -6984 30 21
DS 5031 -6984 5031 7776 30 21
DS 3691 7776 4361 7776 30 21
DS 4361 7776 4361 -6984 30 21
DS 4361 -6984 3691 -6984 30 21
DS 3691 -6984 3691 7776 30 21
DS 2361 7776 3021 7776 30 21
DS 3021 7776 3021 -6984 30 21
DS 3021 -6984 2361 -6984 30 21
DS 2361 -6984 2361 7776 30 21
DS -3039 7776 -2369 7776 30 21
DS -2369 7776 -2369 -6984 30 21
DS -2369 -6984 -3039 -6984 30 21
DS -3039 -6984 -3039 7776 30 21
DS -4379 7776 -3709 7776 30 21
DS -3709 7776 -3709 -6984 30 21
DS -3709 -6984 -4379 -6984 30 21
DS -4379 -6984 -4379 7776 30 21
DS -5709 7776 -5049 7776 30 21
DS -5049 7776 -5049 -6984 30 21
DS -5049 -6984 -5709 -6984 30 21
DS -5709 -6984 -5709 7776 30 21
DC -9 -4444 621 -4444 110 21
DS -5679 7776 5701 7776 110 21
DS 5701 7776 5701 -6984 110 21
DS 5701 -6984 -5709 -6984 110 21
DS -5709 -6984 -5709 7776 110 21
DS -5709 7776 -5679 7776 110 21
$EndMODULE V4330K
$MODULE V4330N
Po 0 0 0 15 507C1791 00000000 ~~
Li V4330N
Sc 0
AR 
Op 0 0 0
T0 0 -984 392 392 0 77 N V 21 N "V4330N"
T1 0 0 392 392 0 77 N I 21 N "Value"
DS -5679 3937 5701 3937 110 21
DS 5701 3937 5701 -3933 110 21
DS 5701 -3933 -5709 -3933 110 21
DS -5709 -3933 -5709 3937 110 21
DS -5709 3937 -5679 3937 110 21
DS 5031 3937 5701 3937 30 21
DS 5701 3937 5701 -3933 30 21
DS 5701 -3933 5031 -3933 30 21
DS 5031 -3933 5031 3937 30 21
DS 3691 3937 4361 3937 30 21
DS 4361 3937 4361 -3933 30 21
DS 4361 -3933 3691 -3933 30 21
DS 3691 -3933 3691 3937 30 21
DS 2361 3937 2361 -3933 30 21
DS 2361 -3933 3021 -3933 30 21
DS 3021 -3933 3021 3937 30 21
DS 3021 3937 2361 3937 30 21
DS -3039 3937 -3039 -3933 30 21
DS -3039 -3933 -2369 -3933 30 21
DS -2369 -3933 -2369 3937 30 21
DS -2369 3937 -3039 3937 30 21
DS -4379 3937 -3709 3937 30 21
DS -3709 3937 -3709 -3933 30 21
DS -3709 -3933 -4379 -3933 30 21
DS -4379 -3933 -4379 3937 30 21
DS -5709 3937 -5049 3937 30 21
DS -5049 3937 -5049 -3933 30 21
DS -5049 -3933 -5709 -3933 30 21
DS -5709 -3933 -5709 3937 30 21
DC -9 -2733 621 -2733 110 21
$EndMODULE V4330N
$MODULE V5224C
Po 0 0 0 15 507C17B1 00000000 ~~
Li V5224C
Sc 0
AR 
Op 0 0 0
T0 0 -2657 393 393 0 78 N V 21 N "V5224C"
T1 0 -1673 393 393 0 78 N I 21 N "Value"
DS 2160 5322 2160 -9048 390 21
DS -2170 -9048 -2170 5322 390 21
DC -9060 -1868 -8370 -1868 110 21
DS 10430 5322 10430 -9048 390 21
DS -10630 5512 -10630 -9248 110 21
DS -10630 -9248 10620 -9248 110 21
DS 10620 -9248 10620 5512 110 21
DS 10620 5512 -10630 5512 110 21
DC -10 2 680 2 110 21
DC 9050 -1868 9740 -1868 110 21
DS 7670 5322 7670 -9048 390 21
DS -7680 -9048 -7680 5322 390 21
DS -4930 -9048 -4930 5322 390 21
DS 4920 5322 4920 -9048 390 21
DS -10440 -9048 -10440 5322 390 21
$EndMODULE V5224C
$MODULE V71101
Po 0 0 0 15 507C190D 00000000 ~~
Li V71101
Sc 0
AR 
Op 0 0 0
T0 0 0 392 392 0 77 N V 21 N "V71101"
T1 0 984 392 392 0 77 N I 21 N "Value"
DS 2161 -390 2161 -1370 30 21
DS 2161 -1370 2551 -1370 30 21
DS 2551 -1370 2551 -390 30 21
DS 2551 -390 2161 -390 30 21
DS 2161 1380 2161 400 30 21
DS 2161 400 2551 400 30 21
DS 2551 400 2551 1380 30 21
DS 2551 1380 2161 1380 30 21
DS 2161 3150 2551 3150 30 21
DS 2551 3150 2551 2170 30 21
DS 2551 2170 2161 2170 30 21
DS 2161 2170 2161 3150 30 21
DS -2559 -2160 -2559 -3140 30 21
DS -2559 -3140 -2169 -3140 30 21
DS -2169 -3140 -2169 -2160 30 21
DS -2169 -2160 -2559 -2160 30 21
DC -9 -2040 781 -1850 110 21
DS -2559 -390 -2559 -1370 30 21
DS -2559 -1370 -2169 -1370 30 21
DS -2169 -1370 -2169 -390 30 21
DS -2169 -390 -2559 -390 30 21
DS -2559 1380 -2559 400 30 21
DS -2559 400 -2169 400 30 21
DS -2169 400 -2169 1380 30 21
DS -2169 1380 -2559 1380 30 21
DS -2559 3150 -2559 2170 30 21
DS -2559 2170 -2169 2170 30 21
DS -2169 2170 -2169 3150 30 21
DS -2169 3150 -2559 3150 30 21
DS -2169 3150 2161 3150 110 21
DS 2161 3150 2161 -3540 110 21
DS 2161 -3540 -2169 -3540 110 21
DS -2169 -3540 -2169 3150 110 21
DS 2161 -2160 2161 -3140 30 21
DS 2161 -3140 2551 -3140 30 21
DS 2551 -3140 2551 -2160 30 21
DS 2551 -2160 2161 -2160 30 21
$EndMODULE V71101
$MODULE V71101-T
Po 0 0 0 15 507C1990 00000000 ~~
Li V71101-T
Sc 0
AR 
Op 0 0 0
T0 -2953 0 392 392 900 77 N V 21 N "V71101-T"
T1 2953 0 392 392 900 77 N I 21 N "Value"
DS 781 1382 781 1772 30 21
DS -789 1382 -789 1772 30 21
DS -2559 1772 2551 1772 110 21
DS 2551 1772 2551 -1768 110 21
DS 2551 -1768 2161 -1768 110 21
DS 2161 -1768 2161 1382 110 21
DS 2161 1382 -2169 1382 110 21
DS -2169 1382 -2169 -1768 110 21
DS -2169 -1768 -2559 -1768 110 21
DS -2559 -1768 -2559 1772 110 21
$EndMODULE V71101-T
$MODULE V71102
Po 0 0 0 15 507C1A7A 00000000 ~~
Li V71102
Sc 0
AR 
Op 0 0 0
T0 0 -787 392 392 0 77 N V 21 N "V71102"
T1 0 0 392 392 0 77 N I 21 N "Value"
DS 2161 323 2551 323 30 21
DS 2551 323 2551 -667 30 21
DS 2551 -667 2161 -667 30 21
DS 2161 -667 2161 323 30 21
DS 2161 1933 2551 1933 30 21
DS 2551 1933 2551 953 30 21
DS 2551 953 2161 953 30 21
DS 2161 953 2161 1933 30 21
DS 2161 3543 2551 3543 30 21
DS 2551 3543 2551 2563 30 21
DS 2551 2563 2161 2563 30 21
DS 2161 2563 2161 3543 30 21
DS -2559 -2907 -2169 -2907 30 21
DS -2169 -2907 -2169 -3897 30 21
DS -2169 -3897 -2559 -3897 30 21
DS -2559 -3897 -2559 -2907 30 21
DS -2559 -1297 -2169 -1297 30 21
DS -2169 -1297 -2169 -2277 30 21
DS -2169 -2277 -2559 -2277 30 21
DS -2559 -2277 -2559 -1297 30 21
DS -2559 323 -2169 323 30 21
DS -2169 323 -2169 -667 30 21
DS -2169 -667 -2559 -667 30 21
DS -2559 -667 -2559 323 30 21
DS -2559 1933 -2169 1933 30 21
DS -2169 1933 -2169 953 30 21
DS -2169 953 -2559 953 30 21
DS -2559 953 -2559 1933 30 21
DS -2559 3543 -2169 3543 30 21
DS -2169 3543 -2169 2563 30 21
DS -2169 2563 -2559 2563 30 21
DS -2559 2563 -2559 3543 30 21
DS -2559 3543 -2559 -3927 110 21
DS -2559 -3927 2551 -3927 110 21
DS 2551 -3927 2551 3543 110 21
DS 2551 3543 -2559 3543 110 21
DC -9 -2437 781 -2437 110 21
DS 2161 -2907 2551 -2907 30 21
DS 2551 -2907 2551 -3897 30 21
DS 2551 -3897 2161 -3897 30 21
DS 2161 -3897 2161 -2907 30 21
DS 2161 -1297 2551 -1297 30 21
DS 2551 -1297 2551 -2277 30 21
DS 2551 -2277 2161 -2277 30 21
DS 2161 -2277 2161 -1297 30 21
$EndMODULE V71102
$MODULE V71102-T
Po 0 0 0 15 507C1AE0 00000000 ~~
Li V71102-T
Sc 0
AR 
Op 0 0 0
T0 -2952 0 392 392 900 77 N V 21 N "V71102-T"
T1 3150 0 392 392 900 77 N I 21 N "Value"
DS 781 1972 781 2362 30 21
DS -789 2362 -789 1972 30 21
DS -2559 2362 2551 2362 110 21
DS 2551 2362 2551 -2358 110 21
DS 2551 -2358 2161 -2358 110 21
DS 2161 -2358 2161 1972 110 21
DS 2161 1972 -2169 1972 110 21
DS -2169 1972 -2169 -2358 110 21
DS -2169 -2358 -2559 -2358 110 21
DS -2559 -2358 -2559 2362 110 21
$EndMODULE V71102-T
$MODULE V71103
Po 0 0 0 15 507C1BA5 00000000 ~~
Li V71103
Sc 0
AR 
Op 0 0 0
T0 0 -1772 392 392 0 77 N V 21 N "V71103"
T1 0 1575 392 392 0 77 N I 21 N "Value"
DS 2753 5118 3933 5118 30 21
DS 3933 5118 3933 4138 30 21
DS 3933 4138 2753 4138 30 21
DS 2753 4138 2753 5118 30 21
DS 2753 -1802 3933 -1802 30 21
DS 3933 -1802 3933 -2752 30 21
DS 3933 -2752 2753 -2752 30 21
DS 2753 -2752 2753 -1802 30 21
DS 2753 -72 2753 -1062 30 21
DS 2753 -1062 3933 -1062 30 21
DS 3933 -1062 3933 -72 30 21
DS 3933 -72 2753 -72 30 21
DS 2753 1658 3933 1658 30 21
DS 3933 1658 3933 678 30 21
DS 3933 678 2753 678 30 21
DS 2753 678 2753 1658 30 21
DS 2753 3388 3933 3388 30 21
DS 3933 3388 3933 2408 30 21
DS 3933 2408 2753 2408 30 21
DS 2753 2408 2753 3388 30 21
DS -3937 5118 -2757 5118 30 21
DS -2757 5118 -2757 4138 30 21
DS -2757 4138 -3937 4138 30 21
DS -3937 4138 -3937 5118 30 21
DS -3937 -1802 -2757 -1802 30 21
DS -2757 -1802 -2757 -2752 30 21
DS -2757 -2752 -3937 -2752 30 21
DS -3937 -2752 -3937 -1802 30 21
DS -3937 -72 -3937 -1062 30 21
DS -3937 -1062 -2757 -1062 30 21
DS -2757 -1062 -2757 -72 30 21
DS -2757 -72 -3937 -72 30 21
DS -3937 1658 -2757 1658 30 21
DS -2757 1658 -2757 678 30 21
DS -2757 678 -3937 678 30 21
DS -3937 678 -3937 1658 30 21
DS -3937 3388 -2757 3388 30 21
DS -2757 3388 -2757 2408 30 21
DS -2757 2408 -3937 2408 30 21
DS -3937 2408 -3937 3388 30 21
DS -3937 5118 3933 5118 110 21
DS 3933 5118 3933 -2752 110 21
DS 3933 -2752 -3937 -2752 110 21
DS -3937 -2752 -3937 5118 110 21
DC -7 8 783 8 110 21
$EndMODULE V71103
$MODULE V71103-T
Po 0 0 0 15 507C1C1E 00000000 ~~
Li V71103-T
Sc 0
AR 
Op 0 0 0
T0 -4330 0 392 392 900 77 N V 21 N "V71103-T"
T1 4331 0 392 392 900 77 N I 21 N "Value"
DS 783 2953 783 1773 30 21
DS -797 2953 -797 1773 30 21
DS -3937 2953 3933 2953 110 21
DS 3933 2953 3933 -2947 110 21
DS 3933 -2947 2753 -2947 110 21
DS 2753 -2947 2753 1773 110 21
DS 2753 1773 -2757 1773 110 21
DS -2757 1773 -2757 -2947 110 21
DS -2757 -2947 -3937 -2947 110 21
DS -3937 -2947 -3937 2953 110 21
$EndMODULE V71103-T
$MODULE V7131
Po 0 0 0 15 507C17C1 00000000 ~~
Li V7131
Sc 0
AR 
Op 0 0 0
T0 0 0 392 392 0 77 N V 21 N "V7131"
T1 0 2756 392 392 0 77 N I 21 N "Value"
DC 3139 9 3539 -391 0 25
DC -3151 9 -2761 -391 0 25
DC 3139 9 3539 -391 70 21
DC -3151 9 -2761 -391 70 21
DS 5509 -3541 5509 6299 70 21
DS -5521 6299 -5521 -3541 70 21
DS -8661 6299 -8661 -3541 70 21
DS -8661 -3541 8659 -3541 70 21
DS 8659 -3541 8659 6299 70 21
DS 8659 6299 -8661 6299 70 21
$EndMODULE V7131
$MODULE V7142
Po 0 0 0 15 507C1DB3 00000000 ~~
Li V7142
Sc 0
AR 
Op 0 0 0
T0 -4920 0 392 392 900 77 N V 21 N "V7142"
T1 4921 0 392 392 900 77 N I 21 N "Value"
DA 0 0 197 -197 900 117 21
DA 0 0 -197 -197 900 117 21
DA 0 0 -197 197 900 117 21
DS -4528 2165 -4528 -4125 117 21
DS -4528 -4125 -4018 -4125 117 21
DS -4018 -4125 -4018 -1375 117 21
DS -4018 -1375 4012 -1375 117 21
DS 4012 -1375 4012 -4125 117 21
DS 4012 -4125 4522 -4125 117 21
DS 4522 -4125 4522 2165 117 21
DS 4522 2165 4012 2165 117 21
DS 4012 2165 4012 -585 117 21
DS 4012 -585 2832 -585 117 21
DS 2832 -585 2832 2165 117 21
DS 2832 2165 2322 2165 117 21
DS 2322 2165 2322 -585 117 21
DS 2322 -585 1132 -585 117 21
DS 1132 -585 1132 2165 117 21
DS 1132 2165 622 2165 117 21
DS 622 2165 622 595 117 21
DS 622 595 192 595 117 21
DS 192 595 192 205 117 21
DS -198 205 -198 595 117 21
DS -198 595 -638 595 117 21
DS -638 595 -638 2165 117 21
DS -638 2165 -1148 2165 117 21
DS -1148 2165 -1148 -585 117 21
DS -1148 -585 -2328 -585 117 21
DS -2328 -585 -2328 2165 117 21
DS -2328 2165 -2838 2165 117 21
DS -2838 2165 -2838 -585 117 21
DS -2838 -585 -4018 -585 117 21
DS -4018 -585 -4018 2165 117 21
DS -4018 2165 -4528 2165 117 21
$PAD
Sh "1" O 3937 2362 0 0 0
Dr 1000 0 0
At STD N 00E0FFFF
Ne 0 ""
Po 0 -39
$EndPAD
$EndMODULE V7142
$MODULE V7143
Po 0 0 0 15 507C1F79 00000000 ~~
Li V7143
Sc 0
AR 
Op 0 0 0
T0 -7283 0 392 392 900 77 N V 21 N "V7143"
T1 0 0 392 392 0 77 N I 21 N "Value"
DS -3160 -388 -3160 -388 117 26
DS -3160 -388 -3160 -388 117 21
DS -3160 -388 -3160 -2358 117 21
DS -3160 -2358 -3550 -2358 117 21
DS -3550 -2358 -3550 -778 117 21
DS -3550 -778 -4530 -2358 117 21
DS -4530 -2358 -4730 -2358 117 21
DS -4730 -2358 -4930 -2158 117 21
DS -4930 -2158 -4530 -978 117 21
DS -4530 -978 -6500 -2358 117 21
DS -6500 -2358 -6890 -2358 117 21
DS -6890 -2358 -6890 -1968 117 21
DS -6890 -1968 -5710 -978 117 21
DS -5710 -978 -6700 -1178 117 21
DS -6700 -1178 -6890 -978 117 21
DS -6890 -978 -6700 -778 117 21
DS -6700 -778 -5710 -388 117 21
DS -5710 402 -6700 792 117 21
DS -6700 792 -6890 992 117 21
DS -6890 992 -6700 1182 117 21
DS -6700 1182 -5710 992 117 21
DS -5710 992 -6890 1932 117 21
DS -6890 1932 -6890 2362 117 21
DS -6890 2362 -6500 2362 117 21
DS -6500 2362 -4530 992 117 21
DS -4530 992 -4930 2172 117 21
DS -4930 2172 -4730 2362 117 21
DS -4730 2362 -4530 2362 117 21
DS -4530 2362 -3550 792 117 21
DS -3550 792 -3550 2362 117 21
DS -3550 2362 -3160 2362 117 21
DS -3160 2362 -3160 402 117 21
DS -3160 402 3140 402 117 21
DS 3140 402 3140 2362 117 21
DS 3140 2362 3540 2362 117 21
DS 3540 2362 3540 792 117 21
DS 3540 792 4520 2362 117 21
DS 4520 2362 4720 2362 117 21
DS 4720 2362 4920 2172 117 21
DS 4920 2172 4520 992 117 21
DS 4520 992 6490 2362 117 21
DS 6490 2362 6880 2362 117 21
DS 6880 2362 6880 1972 117 21
DS 6880 1972 5700 992 117 21
DS 5700 992 6690 1182 117 21
DS 6690 1182 6880 992 117 21
DS 6880 992 6690 792 117 21
DS 6690 792 5700 402 117 21
DS 5700 -388 6690 -778 117 21
DS 6690 -778 6880 -978 117 21
DS 6880 -978 6690 -1178 117 21
DS 6690 -1178 5700 -978 117 21
DS 5700 -978 6880 -1968 117 21
DS 6880 -1968 6880 -2358 117 21
DS 6880 -2358 6490 -2358 117 21
DS 6490 -2358 4520 -978 117 21
DS 4520 -978 4920 -2158 117 21
DS 4920 -2158 4720 -2358 117 21
DS 4720 -2358 4520 -2358 117 21
DS 4520 -2358 3540 -778 117 21
DS 3540 -778 3540 -2358 117 21
DS 3540 -2358 3140 -2358 117 21
DS 3140 -2358 3140 -388 117 21
DS 3140 -388 -3160 -388 117 21
$PAD
Sh "1" C 1968 1968 0 0 0
Dr 1000 0 0
At STD N 00E0FFFF
Ne 0 ""
Po -5400 3
$EndPAD
$PAD
Sh "2" C 1968 1968 0 0 0
Dr 1000 0 0
At STD N 00E0FFFF
Ne 0 ""
Po 5389 3
$EndPAD
$EndMODULE V7143
$EndLIBRARY
