PCBNEW-LibModule-V1  Ne 24. červen 2012, 23:22:45 CEST
# encoding utf-8
Units deci-mils
$INDEX

D2PAK-5
D2PAK-5ns
D2PAK123
DO213AA
DO213AB
DO213AC
DO214AA
DO214AB
DO214AC
DPAK
DPAK123
DPAK5
DPAKBCE
DPAKGDS
DPAK_123
SC_79
SDB_2
SMB
SOD123
SOD80
SOD87
SOD_323
SOT194
TO261AA/SOT223
TO263AA
TO263AB
$EndINDEX
$MODULE 
Po 0 0 0 15 4EB2CF01 4EB2CED3 ~~
Li 
Sc 4EB2CED3
AR 
Op 0 0 0
T0 0 -6750 315 315 0 59 N V 21 N "D2PAK123"
T1 0 -3500 315 315 0 59 N I 21 N "Val**"
DS 750 -2250 1250 -2250 80 26
DS 1250 -2250 1250 -1000 80 26
DS 1250 -1000 1120 -1000 80 26
DS 1120 -1000 1120 380 80 26
DS 1120 380 870 380 80 26
DS 870 380 870 -1000 80 26
DS 870 -1000 750 -1000 80 26
DS 750 -1000 750 -2250 80 26
DS -250 -2250 -250 -1750 80 26
DS -250 -1750 250 -1750 80 26
DS 250 -1750 250 -2250 80 26
DS 250 -2250 -250 -2250 80 26
DS -1250 -2250 -1250 -1000 80 26
DS -1250 -1000 -1130 -1000 80 26
DS -1130 -1000 -1130 380 80 26
DS -1130 380 -880 380 80 26
DS -880 380 -880 -1000 80 26
DS -880 -1000 -750 -1000 80 26
DS -750 -1000 -750 -2250 80 26
DS -750 -2250 -1250 -2250 80 26
DS -1750 -6250 -2250 -6000 80 26
DS -2250 -6000 -2250 -2250 80 26
DS -2250 -2250 2250 -2250 80 26
DS 2250 -2250 2250 -6000 80 26
DS 2250 -6000 1750 -6250 80 26
DS 1750 -6250 -1750 -6250 80 26
DS -2250 -5750 2250 -5750 80 26
DS -2250 -5750 2250 -5750 80 21
DS -250 -2250 -250 -1750 80 21
DS -250 -1750 250 -1750 80 21
DS 250 -1750 250 -2250 80 21
DS 250 -2250 -250 -2250 80 21
DS 750 -2250 750 -1000 80 21
DS 750 -1000 1250 -1000 80 21
DS 1250 -1000 1250 -2250 80 21
DS 1250 -2250 750 -2250 80 21
DS -1250 -2250 -750 -2250 80 21
DS -750 -2250 -750 -1000 80 21
DS -750 -1000 -1250 -1000 80 21
DS -1250 -1000 -1250 -2250 80 21
DS -1750 -6250 -2250 -6000 80 21
DS -2250 -6000 -2250 -2250 80 21
DS -2250 -2250 2250 -2250 80 21
DS 2250 -2250 2250 -6000 80 21
DS 2250 -6000 1750 -6250 80 21
DS 1750 -6250 -1750 -6250 80 21
$PAD
Sh "1" R 820 1500 0 0 0
Dr 0 0 0
At SMD N 00888000
Ne 0 ""
Po -1000 0
$EndPAD
$PAD
Sh "2" R 4500 3500 0 0 0
Dr 0 0 0
At SMD N 00888000
Ne 0 ""
Po 0 -4500
$EndPAD
$PAD
Sh "3" R 820 1500 0 0 0
Dr 0 0 0
At SMD N 00888000
Ne 0 ""
Po 1000 0
$EndPAD
$EndMODULE 
$MODULE D2PAK-5
Po 0 0 0 15 4F748BD2 00000000 ~~
Li D2PAK-5
Cd TO-263
Kw TO-263
Sc 0
AR /4E71F12C/4E7C5FAE
Op 0 0 0
At SMD
T0 0 -3543 315 315 0 59 N V 21 N "D2PAK-5"
T1 0 0 315 315 0 59 N I 21 N "Value"
DS 2264 -3150 2264 1181 79 21
DS -2264 1181 -2264 -3150 79 21
DS 1575 1181 2264 1181 79 21
DS 2264 -3150 -2264 -3150 79 21
DS -2264 1181 -1575 1181 79 21
DS -1530 2600 -1150 2600 26 21
DS -1150 2600 -1150 1750 26 21
DS -1530 1750 -1150 1750 26 21
DS -1530 2600 -1530 1750 26 21
DS -1530 1760 -1150 1760 26 21
DS -1150 1760 -1150 1100 26 21
DS -1530 1100 -1150 1100 26 21
DS -1530 1760 -1530 1100 26 21
DS -859 2600 -480 2600 26 21
DS -480 2600 -480 1750 26 21
DS -859 1750 -480 1750 26 21
DS -859 2600 -859 1750 26 21
DS -190 2600 190 2600 26 21
DS 190 2600 190 1750 26 21
DS -190 1750 190 1750 26 21
DS -190 2600 -190 1750 26 21
DS 480 2600 859 2600 26 21
DS 859 2600 859 1750 26 21
DS 480 1750 859 1750 26 21
DS 480 2600 480 1750 26 21
DS 1150 2600 1530 2600 26 21
DS 1530 2600 1530 1750 26 21
DS 1150 1750 1530 1750 26 21
DS 1150 2600 1150 1750 26 21
DS -859 1760 -480 1760 26 21
DS -480 1760 -480 1100 26 21
DS -859 1100 -480 1100 26 21
DS -859 1760 -859 1100 26 21
DS -190 1760 190 1760 26 21
DS 190 1760 190 1100 26 21
DS -190 1100 190 1100 26 21
DS -190 1760 -190 1100 26 21
DS 480 1760 859 1760 26 21
DS 859 1760 859 1100 26 21
DS 480 1100 859 1100 26 21
DS 480 1760 480 1100 26 21
DS 1150 1760 1530 1760 26 21
DS 1530 1760 1530 1100 26 21
DS 1150 1100 1530 1100 26 21
DS 1150 1760 1150 1100 26 21
$PAD
Sh "1" R 420 850 0 0 0
Dr 0 0 0
At SMD N 00888000
Ne 0 ""
Po -1340 2280
$EndPAD
$PAD
Sh "2" R 420 850 0 0 0
Dr 0 0 0
At SMD N 00888000
Ne 0 ""
Po -670 2280
$EndPAD
$PAD
Sh "3" R 420 850 0 0 0
Dr 0 0 0
At SMD N 00888000
Ne 0 ""
Po 0 2280
$EndPAD
$PAD
Sh "4" R 420 850 0 0 0
Dr 0 0 0
At SMD N 00888000
Ne 0 ""
Po 670 2280
$EndPAD
$PAD
Sh "5" R 420 850 0 0 0
Dr 0 0 0
At SMD N 00888000
Ne 0 ""
Po 1340 2280
$EndPAD
$PAD
Sh "6" R 4251 4098 0 0 0
Dr 0 0 0
At SMD N 00888000
Ne 0 ""
Po 0 -1000
$EndPAD
$SHAPE3D
Na "Vlastni\\d2-pak-5.wrl"
Sc 1 1 1
Of 0 0 0
Ro 0 0 0
$EndSHAPE3D
$EndMODULE D2PAK-5
$MODULE D2PAK-5ns
Po 0 0 0 15 4EB2CFC8 00000000 ~~
Li D2PAK-5ns
Sc 0
AR 
Op 0 0 0
T0 0 -2500 315 315 0 59 N V 21 N "D2PAK-5ns"
T1 0 118 315 315 0 59 N I 21 N "Val**"
DS -2000 -1500 2000 -1500 100 26
DS 1600 1950 1800 1950 100 26
DS 1800 1950 1800 2700 100 26
DS 1800 2700 1600 2700 100 26
DS 1600 2700 1600 1950 100 26
DS 750 1950 950 1950 100 26
DS 950 1950 950 2700 100 26
DS 950 2700 750 2700 100 26
DS 750 2700 750 1950 100 26
DS -100 1950 100 1950 100 26
DS 100 1950 100 2700 100 26
DS 100 2700 -100 2700 100 26
DS -100 2700 -100 1950 100 26
DS -950 1950 -750 1950 100 26
DS -750 1950 -750 2700 100 26
DS -750 2700 -950 2700 100 26
DS -950 2700 -950 1950 100 26
DS -1800 1950 -1600 1950 100 26
DS -1600 1950 -1600 2700 100 26
DS -1600 2700 -1800 2700 100 26
DS -1800 2700 -1800 1950 100 26
DS -1300 -1950 1300 -1950 100 26
DS 1300 -1950 2000 -1800 100 26
DS 2000 -1800 2000 1950 100 26
DS 2000 1950 -2000 1950 100 26
DS -2000 1950 -2000 -1800 100 26
DS -2000 -1800 -1350 -1950 100 26
DS -2000 -1500 2000 -1500 100 21
DS 1600 1950 1800 1950 100 21
DS 1800 1950 1800 2700 100 21
DS 1800 2700 1600 2700 100 21
DS 1600 2700 1600 1950 100 21
DS 750 1950 950 1950 100 21
DS 950 1950 950 2700 100 21
DS 950 2700 750 2700 100 21
DS 750 2700 750 1950 100 21
DS -100 1950 100 1950 100 21
DS 100 1950 100 2700 100 21
DS 100 2700 -100 2700 100 21
DS -100 2700 -100 1950 100 21
DS -950 1950 -750 1950 100 21
DS -750 1950 -750 2700 100 21
DS -750 2700 -950 2700 100 21
DS -950 2700 -950 1950 100 21
DS -1800 1950 -1600 1950 100 21
DS -1600 1950 -1600 2700 100 21
DS -1600 2700 -1800 2700 100 21
DS -1800 2700 -1800 1950 100 21
DS -1300 -1950 1300 -1950 100 21
DS 1300 -1950 2000 -1800 100 21
DS 2000 -1800 2000 1950 100 21
DS 2000 1950 -2000 1950 100 21
DS -2000 1950 -2000 -1800 100 21
DS -2000 -1800 -1350 -1950 100 21
$PAD
Sh "6" R 4240 4100 0 0 0
Dr 0 0 0
At SMD N 00888000
Ne 0 ""
Po 0 0
$EndPAD
$PAD
Sh "3" R 420 840 0 0 0
Dr 0 0 0
At SMD N 00888000
Ne 0 ""
Po 0 3270
$EndPAD
$PAD
Sh "2" R 420 840 0 0 0
Dr 0 0 0
At SMD N 00888000
Ne 0 ""
Po -850 3270
$EndPAD
$PAD
Sh "1" R 420 840 0 0 0
Dr 0 0 0
At SMD N 00888000
Ne 0 ""
Po -1700 3270
$EndPAD
$PAD
Sh "4" R 420 840 0 0 0
Dr 0 0 0
At SMD N 00888000
Ne 0 ""
Po 850 3270
$EndPAD
$PAD
Sh "5" R 420 840 0 0 0
Dr 0 0 0
At SMD N 00888000
Ne 0 ""
Po 1700 3270
$EndPAD
$SHAPE3D
Na "Vlastni/d2-pak-5.wrl"
Sc 1.2 1.2 1.2
Of 0 -0.05 0
Ro 0 0 0
$EndSHAPE3D
$EndMODULE D2PAK-5ns
$MODULE D2PAK123
Po 0 0 0 15 4EB2CF01 00000000 ~~
Li D2PAK123
Sc 0
AR 
Op 0 0 0
T0 0 -6750 315 315 0 59 N V 21 N "D2PAK123"
T1 0 -3500 315 315 0 59 N I 21 N "Val**"
DS 750 -2250 1250 -2250 80 26
DS 1250 -2250 1250 -1000 80 26
DS 1250 -1000 1120 -1000 80 26
DS 1120 -1000 1120 380 80 26
DS 1120 380 870 380 80 26
DS 870 380 870 -1000 80 26
DS 870 -1000 750 -1000 80 26
DS 750 -1000 750 -2250 80 26
DS -250 -2250 -250 -1750 80 26
DS -250 -1750 250 -1750 80 26
DS 250 -1750 250 -2250 80 26
DS 250 -2250 -250 -2250 80 26
DS -1250 -2250 -1250 -1000 80 26
DS -1250 -1000 -1130 -1000 80 26
DS -1130 -1000 -1130 380 80 26
DS -1130 380 -880 380 80 26
DS -880 380 -880 -1000 80 26
DS -880 -1000 -750 -1000 80 26
DS -750 -1000 -750 -2250 80 26
DS -750 -2250 -1250 -2250 80 26
DS -1750 -6250 -2250 -6000 80 26
DS -2250 -6000 -2250 -2250 80 26
DS -2250 -2250 2250 -2250 80 26
DS 2250 -2250 2250 -6000 80 26
DS 2250 -6000 1750 -6250 80 26
DS 1750 -6250 -1750 -6250 80 26
DS -2250 -5750 2250 -5750 80 26
DS -2250 -5750 2250 -5750 80 21
DS -250 -2250 -250 -1750 80 21
DS -250 -1750 250 -1750 80 21
DS 250 -1750 250 -2250 80 21
DS 250 -2250 -250 -2250 80 21
DS 750 -2250 750 -1000 80 21
DS 750 -1000 1250 -1000 80 21
DS 1250 -1000 1250 -2250 80 21
DS 1250 -2250 750 -2250 80 21
DS -1250 -2250 -750 -2250 80 21
DS -750 -2250 -750 -1000 80 21
DS -750 -1000 -1250 -1000 80 21
DS -1250 -1000 -1250 -2250 80 21
DS -1750 -6250 -2250 -6000 80 21
DS -2250 -6000 -2250 -2250 80 21
DS -2250 -2250 2250 -2250 80 21
DS 2250 -2250 2250 -6000 80 21
DS 2250 -6000 1750 -6250 80 21
DS 1750 -6250 -1750 -6250 80 21
$PAD
Sh "1" R 820 1500 0 0 0
Dr 0 0 0
At SMD N 00888000
Ne 0 ""
Po -1000 0
$EndPAD
$PAD
Sh "2" R 4500 3500 0 0 0
Dr 0 0 0
At SMD N 00888000
Ne 0 ""
Po 0 -4500
$EndPAD
$PAD
Sh "3" R 820 1500 0 0 0
Dr 0 0 0
At SMD N 00888000
Ne 0 ""
Po 1000 0
$EndPAD
$SHAPE3D
Na "walter/smd_trans/d2-pak.wrl"
Sc 1 1 1
Of 0 0.22 0
Ro 0 0 0
$EndSHAPE3D
$EndMODULE D2PAK123
$MODULE DO213AA
Po 0 0 0 15 4F748C00 00000000 ~~
Li DO213AA
Sc 0
AR 
Op 0 0 0
T0 0 -984 315 315 0 59 N V 21 N "DO213AA"
T1 0 984 315 315 0 59 N I 21 N "Val**"
DS -197 -551 -197 512 79 21
DS -1142 512 -157 512 79 21
DS -1102 -512 -1102 591 79 21
DS -118 -512 -1181 -512 79 21
DS 0 -591 0 591 79 21
DS -79 591 -79 -591 79 21
DS -157 -591 -157 591 79 21
DS -1181 591 1220 591 79 21
DS 1220 591 1220 -591 79 21
DS 1220 -591 -1181 -591 79 21
DS -1181 -591 -1181 591 79 21
$PAD
Sh "1" R 740 840 0 0 0
Dr 0 0 0
At SMD N 00888000
Ne 0 ""
Po 700 0
$EndPAD
$PAD
Sh "2" R 740 840 0 0 1800
Dr 0 0 0
At SMD N 00888000
Ne 0 ""
Po -660 0
$EndPAD
$SHAPE3D
Na "Diode/sod80c.wrl"
Sc 1 1 1
Of 0 0 0
Ro 0 0 180
$EndSHAPE3D
$EndMODULE DO213AA
$MODULE DO213AB
Po 0 0 0 15 4EB2D280 00000000 ~~
Li DO213AB
Sc 0
AR 
Op 0 0 0
T0 0 -1050 315 315 0 59 N V 21 N "DO213AB"
T1 0 1100 315 315 0 59 N I 21 N "Val**"
DS -400 -750 -400 750 79 21
DS -400 750 -350 750 79 21
DS -350 750 -350 -750 79 21
DS -350 -750 -300 -750 79 21
DS -300 -750 -300 750 79 21
DS -300 750 -250 750 79 21
DS -250 750 -250 -750 79 21
DS 1500 -750 -1500 -750 79 21
DS -1500 -750 -1500 750 79 21
DS -1500 750 1500 750 79 21
DS 1500 750 1500 -750 79 21
$PAD
Sh "1" R 800 1160 0 0 1800
Dr 0 0 0
At SMD N 04888000
Ne 0 ""
Po 950 0
$EndPAD
$PAD
Sh "2" R 800 1160 0 0 0
Dr 0 0 0
At SMD N 04888000
Ne 0 ""
Po -950 0
$EndPAD
$SHAPE3D
Na "Diode/melf.wrl"
Sc 1 1 1
Of 0 0 0
Ro 0 0 180
$EndSHAPE3D
$EndMODULE DO213AB
$MODULE DO213AC
Po 0 0 0 15 4EB2D368 00000000 ~~
Li DO213AC
Sc 0
AR 
Op 0 0 0
T0 0 -800 315 315 0 59 N V 21 N "DO213AC"
T1 0 800 315 315 0 59 N I 21 N "Val**"
DS -250 450 -250 -500 79 21
DS -1150 450 -1150 -450 79 21
DS -1200 450 -250 450 79 21
DS -250 450 -200 450 79 21
DS -200 -450 -1200 -450 79 21
DS -50 500 -50 -500 79 21
DS -100 -500 -100 500 79 21
DS -150 500 -150 -500 79 21
DS -200 -500 -200 500 79 21
DS 1200 -500 -1200 -500 79 21
DS -1200 -500 -1200 500 79 21
DS -1200 500 1200 500 79 21
DS 1200 500 1200 -500 79 21
$PAD
Sh "1" R 720 720 0 0 1800
Dr 0 0 0
At SMD N 00888000
Ne 0 ""
Po 700 0
$EndPAD
$PAD
Sh "2" R 720 720 0 0 0
Dr 0 0 0
At SMD N 00888000
Ne 0 ""
Po -700 0
$EndPAD
$SHAPE3D
Na "Diode/sod80c.wrl"
Sc 1 1 1
Of 0 0 0
Ro 0 0 180
$EndSHAPE3D
$EndMODULE DO213AC
$MODULE DO214AA
Po 0 0 0 15 4EB2D3A1 00000000 ~~
Li DO214AA
Sc 0
AR 
Op 0 0 0
T0 0 -1100 315 315 0 59 N V 21 N "DO214AA"
T1 0 1200 315 315 0 59 N I 21 N "Val**"
DS 900 -630 900 -800 80 21
DS 900 -800 -900 -800 80 21
DS -900 -800 -900 -640 80 21
DS -900 630 -900 800 80 21
DS -900 800 890 800 80 21
DS 890 800 890 620 80 21
DS -1120 410 -1120 -420 30 26
DS -1120 -420 -900 -420 30 26
DS -900 -420 -900 -750 30 26
DS -900 -750 900 -750 30 26
DS 900 -750 900 -420 30 26
DS 900 -420 1100 -420 30 26
DS 1100 -420 1100 410 30 26
DS 1100 410 900 410 30 26
DS 900 410 900 750 30 26
DS 900 750 -890 750 30 26
DS -890 750 -900 740 30 26
DS -900 740 -900 410 30 26
DS -900 410 -1120 410 30 26
DA -730 -570 -790 -570 981 30 26
DS -720 -640 -150 -640 30 26
DS -150 -640 -150 650 30 26
DS -150 650 -720 650 30 26
DA -730 590 -720 650 1089 30 26
DS -790 580 -790 440 30 26
DS -790 440 -750 440 30 26
DA -790 0 -750 -440 1696 30 26
DS -750 -440 -790 -440 30 26
DS -790 -440 -790 -570 30 26
DS -830 -580 -830 -400 30 26
DS -830 -400 -790 -400 30 26
DA -780 0 -790 -400 1771 30 26
DS -790 400 -830 400 30 26
DS -830 400 -830 590 30 26
DA -750 610 -730 690 1180 30 26
DS -730 690 740 690 30 26
DA 750 610 840 590 1096 30 26
DS 840 590 840 -590 30 26
DA 750 -590 750 -680 900 30 26
DS 750 -680 -730 -680 30 26
DA -730 -580 -830 -580 900 30 26
DS -900 750 900 750 60 26
DS 900 750 900 -750 60 26
DS 900 -750 -900 -750 60 26
DS -900 -750 -900 750 60 26
DS -900 -640 -900 -800 80 21
DS -900 -800 -140 -800 80 21
DS -140 -800 -140 800 80 21
DS -140 800 -900 800 80 21
DS -900 800 -900 630 80 21
DS -900 630 -360 630 80 21
DS -360 630 -360 -640 80 21
DS -360 -640 -900 -640 80 21
$PAD
Sh "2" R 840 1080 0 0 0
Dr 0 0 0
At SMD N 00888000
Ne 0 ""
Po -870 0
$EndPAD
$PAD
Sh "1" R 840 1080 0 0 0
Dr 0 0 0
At SMD N 00888000
Ne 0 ""
Po 870 0
$EndPAD
$SHAPE3D
Na "Diode/DO214.wrl"
Sc 1 1 1
Of 0 0 0
Ro 0 0 0
$EndSHAPE3D
$EndMODULE DO214AA
$MODULE DO214AB
Po 0 0 0 15 4EB2D3D9 00000000 ~~
Li DO214AB
Sc 0
AR 
Op 0 0 0
T0 0 -1500 315 315 0 59 N V 21 N "DO214AB"
T1 0 1600 315 315 0 59 N I 21 N "Val**"
DS 1600 -700 1600 -1240 80 21
DS 1600 -1240 -1600 -1240 80 21
DS -1600 -1240 -1600 -700 80 21
DS 1600 -550 1400 -550 40 26
DS 1400 -550 1400 550 40 26
DS 1400 550 1600 550 40 26
DS 1600 550 1600 -550 40 26
DS -1200 -1000 -1100 -1100 30 26
DS -1100 -1100 -400 -1100 30 26
DS -400 -1100 -400 1100 30 26
DS -400 1100 -1100 1100 30 26
DS -1100 1100 -1200 1000 30 26
DS -1200 1000 -1200 550 30 26
DS -1200 550 -1150 550 30 26
DA -1200 0 -1150 -550 1696 30 26
DS -1150 -550 -1200 -550 30 26
DS -1200 -550 -1200 -1000 30 26
DS -1410 -550 -1600 -550 40 26
DS -1600 -550 -1600 550 40 26
DS -1600 550 -1410 550 40 26
DS -1410 550 -1410 -550 40 26
DS 1600 700 1600 1240 80 21
DS 1600 1240 -1600 1240 80 21
DS -1600 1240 -1600 700 80 21
DS -1400 1220 -1400 -1230 60 26
DS -1400 -1230 1400 -1230 60 26
DS 1400 -1230 1400 1220 60 26
DS 1400 1220 -1400 1220 60 26
DS -1200 -1000 -1200 -550 30 26
DS -1200 -550 -1150 -550 30 26
DA -1200 0 -1150 -550 1696 30 26
DS -1150 550 -1200 550 30 26
DS -1200 550 -1200 1000 30 26
DA -1070 970 -1100 1100 640 30 26
DS -1100 1100 1150 1100 30 26
DA 1110 970 1250 1000 608 30 26
DS 1250 1000 1250 -1000 30 26
DA 1110 -960 1150 -1100 581 30 26
DS 1150 -1100 -1100 -1100 30 26
DA -1070 -960 -1200 -1000 608 30 26
DS -1600 -1200 -1600 -700 60 21
DS -1600 -700 -1050 -700 60 21
DS -1050 -700 -1050 700 60 21
DS -1050 700 -1600 700 60 21
DS -1600 700 -1600 1200 60 21
DS -1600 1200 -700 1200 60 21
DS -700 1200 -700 -1200 60 21
DS -700 -1200 -1600 -1200 60 21
$PAD
Sh "2" R 700 1240 0 0 0
Dr 0 0 0
At SMD N 00888000
Ne 0 ""
Po -1500 0
$EndPAD
$PAD
Sh "1" R 700 1240 0 0 0
Dr 0 0 0
At SMD N 00888000
Ne 0 ""
Po 1500 0
$EndPAD
$SHAPE3D
Na "Vlastni/DO214AB-SMC.wrl"
Sc 1 1 1
Of 0 0 0
Ro 0 0 180
$EndSHAPE3D
$EndMODULE DO214AB
$MODULE DO214AC
Po 0 0 0 15 4EB2D3F1 00000000 ~~
Li DO214AC
Sc 0
AR 
Op 0 0 0
T0 0 -900 315 315 0 59 N V 21 N "DO214AC"
T1 0 1000 315 315 0 59 N I 21 N "Val**"
DS -1100 320 -1100 -320 30 26
DS -1100 -320 -900 -320 30 26
DS -900 -320 -900 -570 30 26
DS -900 -570 900 -570 30 26
DS 900 -570 900 -320 30 26
DS 900 -320 1100 -320 30 26
DS 1100 -320 1100 320 30 26
DS 1100 320 900 320 30 26
DS 900 320 900 580 30 26
DS 900 580 -900 580 30 26
DS -900 580 -900 320 30 26
DS -900 320 -1100 320 30 26
DS -900 580 900 580 60 26
DS 900 580 900 -570 60 26
DS 900 -570 -900 -570 60 26
DS -900 -570 -900 580 60 26
DA -720 -410 -800 -420 765 30 26
DS -800 -420 -800 -250 30 26
DS -800 -250 -780 -250 30 26
DA -810 0 -780 -250 1663 30 26
DS -780 250 -800 250 30 26
DS -800 250 -800 430 30 26
DA -720 420 -730 500 757 30 26
DS -730 500 -300 500 30 26
DS -300 500 -300 -500 30 26
DS -300 -500 -730 -500 30 26
DA -720 -410 -800 -420 765 30 26
DS -800 -420 -800 -250 30 26
DS -800 -250 -780 -250 30 26
DA -810 0 -780 -250 1663 30 26
DS -780 250 -800 250 30 26
DS -800 250 -800 430 30 26
DA -720 420 -730 500 757 30 26
DS -730 500 720 500 30 26
DA 710 420 800 430 765 30 26
DS 800 430 800 -420 30 26
DA 710 -410 720 -500 773 30 26
DS 720 -500 -730 -500 30 26
DS 1050 440 1050 600 60 21
DS 1050 600 -1050 600 60 21
DS -1050 600 -1050 440 60 21
DS 1050 -450 1050 -600 60 21
DS 1050 -600 -1050 -600 60 21
DS -1050 -600 -1050 -470 60 21
DS -1050 -450 -330 -450 60 21
DS -330 -450 -330 450 60 21
DS -330 450 -1050 450 60 21
DS -1050 450 -1050 600 60 21
DS -1050 600 -60 600 60 21
DS -60 600 -60 -600 60 21
DS -60 -600 -1050 -600 60 21
DS -1050 -600 -1050 -450 60 21
$PAD
Sh "2" R 780 780 0 0 2700
Dr 0 0 0
At SMD N 00888000
Ne 0 ""
Po -780 0
$EndPAD
$PAD
Sh "1" R 780 780 0 0 2700
Dr 0 0 0
At SMD N 00888000
Ne 0 ""
Po 780 0
$EndPAD
$SHAPE3D
Na "Diode/do214ac.wrl"
Sc 1 1 1
Of 0 0 0
Ro 0 0 180
$EndSHAPE3D
$EndMODULE DO214AC
$MODULE DPAK
Po 0 0 0 15 4EB2D4DA 00000000 ~~
Li DPAK
Sc 0
AR 
Op 0 0 0
T0 0 -1500 315 315 0 59 N V 21 N "DPAK"
T1 0 3800 315 315 0 59 N I 21 N "Val**"
DS 1320 -1000 1320 2100 60 21
DS 1320 2100 -1320 2100 60 21
DS -1320 2100 -1320 2100 60 21
DS -1320 2100 -1320 -1000 60 21
DS 1320 -1000 1320 2100 60 26
DS 1320 2100 -1320 2100 60 26
DS -1320 2100 -1320 2100 60 26
DS -1320 2100 -1320 -1000 60 26
$PAD
Sh "1" R 560 720 0 0 1800
Dr 0 0 0
At SMD N 00888000
Ne 0 ""
Po -900 2900
$EndPAD
$PAD
Sh "3" R 560 720 0 0 0
Dr 0 0 0
At SMD N 00888000
Ne 0 ""
Po 900 2900
$EndPAD
$PAD
Sh "2" R 2200 2300 0 0 0
Dr 0 0 0
At SMD N 00888000
Ne 0 ""
Po 0 0
$EndPAD
$SHAPE3D
Na "walter/smd_trans/d-pak.wrl"
Sc 1 1 1
Of 0 -0.15 0
Ro 0 0 0
$EndSHAPE3D
$EndMODULE DPAK
$MODULE DPAK123
Po 0 0 0 15 4F748B68 00000000 ~~
Li DPAK123
Cd MOS boitier DPACK G-D-S
Kw CMD DPACK
Sc 0
AR /4E7307F2/4E730A7E
Op 0 0 0
At SMD
T0 0 -4134 315 315 0 59 N V 21 N "Q4"
T1 0 -950 315 315 0 59 N I 21 N "Value"
DS -1339 -709 -1339 -3858 79 21
DS -1339 -3858 1339 -3858 79 21
DS 1339 -3858 1339 -709 79 21
DS 1339 -709 -1339 -709 79 21
DS 472 -709 472 709 79 21
DS 472 709 1339 709 79 21
DS 1339 709 1339 -709 79 21
DS -1339 -709 -1339 709 79 21
DS -1339 709 -472 709 79 21
DS -472 709 -472 -709 79 21
$PAD
Sh "1" R 650 1200 0 0 0
Dr 0 0 0
At SMD N 00888000
Ne 0 ""
Po -900 0
$EndPAD
$PAD
Sh "3" R 2400 2400 0 0 0
Dr 0 0 0
At SMD N 00888000
Ne 0 ""
Po 0 -2500
$EndPAD
$PAD
Sh "2" R 650 1200 0 0 0
Dr 0 0 0
At SMD N 00888000
Ne 0 ""
Po 900 0
$EndPAD
$SHAPE3D
Na "smd/dpack_2.wrl"
Sc 1 1 1
Of 0 0 0
Ro 0 0 0
$EndSHAPE3D
$EndMODULE DPAK123
$MODULE DPAK5
Po 0 0 0 15 428087B0 00000000 ~~
Li DPAK5
Kw CMS DPACK
Sc 0
AR 
Op 0 0 0
T0 0 -5600 500 500 0 60 N V 21 N "DPAK5"
T1 0 -1300 500 500 0 60 N V 21 N "VAL**"
DS 1100 -950 1100 500 50 21
DS 1100 500 1600 500 50 21
DS 1600 500 1600 -950 50 21
DS 450 -950 450 500 50 21
DS 450 500 950 500 50 21
DS 950 500 950 -950 50 21
DS -250 -950 -250 500 50 21
DS -250 500 250 500 50 21
DS 250 500 250 -950 50 21
DS -900 -950 -900 500 50 21
DS -900 500 -450 500 50 21
DS -450 500 -400 500 50 21
DS -400 500 -400 -950 50 21
DS -1600 -950 -1600 500 50 21
DS -1600 500 -1100 500 50 21
DS -1100 500 -1100 -950 50 21
DS -2100 -950 2100 -950 50 21
DS 2100 -950 2100 -4950 50 21
DS 2100 -4950 -2100 -4950 50 21
DS -2100 -4950 -2100 -950 50 21
$PAD
Sh "1" R 420 900 0 0 0
Dr 0 0 0
At SMD N 00888000
Ne 0 ""
Po -1340 0
$EndPAD
$PAD
Sh "3" R 4200 3500 0 0 0
Dr 0 0 0
At SMD N 00888000
Ne 0 ""
Po 0 -3450
$EndPAD
$PAD
Sh "3" R 420 900 0 0 0
Dr 0 0 0
At SMD N 00888000
Ne 0 ""
Po 0 0
$EndPAD
$PAD
Sh "2" R 420 900 0 0 0
Dr 0 0 0
At SMD N 00888000
Ne 0 ""
Po -670 0
$EndPAD
$PAD
Sh "4" R 420 900 0 0 0
Dr 0 0 0
At SMD N 00888000
Ne 0 ""
Po 670 0
$EndPAD
$PAD
Sh "5" R 420 900 0 0 0
Dr 0 0 0
At SMD N 00888000
Ne 0 ""
Po 1340 0
$EndPAD
$SHAPE3D
Na "smd/dpack_5.wrl"
Sc 1 1 1
Of 0 0 0
Ro 0 0 0
$EndSHAPE3D
$EndMODULE DPAK5
$MODULE DPAKBCE
Po 0 0 0 15 4F748B86 00000000 ~~
Li DPAKBCE
Cd MOS boitier DPACK G-D-S
Kw CMD DPACK
Sc 0
AR /4E7307F2/4E730A7E
Op 0 0 0
At SMD
T0 0 -4134 315 315 0 59 N V 21 N "Q4"
T1 0 -950 315 315 0 59 N I 21 N "Value"
DS -1339 -709 -1339 -3858 79 21
DS -1339 -3858 1339 -3858 79 21
DS 1339 -3858 1339 -709 79 21
DS 1339 -709 -1339 -709 79 21
DS 472 -709 472 709 79 21
DS 472 709 1339 709 79 21
DS 1339 709 1339 -709 79 21
DS -1339 -709 -1339 709 79 21
DS -1339 709 -472 709 79 21
DS -472 709 -472 -709 79 21
$PAD
Sh "B" R 650 1200 0 0 0
Dr 0 0 0
At SMD N 00888000
Ne 0 ""
Po -900 0
$EndPAD
$PAD
Sh "C" R 2400 2400 0 0 0
Dr 0 0 0
At SMD N 00888000
Ne 0 ""
Po 0 -2500
$EndPAD
$PAD
Sh "E" R 650 1200 0 0 0
Dr 0 0 0
At SMD N 00888000
Ne 0 ""
Po 900 0
$EndPAD
$SHAPE3D
Na "smd/dpack_2.wrl"
Sc 1 1 1
Of 0 0 0
Ro 0 0 0
$EndSHAPE3D
$EndMODULE DPAKBCE
$MODULE DPAKGDS
Po 0 0 0 15 4F748BAC 00000000 ~~
Li DPAKGDS
Cd MOS boitier DPACK G-D-S
Kw CMD DPACK
Sc 0
AR /4E7307F2/4E730A7E
Op 0 0 0
At SMD
T0 0 -4134 315 315 0 59 N V 21 N "Q4"
T1 0 -950 315 315 0 59 N I 21 N "Value"
DS -1339 -709 -1339 -3858 79 21
DS -1339 -3858 1339 -3858 79 21
DS 1339 -3858 1339 -709 79 21
DS 1339 -709 -1339 -709 79 21
DS 472 -709 472 709 79 21
DS 472 709 1339 709 79 21
DS 1339 709 1339 -709 79 21
DS -1339 -709 -1339 709 79 21
DS -1339 709 -472 709 79 21
DS -472 709 -472 -709 79 21
$PAD
Sh "G" R 650 1200 0 0 0
Dr 0 0 0
At SMD N 00888000
Ne 0 ""
Po -900 0
$EndPAD
$PAD
Sh "D" R 2400 2400 0 0 0
Dr 0 0 0
At SMD N 00888000
Ne 0 ""
Po 0 -2500
$EndPAD
$PAD
Sh "S" R 650 1200 0 0 0
Dr 0 0 0
At SMD N 00888000
Ne 0 ""
Po 900 0
$EndPAD
$SHAPE3D
Na "smd/dpack_2.wrl"
Sc 1 1 1
Of 0 0 0
Ro 0 0 0
$EndSHAPE3D
$EndMODULE DPAKGDS
$MODULE DPAK_123
Po 0 0 0 15 4EB2D4F8 00000000 ~~
Li DPAK_123
Sc 0
AR 
Op 0 0 0
T0 0 -2900 315 315 0 59 N V 21 N "DPAK_123"
T1 0 118 315 315 0 59 N I 21 N "Val**"
DS -200 600 -200 900 30 26
DS -200 900 200 900 30 26
DS 200 900 200 600 30 26
DS 200 600 -200 600 30 26
DS -950 -1900 900 -1900 80 26
DS 1150 600 1150 900 30 26
DS 1150 900 1100 950 30 26
DS 1100 950 1100 1500 30 26
DS 1100 1500 700 1500 30 26
DS 700 1500 700 950 30 26
DS 700 950 650 900 30 26
DS 650 900 650 600 30 26
DS 650 600 1150 600 30 26
DS -650 600 -650 900 30 26
DS -650 900 -700 950 30 26
DS -700 950 -700 1550 30 26
DS -700 1550 -1100 1550 30 26
DS -1100 1550 -1100 950 30 26
DS -1100 950 -1150 900 30 26
DS -1150 900 -1150 600 30 26
DS -1150 600 -650 600 30 26
DS 1200 -1900 950 -1900 80 26
DS 950 -1900 600 -2250 80 26
DS 600 -2250 -600 -2250 80 26
DS -600 -2250 -950 -1900 80 26
DS -950 -1900 -1220 -1900 80 26
DS -1220 -1900 -1220 600 80 26
DS -1220 600 1200 600 80 26
DS 1200 600 1200 -1900 80 26
DS 1230 -1920 1230 600 80 21
DS 1230 600 -1250 600 80 21
DS -1250 600 -1250 -1900 80 21
DS -1210 -1900 -1050 -1740 30 26
DS -1050 -1740 1040 -1740 30 26
DS 1040 -1740 1200 -1900 30 26
DS 1200 -1900 -1210 -1900 30 26
DS -1060 470 1080 470 30 26
DS 1080 470 1210 600 30 26
DS 1210 600 -1190 600 30 26
DS -1190 600 -1060 470 30 26
DS -1050 470 1060 470 30 26
DS 1060 470 1060 -1740 30 26
DS 1060 -1740 -1050 -1740 30 26
DS -1050 -1740 -1050 470 30 26
$PAD
Sh "1" R 640 1200 0 0 0
Dr 0 0 0
At SMD N 00888000
Ne 0 ""
Po -900 1400
$EndPAD
$PAD
Sh "2" R 2340 2340 0 0 0
Dr 0 0 0
At SMD N 00888000
Ne 0 ""
Po 0 -1400
$EndPAD
$PAD
Sh "3" R 640 1200 0 0 0
Dr 0 0 0
At SMD N 00888000
Ne 0 ""
Po 900 1400
$EndPAD
$SHAPE3D
Na "smd/dpack_2.wrl"
Sc 1 1 1
Of 0 -0.12 0
Ro 0 0 0
$EndSHAPE3D
$EndMODULE DPAK_123
$MODULE SC_79
Po 0 0 0 15 4EB2D550 00000000 ~~
Li SC_79
Sc 0
AR 
Op 0 0 0
T0 0 -500 315 315 0 59 N V 21 N "SC_79"
T1 0 600 315 315 0 59 N I 21 N "Val**"
DS -250 -170 -250 -200 80 21
DS -250 -200 270 -200 80 21
DS 270 -200 270 -150 80 21
DS -250 -170 -250 50 30 26
DS -250 50 -320 50 30 26
DS -320 50 -320 -50 30 26
DS -320 -50 -250 -50 30 26
DS -250 -50 -250 170 30 26
DS -250 170 240 170 30 26
DS 240 170 200 130 30 26
DS 200 130 -210 130 30 26
DS -210 130 -250 170 30 26
DS -250 170 250 170 30 26
DS 250 170 250 -50 30 26
DS 250 -50 320 -50 30 26
DS 320 -50 320 50 30 26
DS 320 50 250 50 30 26
DS 250 50 250 -170 30 26
DS 250 -170 200 -120 30 26
DS 200 -120 200 130 30 26
DS 200 130 240 170 30 26
DS 240 170 250 160 30 26
DS 250 160 250 -170 30 26
DS 250 -170 -250 -170 30 26
DS -250 -170 -210 -130 30 26
DS -210 -130 200 -130 30 26
DS 200 -130 200 120 30 26
DS 200 120 -200 120 30 26
DS -200 120 -200 -120 30 26
DS -50 -200 -50 200 50 21
DS -50 200 -250 200 50 21
DS -250 200 -250 150 50 21
DS -250 150 -150 150 50 21
DS -150 150 -150 -150 50 21
DS -150 -150 -250 -150 50 21
DS -250 -150 -250 -200 50 21
DS -250 -200 -50 -200 50 21
DS -250 180 -250 200 80 21
DS -250 200 270 200 80 21
DS 270 200 270 150 80 21
DS -200 130 -80 130 30 26
DS -80 130 -80 -120 30 26
DS -80 -120 -200 -120 30 26
DS -200 -120 -200 130 30 26
$PAD
Sh "2" R 200 180 0 0 0
Dr 0 0 0
At SMD N 00888000
Ne 0 ""
Po -300 0
$EndPAD
$PAD
Sh "1" R 200 180 0 0 0
Dr 0 0 0
At SMD N 00888000
Ne 0 ""
Po 300 0
$EndPAD
$EndMODULE SC_79
$MODULE SDB_2
Po 0 0 0 15 4EB2D59B 00000000 ~~
Li SDB_2
Sc 0
AR 
Op 0 0 0
T0 -2000 0 315 315 900 59 N V 21 N "SDB_2"
T1 0 0 315 315 900 59 N I 21 N "Val**"
DS -1690 -1270 -1620 -1200 20 26
DS -1620 -1200 1590 -1200 20 26
DS 1590 -1200 1660 -1270 20 26
DS 1660 -1270 1660 1270 20 26
DS 1660 1270 1590 1200 20 26
DS 1590 1200 -1610 1200 20 26
DS -1610 1200 -1690 1280 20 26
DS -1690 1280 -1690 -1270 20 26
DS -1620 1200 -1620 -1200 20 26
DS -1620 -1200 1590 -1200 20 26
DS 1590 -1200 1590 1200 20 26
DS 1590 1200 -1620 1200 20 26
DS -1470 -1270 -1690 -1270 50 26
DS -1690 -1270 -1690 1280 50 26
DS -1690 1280 -800 1280 50 26
DS -800 1280 -800 2000 50 26
DS -800 2000 -1200 2000 50 26
DS -1200 2000 -1200 1280 50 26
DS -1200 1280 1200 1280 50 26
DS 1200 1280 1200 2000 50 26
DS 1200 2000 800 2000 50 26
DS 800 2000 800 1280 50 26
DS 800 1280 1660 1280 50 26
DS 1660 1280 1660 -1270 50 26
DS 1660 -1270 800 -1270 50 26
DS 800 -1270 800 -2000 50 26
DS 800 -2000 1200 -2000 50 26
DS 1200 -2000 1200 -1270 50 26
DS 1200 -1270 -1210 -1270 50 26
DS -1210 -1270 -1210 -2000 50 26
DS -1210 -2000 -810 -2000 50 26
DS -810 -2000 -810 -1270 50 26
DS -810 -1270 -1470 -1270 50 26
DS -1680 -1290 -1680 1290 50 21
DS -1680 1290 1660 1290 50 21
DS 1660 1290 1660 -1290 50 21
DS 1660 -1290 1360 -1290 50 21
DS 1360 -1290 1360 1290 50 21
DS 1360 1290 1670 1290 50 21
DS 1670 1290 1670 -1290 50 21
DS 1670 -1290 -1680 -1290 50 21
DS 1350 1200 1350 -1200 20 26
DS 1350 -1200 1590 -1200 20 26
DS 1590 -1200 1590 1200 20 26
DS 1590 1200 1350 1200 20 26
$PAD
Sh "3" R 540 940 0 0 0
Dr 0 0 0
At SMD N 00888000
Ne 0 ""
Po -1000 1780
$EndPAD
$PAD
Sh "4" R 540 940 0 0 0
Dr 0 0 0
At SMD N 00888000
Ne 0 ""
Po 1000 1780
$EndPAD
$PAD
Sh "1" R 540 940 0 0 0
Dr 0 0 0
At SMD N 00888000
Ne 0 ""
Po 1000 -1770
$EndPAD
$PAD
Sh "2" R 540 940 0 0 0
Dr 0 0 0
At SMD N 00888000
Ne 0 ""
Po -1000 -1770
$EndPAD
$SHAPE3D
Na "Bridge/DB-1S.wrl"
Sc 1 1 1
Of 0 0 0
Ro 0 0 0
$EndSHAPE3D
$EndMODULE SDB_2
$MODULE SMB
Po 0 0 0 15 4EB2D67A 00000000 ~~
Li SMB
Sc 0
AR 
Op 0 0 0
T0 0 -984 315 315 0 59 N V 21 N "SMB"
T1 0 1181 315 315 0 59 N I 21 N "Val**"
DS 256 -650 256 669 79 21
DS 138 -689 138 669 79 21
DS 1496 -630 197 -630 79 21
DS 197 630 1476 630 79 21
DS 1496 -689 1496 689 79 21
DS 98 689 98 -689 79 21
DS 197 -689 197 689 79 21
DS -1575 -689 1575 -689 79 21
DS 1575 -689 1575 689 79 21
DS 1575 689 -1575 689 79 21
DS -1575 689 -1575 -689 79 21
$PAD
Sh "1" R 960 960 0 0 900
Dr 0 0 0
At SMD N 04888000
Ne 0 ""
Po -886 0
$EndPAD
$PAD
Sh "2" R 960 960 0 0 900
Dr 0 0 0
At SMD N 04888000
Ne 0 ""
Po 874 0
$EndPAD
$SHAPE3D
Na "Diode/DO214.wrl"
Sc 1 1 1
Of 0 0 0
Ro 0 0 0
$EndSHAPE3D
$EndMODULE SMB
$MODULE SOD123
Po 0 0 0 15 4EB2D866 00000000 ~~
Li SOD123
Sc 0
AR 
Op 0 0 0
T0 0 -750 315 315 0 59 N V 21 N "SOD123"
T1 0 750 315 315 0 59 N I 21 N "Val**"
DS 55 -190 55 200 70 26
DS -175 200 15 0 70 26
DS -175 -190 15 0 70 26
DS -175 -190 -175 200 70 26
DS -295 0 175 0 70 26
DS 295 -350 295 360 70 26
DS 335 -350 335 360 70 26
DS 375 -350 375 360 70 26
DS -885 -350 -885 360 70 26
DS -885 360 885 360 70 26
DS 885 360 885 -350 70 26
DS 885 -350 -885 -350 70 26
DS 55 -190 55 200 70 21
DS -175 200 15 0 70 21
DS -175 -190 15 0 70 21
DS -175 -190 -175 200 70 21
DS -295 0 175 0 70 21
DS 295 -350 295 360 70 21
DS 335 -350 335 360 70 21
DS 375 -350 375 360 70 21
DS -885 -350 -885 360 70 21
DS -885 360 885 360 70 21
DS 885 360 885 -350 70 21
DS 885 -350 -885 -350 70 21
$PAD
Sh "1" R 340 460 0 0 0
Dr 0 0 0
At SMD N 04888000
Ne 0 ""
Po -645 0
$EndPAD
$PAD
Sh "2" R 340 460 0 0 0
Dr 0 0 0
At SMD N 04888000
Ne 0 ""
Po 645 0
$EndPAD
$EndMODULE SOD123
$MODULE SOD80
Po 0 0 0 15 4EB2D750 00000000 ~~
Li SOD80
Sc 0
AR 
Op 0 0 0
T0 0 -866 315 315 0 59 N V 21 N "SOD80"
T1 0 945 315 315 0 59 N I 21 N "Val**"
DS -1220 -591 -1220 591 79 21
DS -1220 591 -1181 551 79 21
DS -1181 551 -1181 -551 79 21
DS -1101 -590 -1101 590 70 26
DS -1101 -590 -1101 590 70 26
DS -1141 520 -281 520 70 26
DS -281 560 -1141 560 70 26
DS -1141 -550 -281 -550 70 26
DS -281 -510 -1141 -510 70 26
DS -1071 -590 -1071 590 70 21
DS -1141 -590 -1141 590 70 21
DS -1071 -590 -1071 590 70 26
DS -1141 -590 -1141 590 70 26
DS -1181 520 -321 520 70 21
DS -321 560 -1181 560 70 21
DS -1181 -550 -321 -550 70 21
DS -321 -510 -1181 -510 70 21
DS -201 -590 -201 590 70 21
DS -281 -590 -281 590 70 21
DS -1201 -600 1199 -600 60 21
DS 1199 -600 1199 600 60 21
DS 1199 600 -1201 600 60 21
DS -1201 -600 1199 -600 60 26
DS 1199 -600 1199 600 60 26
DS 1199 600 -1201 600 60 26
DS -201 -590 -201 590 70 26
DS -281 -590 -281 590 70 26
$PAD
Sh "1" R 820 560 0 0 900
Dr 0 0 0
At SMD N 04888000
Ne 0 ""
Po 669 0
$EndPAD
$PAD
Sh "2" R 820 560 0 0 2700
Dr 0 0 0
At SMD N 04888000
Ne 0 ""
Po -661 0
$EndPAD
$SHAPE3D
Na "Diode/sod80c.wrl"
Sc 1 1 1
Of 0 0 0
Ro 0 0 180
$EndSHAPE3D
$EndMODULE SOD80
$MODULE SOD87
Po 0 0 0 15 4EB2D793 00000000 ~~
Li SOD87
Sc 0
AR 
Op 0 0 0
T0 0 -1024 315 315 0 59 N V 21 N "SOD87"
T1 0 1063 315 315 0 59 N I 21 N "Val**"
DS 1365 -750 -1375 -750 60 21
DS -1375 -750 -1375 -80 60 21
DS -1375 -80 -1455 0 60 21
DS -1455 0 -1455 0 60 21
DS -1455 0 -1375 80 60 21
DS -1375 80 -1375 740 60 21
DS -1375 740 1365 740 60 21
DS 1365 740 1365 -750 60 21
DS 1365 -750 -1375 -750 60 26
DS -1375 -750 -1375 -80 60 26
DS -1375 -80 -1455 0 60 26
DS -1455 0 -1455 0 60 26
DS -1455 0 -1375 80 60 26
DS -1375 80 -1375 740 60 26
DS -1375 740 1365 740 60 26
DS 1365 740 1365 -750 60 26
DS -395 -700 -395 710 70 21
DS -435 -700 -435 710 70 21
DS -475 -700 -475 710 70 21
DS -515 -700 -515 710 70 21
DS -395 -700 -395 710 70 26
DS -435 -700 -435 710 70 26
DS -475 -700 -475 710 70 26
DS -515 -700 -515 710 70 26
$PAD
Sh "1" R 1140 560 0 0 900
Dr 0 0 0
At SMD N 04888000
Ne 0 ""
Po 945 0
$EndPAD
$PAD
Sh "2" R 1140 560 0 0 2700
Dr 0 0 0
At SMD N 04888000
Ne 0 ""
Po -945 0
$EndPAD
$SHAPE3D
Na "Diode/melf.wrl"
Sc 1 1 1
Of 0 0 0
Ro 0 0 180
$EndSHAPE3D
$EndMODULE SOD87
$MODULE SOD_323
Po 0 0 0 15 4EB2D896 00000000 ~~
Li SOD_323
Sc 0
AR 
Op 0 0 0
T0 0 -600 315 315 0 59 N V 21 N "SOD_323"
T1 0 600 315 315 0 59 N I 21 N "Val**"
DS -400 300 370 300 60 26
DS 370 300 370 -300 60 26
DS 370 -300 -400 -300 60 26
DS -400 -300 -400 300 60 26
DS -380 -100 -550 -100 30 26
DS -550 -100 -550 100 30 26
DS -550 100 -380 100 30 26
DS -380 100 -380 300 30 26
DS -380 300 370 300 30 26
DS 370 300 370 100 30 26
DS 370 100 550 100 30 26
DS 550 100 550 -100 30 26
DS 550 -100 370 -100 30 26
DS 370 -100 370 -300 30 26
DS 370 -300 -380 -300 30 26
DS -380 -300 -380 -100 30 26
DS -500 -300 -50 -300 50 21
DS -50 -300 -50 300 50 21
DS -50 300 -500 300 50 21
DS -500 300 -500 200 50 21
DS -500 200 -300 200 50 21
DS -300 200 -300 -200 50 21
DS -300 -200 -500 -200 50 21
DS -500 -200 -500 -300 50 21
DS -400 300 -400 -300 60 26
DS -400 -300 -150 -300 60 26
DS -150 -300 -150 300 60 26
DS -150 300 -400 300 60 26
DS -500 230 -500 290 80 21
DS -500 290 500 290 80 21
DS 500 290 500 200 80 21
DS -500 -220 -500 -290 80 21
DS -500 -290 500 -290 80 21
DS 500 -290 500 -200 80 21
$PAD
Sh "2" R 300 300 0 0 0
Dr 0 0 0
At SMD N 00888000
Ne 0 ""
Po -500 0
$EndPAD
$PAD
Sh "1" R 300 300 0 0 0
Dr 0 0 0
At SMD N 00888000
Ne 0 ""
Po 500 0
$EndPAD
$SHAPE3D
Na "walter/smd_diode/sod323.wrl"
Sc 1 1 1
Of 0 0 0
Ro 0 0 180
$EndSHAPE3D
$EndMODULE SOD_323
$MODULE SOT194
Po 0 0 0 15 4EB2D995 00000000 ~~
Li SOT194
Sc 0
AR 
Op 0 0 0
T0 0 -6100 315 315 0 59 N V 21 N "SOT194"
T1 0 1300 315 315 0 59 N I 21 N "Val**"
DS -1500 -5800 1500 -5800 79 21
DS 1500 -5800 1500 -1100 79 21
DS 1500 -1100 400 -1100 79 21
DS -1500 -5800 -1500 -1100 79 21
DS -1500 -1100 -400 -1100 79 21
$PAD
Sh "1" R 460 1760 0 0 0
Dr 0 0 0
At STD N 00808000
Ne 0 ""
Po -860 0
$EndPAD
$PAD
Sh "2" R 2620 3340 0 0 0
Dr 0 0 0
At STD N 00808000
Ne 0 ""
Po 0 -3930
$EndPAD
$PAD
Sh "3" R 460 1760 0 0 0
Dr 0 0 0
At STD N 00808000
Ne 0 ""
Po 870 0
$EndPAD
$PAD
Sh "4" R 460 3180 0 0 0
Dr 0 0 0
At STD N 00808000
Ne 0 ""
Po 0 -700
$EndPAD
$EndMODULE SOT194
$MODULE TO261AA/SOT223
Po 0 0 0 15 4FE78511 00000000 ~~
Li TO261AA/SOT223
Sc 0
AR 
Op 0 0 0
T0 0 -3400 315 315 0 59 N V 21 N "TO261AA/SOT223"
T1 0 -1200 315 315 0 59 N I 21 N "Val**"
DS 860 -1980 1320 -1980 80 21
DS 1320 -1980 1320 -520 80 21
DS 860 -1980 1320 -1980 80 26
DS 1320 -1980 1320 -520 80 26
DS -1320 -520 -1320 -1980 80 21
DS -1320 -1980 -860 -1980 80 21
DS -1320 -520 -1320 -1980 80 26
DS -1320 -1980 -860 -1980 80 26
$PAD
Sh "1" R 480 940 0 0 0
Dr 0 0 0
At SMD N 04888000
Ne 0 ""
Po -1000 0
$EndPAD
$PAD
Sh "2" R 480 940 0 0 1800
Dr 0 0 0
At SMD N 04888000
Ne 0 ""
Po 0 0
$EndPAD
$PAD
Sh "3" R 480 940 0 0 1800
Dr 0 0 0
At SMD N 04888000
Ne 0 ""
Po 1000 0
$EndPAD
$PAD
Sh "4" R 1420 940 0 0 0
Dr 0 0 0
At SMD N 04888000
Ne 0 ""
Po 0 -2500
$EndPAD
$SHAPE3D
Na "walter/smd_trans/sot223.wrl"
Sc 1.1 1 1
Of 0 0.13 0
Ro 0 0 0
$EndSHAPE3D
$EndMODULE TO261AA/SOT223
$MODULE TO263AA
Po 0 0 0 15 4EB2DA29 00000000 ~~
Li TO263AA
Sc 0
AR 
Op 0 0 0
T0 3400 -2400 315 315 0 59 N V 21 N "TO263AA"
T1 3400 0 315 315 0 59 N I 21 N "Val**"
DS 4950 -2020 4950 2030 80 21
DS 4950 -2020 4950 2030 80 26
DS 1070 -1450 1150 -1450 80 21
DS 1150 -1450 1150 -2020 80 21
DS 1150 -2020 5500 -2020 80 21
DS 5500 -2020 5500 2030 80 21
DS 5500 2030 1150 2030 80 21
DS 1150 2030 1150 1450 80 21
DS 1070 -1450 1150 -1450 80 26
DS 1150 -1450 1150 -2020 80 26
DS 1150 -2020 5500 -2020 80 26
DS 5500 -2020 5500 2030 80 26
DS 5500 2030 1150 2030 80 26
DS 1150 2030 1150 1450 80 26
$PAD
Sh "1" R 2000 600 0 0 0
Dr 0 0 0
At SMD N 04888000
Ne 0 ""
Po 0 -1000
$EndPAD
$PAD
Sh "2" R 2000 600 0 0 0
Dr 0 0 0
At SMD N 04888000
Ne 0 ""
Po 0 0
$EndPAD
$PAD
Sh "3" R 2000 600 0 0 0
Dr 0 0 0
At SMD N 04888000
Ne 0 ""
Po 0 1000
$EndPAD
$EndMODULE TO263AA
$MODULE TO263AB
Po 0 0 0 15 4EB2DAC1 00000000 ~~
Li TO263AB
Sc 0
AR 
Op 0 0 0
T0 0 -2250 315 315 0 59 N V 21 N "TO263AB"
T1 0 0 315 315 0 59 N I 21 N "Val**"
DS 1200 1600 1200 2030 80 21
DS 1200 1600 1200 2030 80 26
DS 1200 -2020 1200 -1600 80 21
DS 1200 -2020 1200 -1600 80 26
DS 1750 1600 1750 2030 80 21
DS 1750 2030 -2600 2030 80 21
DS -2600 2030 -2600 1450 80 21
DS 1750 1600 1750 2030 80 26
DS 1750 2030 -2600 2030 80 26
DS -2600 2030 -2600 1450 80 26
DS -2680 -1450 -2600 -1450 80 21
DS -2600 -1450 -2600 -2020 80 21
DS -2600 -2020 1750 -2020 80 21
DS 1750 -2020 1750 -1600 80 21
DS -2680 -1450 -2600 -1450 80 26
DS -2600 -1450 -2600 -2020 80 26
DS -2600 -2020 1750 -2020 80 26
DS 1750 -2020 1750 -1600 80 26
$PAD
Sh "1" R 2000 600 0 0 0
Dr 0 0 0
At SMD N 04888000
Ne 0 ""
Po -3750 -1000
$EndPAD
$PAD
Sh "3" R 2000 600 0 0 0
Dr 0 0 0
At SMD N 04888000
Ne 0 ""
Po -3750 1000
$EndPAD
$PAD
Sh "2" R 4000 2740 0 0 0
Dr 0 0 0
At SMD N 04888000
Ne 0 ""
Po 0 0
$EndPAD
$EndMODULE TO263AB
$EndLIBRARY
