#VRML V2.0 utf8
#Exported from Wings 3D 1.4.1
DEF cube5_copy11 Transform {
  children [
    Shape {
      appearance Appearance {
        material DEF PIN Material {
          diffuseColor 1.0 0.8403508771929825 0.3933333333333333
          emissiveColor 0.0 0.0 0.0
          specularColor 1.0 1.0 1.0
          ambientIntensity 0.7675736961451247
          transparency 0.0
          shininess 1.0
        }
      }
      geometry IndexedFaceSet {
        normalPerVertex TRUE
        coord Coordinate { point [
          -4.1259760000000005 -0.125984 0.8740140000000001,
          -4.1259760000000005 0.125984 0.8740140000000001,
          -3.874008 0.125984 0.8740140000000001,
          -3.874008 -0.125984 0.8740140000000001,
          -4.1259760000000005 0.1259839999999998 1.125982,
          -3.874008 0.1259839999999998 1.125982,
          -4.1259760000000005 0.1259839999999998 0.8740140000000001,
          -3.874008 0.1259839999999998 0.8740140000000001,
          -4.1259760000000005 -0.12598400000000012 0.9578720999996452,
          -4.1259760000000005 -0.09619649044644073 1.0297855095532935,
          -4.1259760000000005 0.04212589999998601 1.125982,
          -4.1259760000000005 -0.02978750955356729 1.0961944904464405,
          -3.874008 -0.12598400000000012 0.9578720999996452,
          -3.874008 -0.09619649044644073 1.0297855095532935,
          -3.874008 -0.02978750955356729 1.0961944904464405,
          -3.874008 0.04212589999998601 1.125982,
          -4.1259760000000005 -0.125984 -1.2795249999998752,
          -4.1259760000000005 0.125984 -1.2795249999998752,
          -3.874008 0.125984 -1.2795249999998752,
          -3.874008 -0.125984 -1.2795249999998752,
          -4.1259760000000005 4.980305000000138 1.125982,
          -3.874008 4.980305000000138 1.125982,
          -4.1259760000000005 4.980305000000138 0.8740140000000001,
          -3.874008 4.980305000000138 0.8740140000000001,
          -4.066921000000006 -0.06692900000000651 -1.3385799999999999,
          -4.066921000000006 0.06692900000000651 -1.3385799999999999,
          -3.9330629999999935 0.06692900000000651 -1.3385799999999999,
          -3.9330629999999935 -0.06692900000000651 -1.3385799999999999,
          -4.066921000000006 5.03936 1.0669269999998754,
          -3.9330629999999935 5.03936 1.0669269999998754,
          -3.9330629999999935 5.03936 0.9330690000001247,
          -4.066921000000006 5.03936 0.9330690000001247 ] }
        coordIndex [
          0, 1, 17, 16, -1,
          0, 3, 12, 8, -1,
          0, 8, 9, 11, 10, 4, 6, 1, -1,
          0, 16, 19, 3, -1,
          1, 2, 18, 17, -1,
          1, 6, 7, 2, -1,
          2, 3, 19, 18, -1,
          2, 7, 5, 15, 14, 13, 12, 3, -1,
          4, 5, 21, 20, -1,
          4, 10, 15, 5, -1,
          4, 20, 22, 6, -1,
          5, 7, 23, 21, -1,
          6, 22, 23, 7, -1,
          8, 12, 13, 9, -1,
          9, 13, 14, 11, -1,
          10, 11, 14, 15, -1,
          16, 17, 25, 24, -1,
          16, 24, 27, 19, -1,
          17, 18, 26, 25, -1,
          18, 19, 27, 26, -1,
          20, 21, 29, 28, -1,
          20, 28, 31, 22, -1,
          21, 23, 30, 29, -1,
          22, 31, 30, 23, -1,
          24, 25, 26, 27, -1,
          28, 29, 30, 31, -1 ]
        normal Normal { vector [
          -0.7071067811865475 -0.7071067811865475 -4.680801433285574e-16,
          -0.8944271909999159 0.4472135954999579 0.0,
          0.8944271909999162 0.4472135954999572 0.0,
          0.7071067811865471 -0.7071067811865479 -4.680801433285572e-16,
          -0.7071067811865475 0.0 0.7071067811865475,
          0.7071067811865475 -7.229177623904108e-16 0.7071067811865475,
          -0.8944271909999159 0.0 -0.4472135954999579,
          0.8944271909999159 -9.144266760584434e-16 -0.4472135954999579,
          -0.45418154824956686 -0.8737905847217378 0.17380775380077207,
          -0.4541815482495378 -0.7407638891298587 0.4949626064571535,
          -0.4541815482495836 -0.17380775380097602 0.8737905847216885,
          -0.45418154824966867 -0.4949626064588158 0.7407638891286678,
          0.4541815482495666 -0.873790584721738 0.17380775380077196,
          0.45418154824953755 -0.7407638891298591 0.49496260645715323,
          0.45418154824966844 -0.4949626064588164 0.7407638891286674,
          0.4541815482495836 -0.17380775380097696 0.8737905847216885,
          -0.6101314768990477 -0.6101314768990499 -0.5054494651238349,
          -0.6101314768990477 0.6101314768990499 -0.5054494651238349,
          0.6101314768990496 0.6101314768990498 -0.5054494651238329,
          0.6101314768990496 -0.6101314768990498 -0.5054494651238329,
          -0.6101314768985758 0.505449465125313 0.6101314768982974,
          0.6101314768985776 0.505449465125311 0.6101314768982973,
          -0.6101314768985758 0.505449465125313 -0.6101314768982974,
          0.6101314768985776 0.505449465125311 -0.6101314768982973,
          -0.2705980500735024 -0.27059805007350474 -0.9238795325110494,
          -0.2705980500735024 0.27059805007350474 -0.9238795325110494,
          0.2705980500735048 0.2705980500735051 -0.9238795325110486,
          0.2705980500735048 -0.2705980500735051 -0.9238795325110486,
          -0.27059805007263543 0.9238795325116453 0.2705980500723373,
          0.2705980500726378 0.9238795325116446 0.27059805007233767,
          0.2705980500726378 0.9238795325116446 -0.27059805007233767,
          -0.27059805007263543 0.9238795325116453 -0.2705980500723373 ] }
        normalIndex [
          0, 1, 17, 16, -1,
          0, 3, 12, 8, -1,
          0, 8, 9, 11, 10, 4, 6, 1, -1,
          0, 16, 19, 3, -1,
          1, 2, 18, 17, -1,
          1, 6, 7, 2, -1,
          2, 3, 19, 18, -1,
          2, 7, 5, 15, 14, 13, 12, 3, -1,
          4, 5, 21, 20, -1,
          4, 10, 15, 5, -1,
          4, 20, 22, 6, -1,
          5, 7, 23, 21, -1,
          6, 22, 23, 7, -1,
          8, 12, 13, 9, -1,
          9, 13, 14, 11, -1,
          10, 11, 14, 15, -1,
          16, 17, 25, 24, -1,
          16, 24, 27, 19, -1,
          17, 18, 26, 25, -1,
          18, 19, 27, 26, -1,
          20, 21, 29, 28, -1,
          20, 28, 31, 22, -1,
          21, 23, 30, 29, -1,
          22, 31, 30, 23, -1,
          24, 25, 26, 27, -1,
          28, 29, 30, 31, -1 ]
      }
    }
  ]
}

DEF cube5_copy10 Transform {
  children [
    Shape {
      appearance Appearance {
        material USE PIN
      }
      geometry IndexedFaceSet {
        normalPerVertex TRUE
        coord Coordinate { point [
          3.874008 -0.125984 0.8740140000000001,
          3.874008 0.125984 0.8740140000000001,
          4.1259760000000005 0.125984 0.8740140000000001,
          4.1259760000000005 -0.125984 0.8740140000000001,
          3.874008 0.1259839999999998 1.125982,
          4.1259760000000005 0.1259839999999998 1.125982,
          3.874008 0.1259839999999998 0.8740140000000001,
          4.1259760000000005 0.1259839999999998 0.8740140000000001,
          3.874008 -0.12598400000000012 0.9578720999996452,
          3.874008 -0.09619649044644073 1.0297855095532935,
          3.874008 0.04212589999998601 1.125982,
          3.874008 -0.02978750955356729 1.0961944904464405,
          4.1259760000000005 -0.12598400000000012 0.9578720999996452,
          4.1259760000000005 -0.09619649044644073 1.0297855095532935,
          4.1259760000000005 -0.02978750955356729 1.0961944904464405,
          4.1259760000000005 0.04212589999998601 1.125982,
          3.874008 -0.125984 -1.2795249999998752,
          3.874008 0.125984 -1.2795249999998752,
          4.1259760000000005 0.125984 -1.2795249999998752,
          4.1259760000000005 -0.125984 -1.2795249999998752,
          3.874008 4.980305000000138 1.125982,
          4.1259760000000005 4.980305000000138 1.125982,
          3.874008 4.980305000000138 0.8740140000000001,
          4.1259760000000005 4.980305000000138 0.8740140000000001,
          3.9330629999999935 -0.06692900000000651 -1.3385799999999999,
          3.9330629999999935 0.06692900000000651 -1.3385799999999999,
          4.066921000000006 0.06692900000000651 -1.3385799999999999,
          4.066921000000006 -0.06692900000000651 -1.3385799999999999,
          3.9330629999999935 5.03936 1.0669269999998754,
          4.066921000000006 5.03936 1.0669269999998754,
          4.066921000000006 5.03936 0.9330690000001247,
          3.9330629999999935 5.03936 0.9330690000001247 ] }
        coordIndex [
          0, 1, 17, 16, -1,
          0, 3, 12, 8, -1,
          0, 8, 9, 11, 10, 4, 6, 1, -1,
          0, 16, 19, 3, -1,
          1, 2, 18, 17, -1,
          1, 6, 7, 2, -1,
          2, 3, 19, 18, -1,
          2, 7, 5, 15, 14, 13, 12, 3, -1,
          4, 5, 21, 20, -1,
          4, 10, 15, 5, -1,
          4, 20, 22, 6, -1,
          5, 7, 23, 21, -1,
          6, 22, 23, 7, -1,
          8, 12, 13, 9, -1,
          9, 13, 14, 11, -1,
          10, 11, 14, 15, -1,
          16, 17, 25, 24, -1,
          16, 24, 27, 19, -1,
          17, 18, 26, 25, -1,
          18, 19, 27, 26, -1,
          20, 21, 29, 28, -1,
          20, 28, 31, 22, -1,
          21, 23, 30, 29, -1,
          22, 31, 30, 23, -1,
          24, 25, 26, 27, -1,
          28, 29, 30, 31, -1 ]
        normal Normal { vector [
          -0.7071067811865471 -0.7071067811865479 -4.680801433285572e-16,
          -0.8944271909999162 0.4472135954999572 0.0,
          0.8944271909999155 0.44721359549995865 0.0,
          0.7071067811865479 -0.7071067811865472 -4.680801433285576e-16,
          -0.7071067811865475 -7.229177623904108e-16 0.7071067811865475,
          0.7071067811865475 7.229177623904108e-16 0.7071067811865475,
          -0.8944271909999159 -9.144266760584434e-16 -0.4472135954999579,
          0.8944271909999159 9.144266760584434e-16 -0.4472135954999579,
          -0.4541815482495666 -0.873790584721738 0.17380775380077196,
          -0.45418154824953755 -0.7407638891298591 0.49496260645715323,
          -0.4541815482495836 -0.17380775380097696 0.8737905847216885,
          -0.45418154824966844 -0.4949626064588164 0.7407638891286674,
          0.45418154824956736 -0.8737905847217377 0.17380775380077226,
          0.4541815482495382 -0.7407638891298584 0.49496260645715395,
          0.45418154824966894 -0.49496260645881507 0.7407638891286682,
          0.45418154824958373 -0.17380775380097513 0.8737905847216886,
          -0.6101314768990496 -0.6101314768990498 -0.5054494651238329,
          -0.6101314768990496 0.6101314768990498 -0.5054494651238329,
          0.6101314768990477 0.6101314768990499 -0.5054494651238349,
          0.6101314768990477 -0.6101314768990499 -0.5054494651238349,
          -0.6101314768985776 0.505449465125311 0.6101314768982973,
          0.6101314768985758 0.505449465125313 0.6101314768982974,
          -0.6101314768985776 0.505449465125311 -0.6101314768982973,
          0.6101314768985758 0.505449465125313 -0.6101314768982974,
          -0.2705980500735048 -0.2705980500735051 -0.9238795325110486,
          -0.2705980500735048 0.2705980500735051 -0.9238795325110486,
          0.2705980500735024 0.27059805007350474 -0.9238795325110494,
          0.2705980500735024 -0.27059805007350474 -0.9238795325110494,
          -0.2705980500726378 0.9238795325116446 0.27059805007233767,
          0.27059805007263543 0.9238795325116453 0.2705980500723373,
          0.27059805007263543 0.9238795325116453 -0.2705980500723373,
          -0.2705980500726378 0.9238795325116446 -0.27059805007233767 ] }
        normalIndex [
          0, 1, 17, 16, -1,
          0, 3, 12, 8, -1,
          0, 8, 9, 11, 10, 4, 6, 1, -1,
          0, 16, 19, 3, -1,
          1, 2, 18, 17, -1,
          1, 6, 7, 2, -1,
          2, 3, 19, 18, -1,
          2, 7, 5, 15, 14, 13, 12, 3, -1,
          4, 5, 21, 20, -1,
          4, 10, 15, 5, -1,
          4, 20, 22, 6, -1,
          5, 7, 23, 21, -1,
          6, 22, 23, 7, -1,
          8, 12, 13, 9, -1,
          9, 13, 14, 11, -1,
          10, 11, 14, 15, -1,
          16, 17, 25, 24, -1,
          16, 24, 27, 19, -1,
          17, 18, 26, 25, -1,
          18, 19, 27, 26, -1,
          20, 21, 29, 28, -1,
          20, 28, 31, 22, -1,
          21, 23, 30, 29, -1,
          22, 31, 30, 23, -1,
          24, 25, 26, 27, -1,
          28, 29, 30, 31, -1 ]
      }
    }
  ]
}

DEF cube5_copy9 Transform {
  children [
    Shape {
      appearance Appearance {
        material USE PIN
      }
      geometry IndexedFaceSet {
        normalPerVertex TRUE
        coord Coordinate { point [
          -3.125978 -0.125984 0.8740140000000001,
          -3.125978 0.125984 0.8740140000000001,
          -2.8740099999999997 0.125984 0.8740140000000001,
          -2.8740099999999997 -0.125984 0.8740140000000001,
          -3.125978 0.1259839999999998 1.125982,
          -2.8740099999999997 0.1259839999999998 1.125982,
          -3.125978 0.1259839999999998 0.8740140000000001,
          -2.8740099999999997 0.1259839999999998 0.8740140000000001,
          -3.125978 -0.12598400000000012 0.9578720999996452,
          -3.125978 -0.09619649044644073 1.0297855095532935,
          -3.125978 0.04212589999998601 1.125982,
          -3.125978 -0.02978750955356729 1.0961944904464405,
          -2.8740099999999997 -0.12598400000000012 0.9578720999996452,
          -2.8740099999999997 -0.09619649044644073 1.0297855095532935,
          -2.8740099999999997 -0.02978750955356729 1.0961944904464405,
          -2.8740099999999997 0.04212589999998601 1.125982,
          -3.125978 -0.125984 -1.2795249999998752,
          -3.125978 0.125984 -1.2795249999998752,
          -2.8740099999999997 0.125984 -1.2795249999998752,
          -2.8740099999999997 -0.125984 -1.2795249999998752,
          -3.125978 4.980305000000138 1.125982,
          -2.8740099999999997 4.980305000000138 1.125982,
          -3.125978 4.980305000000138 0.8740140000000001,
          -2.8740099999999997 4.980305000000138 0.8740140000000001,
          -3.0669230000000067 -0.06692900000000651 -1.3385799999999999,
          -3.0669230000000067 0.06692900000000651 -1.3385799999999999,
          -2.9330649999999934 0.06692900000000651 -1.3385799999999999,
          -2.9330649999999934 -0.06692900000000651 -1.3385799999999999,
          -3.0669230000000067 5.03936 1.0669269999998754,
          -2.9330649999999934 5.03936 1.0669269999998754,
          -2.9330649999999934 5.03936 0.9330690000001247,
          -3.0669230000000067 5.03936 0.9330690000001247 ] }
        coordIndex [
          0, 1, 17, 16, -1,
          0, 3, 12, 8, -1,
          0, 8, 9, 11, 10, 4, 6, 1, -1,
          0, 16, 19, 3, -1,
          1, 2, 18, 17, -1,
          1, 6, 7, 2, -1,
          2, 3, 19, 18, -1,
          2, 7, 5, 15, 14, 13, 12, 3, -1,
          4, 5, 21, 20, -1,
          4, 10, 15, 5, -1,
          4, 20, 22, 6, -1,
          5, 7, 23, 21, -1,
          6, 22, 23, 7, -1,
          8, 12, 13, 9, -1,
          9, 13, 14, 11, -1,
          10, 11, 14, 15, -1,
          16, 17, 25, 24, -1,
          16, 24, 27, 19, -1,
          17, 18, 26, 25, -1,
          18, 19, 27, 26, -1,
          20, 21, 29, 28, -1,
          20, 28, 31, 22, -1,
          21, 23, 30, 29, -1,
          22, 31, 30, 23, -1,
          24, 25, 26, 27, -1,
          28, 29, 30, 31, -1 ]
        normal Normal { vector [
          -0.7071067811865475 -0.7071067811865475 -4.680801433285574e-16,
          -0.8944271909999159 0.4472135954999579 0.0,
          0.8944271909999159 0.4472135954999581 0.0,
          0.7071067811865476 -0.7071067811865475 -4.6808014332855745e-16,
          -0.7071067811865475 0.0 0.7071067811865475,
          0.7071067811865475 1.807294405976027e-16 0.7071067811865475,
          -0.8944271909999159 0.0 -0.4472135954999579,
          0.8944271909999159 2.2860666901461086e-16 -0.4472135954999579,
          -0.45418154824956686 -0.8737905847217378 0.17380775380077207,
          -0.4541815482495378 -0.7407638891298587 0.4949626064571535,
          -0.4541815482495836 -0.17380775380097607 0.8737905847216885,
          -0.45418154824966867 -0.4949626064588158 0.7407638891286679,
          0.45418154824956697 -0.8737905847217378 0.17380775380077212,
          0.45418154824953794 -0.7407638891298587 0.4949626064571536,
          0.4541815482496687 -0.4949626064588157 0.740763889128668,
          0.45418154824958373 -0.17380775380097588 0.8737905847216886,
          -0.6101314768990505 -0.6101314768990498 -0.5054494651238319,
          -0.6101314768990505 0.6101314768990498 -0.5054494651238319,
          0.6101314768990496 0.6101314768990498 -0.5054494651238329,
          0.6101314768990496 -0.6101314768990498 -0.5054494651238329,
          -0.6101314768985786 0.50544946512531 0.6101314768982973,
          0.6101314768985776 0.505449465125311 0.6101314768982973,
          -0.6101314768985786 0.50544946512531 -0.6101314768982973,
          0.6101314768985776 0.505449465125311 -0.6101314768982973,
          -0.270598050073506 -0.2705980500735053 -0.9238795325110483,
          -0.270598050073506 0.2705980500735053 -0.9238795325110483,
          0.2705980500735048 0.2705980500735051 -0.9238795325110486,
          0.2705980500735048 -0.2705980500735051 -0.9238795325110486,
          -0.270598050072639 0.9238795325116442 0.27059805007233784,
          0.2705980500726378 0.9238795325116446 0.27059805007233767,
          0.2705980500726378 0.9238795325116446 -0.27059805007233767,
          -0.270598050072639 0.9238795325116442 -0.27059805007233784 ] }
        normalIndex [
          0, 1, 17, 16, -1,
          0, 3, 12, 8, -1,
          0, 8, 9, 11, 10, 4, 6, 1, -1,
          0, 16, 19, 3, -1,
          1, 2, 18, 17, -1,
          1, 6, 7, 2, -1,
          2, 3, 19, 18, -1,
          2, 7, 5, 15, 14, 13, 12, 3, -1,
          4, 5, 21, 20, -1,
          4, 10, 15, 5, -1,
          4, 20, 22, 6, -1,
          5, 7, 23, 21, -1,
          6, 22, 23, 7, -1,
          8, 12, 13, 9, -1,
          9, 13, 14, 11, -1,
          10, 11, 14, 15, -1,
          16, 17, 25, 24, -1,
          16, 24, 27, 19, -1,
          17, 18, 26, 25, -1,
          18, 19, 27, 26, -1,
          20, 21, 29, 28, -1,
          20, 28, 31, 22, -1,
          21, 23, 30, 29, -1,
          22, 31, 30, 23, -1,
          24, 25, 26, 27, -1,
          28, 29, 30, 31, -1 ]
      }
    }
  ]
}

DEF cube5_copy8 Transform {
  children [
    Shape {
      appearance Appearance {
        material USE PIN
      }
      geometry IndexedFaceSet {
        normalPerVertex TRUE
        coord Coordinate { point [
          2.8740099999999997 -0.125984 0.8740140000000001,
          2.8740099999999997 0.125984 0.8740140000000001,
          3.125978 0.125984 0.8740140000000001,
          3.125978 -0.125984 0.8740140000000001,
          2.8740099999999997 0.1259839999999998 1.125982,
          3.125978 0.1259839999999998 1.125982,
          2.8740099999999997 0.1259839999999998 0.8740140000000001,
          3.125978 0.1259839999999998 0.8740140000000001,
          2.8740099999999997 -0.12598400000000012 0.9578720999996452,
          2.8740099999999997 -0.09619649044644073 1.0297855095532935,
          2.8740099999999997 0.04212589999998601 1.125982,
          2.8740099999999997 -0.02978750955356729 1.0961944904464405,
          3.125978 -0.12598400000000012 0.9578720999996452,
          3.125978 -0.09619649044644073 1.0297855095532935,
          3.125978 -0.02978750955356729 1.0961944904464405,
          3.125978 0.04212589999998601 1.125982,
          2.8740099999999997 -0.125984 -1.2795249999998752,
          2.8740099999999997 0.125984 -1.2795249999998752,
          3.125978 0.125984 -1.2795249999998752,
          3.125978 -0.125984 -1.2795249999998752,
          2.8740099999999997 4.980305000000138 1.125982,
          3.125978 4.980305000000138 1.125982,
          2.8740099999999997 4.980305000000138 0.8740140000000001,
          3.125978 4.980305000000138 0.8740140000000001,
          2.9330649999999934 -0.06692900000000651 -1.3385799999999999,
          2.9330649999999934 0.06692900000000651 -1.3385799999999999,
          3.0669230000000063 0.06692900000000651 -1.3385799999999999,
          3.0669230000000063 -0.06692900000000651 -1.3385799999999999,
          2.9330649999999934 5.03936 1.0669269999998754,
          3.0669230000000063 5.03936 1.0669269999998754,
          3.0669230000000063 5.03936 0.9330690000001247,
          2.9330649999999934 5.03936 0.9330690000001247 ] }
        coordIndex [
          0, 1, 17, 16, -1,
          0, 3, 12, 8, -1,
          0, 8, 9, 11, 10, 4, 6, 1, -1,
          0, 16, 19, 3, -1,
          1, 2, 18, 17, -1,
          1, 6, 7, 2, -1,
          2, 3, 19, 18, -1,
          2, 7, 5, 15, 14, 13, 12, 3, -1,
          4, 5, 21, 20, -1,
          4, 10, 15, 5, -1,
          4, 20, 22, 6, -1,
          5, 7, 23, 21, -1,
          6, 22, 23, 7, -1,
          8, 12, 13, 9, -1,
          9, 13, 14, 11, -1,
          10, 11, 14, 15, -1,
          16, 17, 25, 24, -1,
          16, 24, 27, 19, -1,
          17, 18, 26, 25, -1,
          18, 19, 27, 26, -1,
          20, 21, 29, 28, -1,
          20, 28, 31, 22, -1,
          21, 23, 30, 29, -1,
          22, 31, 30, 23, -1,
          24, 25, 26, 27, -1,
          28, 29, 30, 31, -1 ]
        normal Normal { vector [
          -0.7071067811865479 -0.7071067811865472 -4.680801433285576e-16,
          -0.8944271909999155 0.44721359549995865 0.0,
          0.894427190999916 0.44721359549995754 0.0,
          0.7071067811865474 -0.7071067811865477 -4.680801433285573e-16,
          -0.7071067811865475 7.229177623904108e-16 0.7071067811865475,
          0.7071067811865475 -3.614588811952054e-16 0.7071067811865475,
          -0.8944271909999159 9.144266760584434e-16 -0.4472135954999579,
          0.8944271909999159 -4.572133380292217e-16 -0.4472135954999579,
          -0.45418154824956725 -0.8737905847217375 0.1738077538007722,
          -0.4541815482495381 -0.7407638891298584 0.49496260645715384,
          -0.45418154824958373 -0.17380775380097518 0.8737905847216886,
          -0.45418154824966883 -0.4949626064588152 0.7407638891286682,
          0.4541815482495667 -0.8737905847217379 0.173807753800772,
          0.45418154824953766 -0.7407638891298589 0.49496260645715334,
          0.45418154824966855 -0.4949626064588162 0.7407638891286678,
          0.4541815482495836 -0.17380775380097654 0.8737905847216885,
          -0.6101314768990496 -0.6101314768990498 -0.505449465123833,
          -0.6101314768990496 0.6101314768990498 -0.505449465123833,
          0.6101314768990496 0.6101314768990498 -0.505449465123833,
          0.6101314768990496 -0.6101314768990498 -0.505449465123833,
          -0.6101314768985776 0.505449465125311 0.6101314768982973,
          0.6101314768985776 0.505449465125311 0.6101314768982973,
          -0.6101314768985776 0.505449465125311 -0.6101314768982973,
          0.6101314768985776 0.505449465125311 -0.6101314768982973,
          -0.2705980500735048 -0.2705980500735051 -0.9238795325110486,
          -0.2705980500735048 0.2705980500735051 -0.9238795325110486,
          0.2705980500735048 0.2705980500735051 -0.9238795325110486,
          0.2705980500735048 -0.2705980500735051 -0.9238795325110486,
          -0.2705980500726378 0.9238795325116446 0.27059805007233767,
          0.2705980500726378 0.9238795325116446 0.27059805007233767,
          0.2705980500726378 0.9238795325116446 -0.27059805007233767,
          -0.2705980500726378 0.9238795325116446 -0.27059805007233767 ] }
        normalIndex [
          0, 1, 17, 16, -1,
          0, 3, 12, 8, -1,
          0, 8, 9, 11, 10, 4, 6, 1, -1,
          0, 16, 19, 3, -1,
          1, 2, 18, 17, -1,
          1, 6, 7, 2, -1,
          2, 3, 19, 18, -1,
          2, 7, 5, 15, 14, 13, 12, 3, -1,
          4, 5, 21, 20, -1,
          4, 10, 15, 5, -1,
          4, 20, 22, 6, -1,
          5, 7, 23, 21, -1,
          6, 22, 23, 7, -1,
          8, 12, 13, 9, -1,
          9, 13, 14, 11, -1,
          10, 11, 14, 15, -1,
          16, 17, 25, 24, -1,
          16, 24, 27, 19, -1,
          17, 18, 26, 25, -1,
          18, 19, 27, 26, -1,
          20, 21, 29, 28, -1,
          20, 28, 31, 22, -1,
          21, 23, 30, 29, -1,
          22, 31, 30, 23, -1,
          24, 25, 26, 27, -1,
          28, 29, 30, 31, -1 ]
      }
    }
  ]
}

DEF cube5_copy7 Transform {
  children [
    Shape {
      appearance Appearance {
        material USE PIN
      }
      geometry IndexedFaceSet {
        normalPerVertex TRUE
        coord Coordinate { point [
          -2.12598 -0.125984 0.8740140000000001,
          -2.12598 0.125984 0.8740140000000001,
          -1.8740119999999998 0.125984 0.8740140000000001,
          -1.8740119999999998 -0.125984 0.8740140000000001,
          -2.12598 0.1259839999999998 1.125982,
          -1.8740119999999998 0.1259839999999998 1.125982,
          -2.12598 0.1259839999999998 0.8740140000000001,
          -1.8740119999999998 0.1259839999999998 0.8740140000000001,
          -2.12598 -0.12598400000000012 0.9578720999996452,
          -2.12598 -0.09619649044644073 1.0297855095532935,
          -2.12598 0.04212589999998601 1.125982,
          -2.12598 -0.02978750955356729 1.0961944904464405,
          -1.8740119999999998 -0.12598400000000012 0.9578720999996452,
          -1.8740119999999998 -0.09619649044644073 1.0297855095532935,
          -1.8740119999999998 -0.02978750955356729 1.0961944904464405,
          -1.8740119999999998 0.04212589999998601 1.125982,
          -2.12598 -0.125984 -1.2795249999998752,
          -2.12598 0.125984 -1.2795249999998752,
          -1.8740119999999998 0.125984 -1.2795249999998752,
          -1.8740119999999998 -0.125984 -1.2795249999998752,
          -2.12598 4.980305000000138 1.125982,
          -1.8740119999999998 4.980305000000138 1.125982,
          -2.12598 4.980305000000138 0.8740140000000001,
          -1.8740119999999998 4.980305000000138 0.8740140000000001,
          -2.0669250000000066 -0.06692900000000651 -1.3385799999999999,
          -2.0669250000000066 0.06692900000000651 -1.3385799999999999,
          -1.9330669999999934 0.06692900000000651 -1.3385799999999999,
          -1.9330669999999934 -0.06692900000000651 -1.3385799999999999,
          -2.0669250000000066 5.03936 1.0669269999998754,
          -1.9330669999999934 5.03936 1.0669269999998754,
          -1.9330669999999934 5.03936 0.9330690000001247,
          -2.0669250000000066 5.03936 0.9330690000001247 ] }
        coordIndex [
          0, 1, 17, 16, -1,
          0, 3, 12, 8, -1,
          0, 8, 9, 11, 10, 4, 6, 1, -1,
          0, 16, 19, 3, -1,
          1, 2, 18, 17, -1,
          1, 6, 7, 2, -1,
          2, 3, 19, 18, -1,
          2, 7, 5, 15, 14, 13, 12, 3, -1,
          4, 5, 21, 20, -1,
          4, 10, 15, 5, -1,
          4, 20, 22, 6, -1,
          5, 7, 23, 21, -1,
          6, 22, 23, 7, -1,
          8, 12, 13, 9, -1,
          9, 13, 14, 11, -1,
          10, 11, 14, 15, -1,
          16, 17, 25, 24, -1,
          16, 24, 27, 19, -1,
          17, 18, 26, 25, -1,
          18, 19, 27, 26, -1,
          20, 21, 29, 28, -1,
          20, 28, 31, 22, -1,
          21, 23, 30, 29, -1,
          22, 31, 30, 23, -1,
          24, 25, 26, 27, -1,
          28, 29, 30, 31, -1 ]
        normal Normal { vector [
          -0.7071067811865475 -0.7071067811865475 -4.680801433285573e-16,
          -0.8944271909999159 0.4472135954999579 0.0,
          0.894427190999916 0.44721359549995754 0.0,
          0.7071067811865474 -0.7071067811865477 -4.680801433285572e-16,
          -0.7071067811865475 0.0 0.7071067811865475,
          0.7071067811865475 -3.614588811952054e-16 0.7071067811865475,
          -0.8944271909999159 0.0 -0.4472135954999579,
          0.8944271909999159 -4.572133380292217e-16 -0.4472135954999579,
          -0.45418154824956686 -0.8737905847217378 0.17380775380077207,
          -0.4541815482495378 -0.7407638891298587 0.4949626064571535,
          -0.4541815482495836 -0.17380775380097602 0.8737905847216885,
          -0.45418154824966867 -0.4949626064588158 0.7407638891286679,
          0.4541815482495667 -0.8737905847217379 0.173807753800772,
          0.45418154824953766 -0.7407638891298589 0.49496260645715334,
          0.45418154824966855 -0.49496260645881607 0.7407638891286678,
          0.4541815482495836 -0.1738077538009765 0.8737905847216885,
          -0.6101314768990496 -0.6101314768990498 -0.5054494651238329,
          -0.6101314768990496 0.6101314768990498 -0.5054494651238329,
          0.6101314768990496 0.6101314768990498 -0.5054494651238329,
          0.6101314768990496 -0.6101314768990498 -0.5054494651238329,
          -0.6101314768985776 0.505449465125311 0.6101314768982973,
          0.6101314768985776 0.505449465125311 0.6101314768982973,
          -0.6101314768985776 0.505449465125311 -0.6101314768982973,
          0.6101314768985776 0.505449465125311 -0.6101314768982973,
          -0.2705980500735048 -0.2705980500735051 -0.9238795325110486,
          -0.2705980500735048 0.2705980500735051 -0.9238795325110486,
          0.2705980500735048 0.2705980500735051 -0.9238795325110486,
          0.2705980500735048 -0.2705980500735051 -0.9238795325110486,
          -0.2705980500726378 0.9238795325116446 0.27059805007233767,
          0.2705980500726378 0.9238795325116446 0.27059805007233767,
          0.2705980500726378 0.9238795325116446 -0.27059805007233767,
          -0.2705980500726378 0.9238795325116446 -0.27059805007233767 ] }
        normalIndex [
          0, 1, 17, 16, -1,
          0, 3, 12, 8, -1,
          0, 8, 9, 11, 10, 4, 6, 1, -1,
          0, 16, 19, 3, -1,
          1, 2, 18, 17, -1,
          1, 6, 7, 2, -1,
          2, 3, 19, 18, -1,
          2, 7, 5, 15, 14, 13, 12, 3, -1,
          4, 5, 21, 20, -1,
          4, 10, 15, 5, -1,
          4, 20, 22, 6, -1,
          5, 7, 23, 21, -1,
          6, 22, 23, 7, -1,
          8, 12, 13, 9, -1,
          9, 13, 14, 11, -1,
          10, 11, 14, 15, -1,
          16, 17, 25, 24, -1,
          16, 24, 27, 19, -1,
          17, 18, 26, 25, -1,
          18, 19, 27, 26, -1,
          20, 21, 29, 28, -1,
          20, 28, 31, 22, -1,
          21, 23, 30, 29, -1,
          22, 31, 30, 23, -1,
          24, 25, 26, 27, -1,
          28, 29, 30, 31, -1 ]
      }
    }
  ]
}

DEF cube5_copy6 Transform {
  children [
    Shape {
      appearance Appearance {
        material USE PIN
      }
      geometry IndexedFaceSet {
        normalPerVertex TRUE
        coord Coordinate { point [
          1.8740119999999998 -0.125984 0.8740140000000001,
          1.8740119999999998 0.125984 0.8740140000000001,
          2.1259799999999998 0.125984 0.8740140000000001,
          2.1259799999999998 -0.125984 0.8740140000000001,
          1.8740119999999998 0.1259839999999998 1.125982,
          2.1259799999999998 0.1259839999999998 1.125982,
          1.8740119999999998 0.1259839999999998 0.8740140000000001,
          2.1259799999999998 0.1259839999999998 0.8740140000000001,
          1.8740119999999998 -0.12598400000000012 0.9578720999996452,
          1.8740119999999998 -0.09619649044644073 1.0297855095532935,
          1.8740119999999998 0.04212589999998601 1.125982,
          1.8740119999999998 -0.02978750955356729 1.0961944904464405,
          2.1259799999999998 -0.12598400000000012 0.9578720999996452,
          2.1259799999999998 -0.09619649044644073 1.0297855095532935,
          2.1259799999999998 -0.02978750955356729 1.0961944904464405,
          2.1259799999999998 0.04212589999998601 1.125982,
          1.8740119999999998 -0.125984 -1.2795249999998752,
          1.8740119999999998 0.125984 -1.2795249999998752,
          2.1259799999999998 0.125984 -1.2795249999998752,
          2.1259799999999998 -0.125984 -1.2795249999998752,
          1.8740119999999998 4.980305000000138 1.125982,
          2.1259799999999998 4.980305000000138 1.125982,
          1.8740119999999998 4.980305000000138 0.8740140000000001,
          2.1259799999999998 4.980305000000138 0.8740140000000001,
          1.9330669999999934 -0.06692900000000651 -1.3385799999999999,
          1.9330669999999934 0.06692900000000651 -1.3385799999999999,
          2.066925000000006 0.06692900000000651 -1.3385799999999999,
          2.066925000000006 -0.06692900000000651 -1.3385799999999999,
          1.9330669999999934 5.03936 1.0669269999998754,
          2.066925000000006 5.03936 1.0669269999998754,
          2.066925000000006 5.03936 0.9330690000001247,
          1.9330669999999934 5.03936 0.9330690000001247 ] }
        coordIndex [
          0, 1, 17, 16, -1,
          0, 3, 12, 8, -1,
          0, 8, 9, 11, 10, 4, 6, 1, -1,
          0, 16, 19, 3, -1,
          1, 2, 18, 17, -1,
          1, 6, 7, 2, -1,
          2, 3, 19, 18, -1,
          2, 7, 5, 15, 14, 13, 12, 3, -1,
          4, 5, 21, 20, -1,
          4, 10, 15, 5, -1,
          4, 20, 22, 6, -1,
          5, 7, 23, 21, -1,
          6, 22, 23, 7, -1,
          8, 12, 13, 9, -1,
          9, 13, 14, 11, -1,
          10, 11, 14, 15, -1,
          16, 17, 25, 24, -1,
          16, 24, 27, 19, -1,
          17, 18, 26, 25, -1,
          18, 19, 27, 26, -1,
          20, 21, 29, 28, -1,
          20, 28, 31, 22, -1,
          21, 23, 30, 29, -1,
          22, 31, 30, 23, -1,
          24, 25, 26, 27, -1,
          28, 29, 30, 31, -1 ]
        normal Normal { vector [
          -0.7071067811865477 -0.7071067811865474 -4.6808014332855745e-16,
          -0.8944271909999156 0.4472135954999583 0.0,
          0.894427190999916 0.44721359549995776 0.0,
          0.7071067811865475 -0.7071067811865477 -4.680801433285574e-16,
          -0.7071067811865475 3.614588811952054e-16 0.7071067811865475,
          0.7071067811865475 -1.807294405976027e-16 0.7071067811865475,
          -0.8944271909999159 4.572133380292217e-16 -0.4472135954999579,
          0.8944271909999159 -2.2860666901461086e-16 -0.4472135954999579,
          -0.4541815482495671 -0.8737905847217378 0.17380775380077215,
          -0.45418154824953805 -0.7407638891298586 0.49496260645715373,
          -0.45418154824958373 -0.1738077538009756 0.8737905847216886,
          -0.45418154824966883 -0.49496260645881546 0.7407638891286681,
          0.4541815482495668 -0.8737905847217378 0.17380775380077204,
          0.45418154824953777 -0.7407638891298589 0.49496260645715345,
          0.45418154824966867 -0.49496260645881596 0.7407638891286678,
          0.4541815482495836 -0.17380775380097627 0.8737905847216885,
          -0.6101314768990496 -0.6101314768990498 -0.505449465123833,
          -0.6101314768990496 0.6101314768990498 -0.505449465123833,
          0.6101314768990496 0.6101314768990498 -0.505449465123833,
          0.6101314768990496 -0.6101314768990498 -0.505449465123833,
          -0.6101314768985776 0.5054494651253111 0.6101314768982973,
          0.6101314768985776 0.5054494651253111 0.6101314768982973,
          -0.6101314768985776 0.5054494651253111 -0.6101314768982973,
          0.6101314768985776 0.5054494651253111 -0.6101314768982973,
          -0.2705980500735048 -0.2705980500735051 -0.9238795325110486,
          -0.2705980500735048 0.2705980500735051 -0.9238795325110486,
          0.2705980500735048 0.2705980500735051 -0.9238795325110486,
          0.2705980500735048 -0.2705980500735051 -0.9238795325110486,
          -0.2705980500726378 0.9238795325116446 0.2705980500723377,
          0.2705980500726378 0.9238795325116446 0.2705980500723377,
          0.2705980500726378 0.9238795325116446 -0.2705980500723377,
          -0.2705980500726378 0.9238795325116446 -0.2705980500723377 ] }
        normalIndex [
          0, 1, 17, 16, -1,
          0, 3, 12, 8, -1,
          0, 8, 9, 11, 10, 4, 6, 1, -1,
          0, 16, 19, 3, -1,
          1, 2, 18, 17, -1,
          1, 6, 7, 2, -1,
          2, 3, 19, 18, -1,
          2, 7, 5, 15, 14, 13, 12, 3, -1,
          4, 5, 21, 20, -1,
          4, 10, 15, 5, -1,
          4, 20, 22, 6, -1,
          5, 7, 23, 21, -1,
          6, 22, 23, 7, -1,
          8, 12, 13, 9, -1,
          9, 13, 14, 11, -1,
          10, 11, 14, 15, -1,
          16, 17, 25, 24, -1,
          16, 24, 27, 19, -1,
          17, 18, 26, 25, -1,
          18, 19, 27, 26, -1,
          20, 21, 29, 28, -1,
          20, 28, 31, 22, -1,
          21, 23, 30, 29, -1,
          22, 31, 30, 23, -1,
          24, 25, 26, 27, -1,
          28, 29, 30, 31, -1 ]
      }
    }
  ]
}

DEF cube5_copy5 Transform {
  children [
    Shape {
      appearance Appearance {
        material USE PIN
      }
      geometry IndexedFaceSet {
        normalPerVertex TRUE
        coord Coordinate { point [
          0.8740139999999998 -0.125984 0.8740140000000001,
          0.8740139999999998 0.125984 0.8740140000000001,
          1.1259819999999998 0.125984 0.8740140000000001,
          1.1259819999999998 -0.125984 0.8740140000000001,
          0.8740139999999998 0.1259839999999998 1.125982,
          1.1259819999999998 0.1259839999999998 1.125982,
          0.8740139999999998 0.1259839999999998 0.8740140000000001,
          1.1259819999999998 0.1259839999999998 0.8740140000000001,
          0.8740139999999998 -0.12598400000000012 0.9578720999996452,
          0.8740139999999998 -0.09619649044644073 1.0297855095532935,
          0.8740139999999998 0.04212589999998601 1.125982,
          0.8740139999999998 -0.02978750955356729 1.0961944904464405,
          1.1259819999999998 -0.12598400000000012 0.9578720999996452,
          1.1259819999999998 -0.09619649044644073 1.0297855095532935,
          1.1259819999999998 -0.02978750955356729 1.0961944904464405,
          1.1259819999999998 0.04212589999998601 1.125982,
          0.8740139999999998 -0.125984 -1.2795249999998752,
          0.8740139999999998 0.125984 -1.2795249999998752,
          1.1259819999999998 0.125984 -1.2795249999998752,
          1.1259819999999998 -0.125984 -1.2795249999998752,
          0.8740139999999998 4.980305000000138 1.125982,
          1.1259819999999998 4.980305000000138 1.125982,
          0.8740139999999998 4.980305000000138 0.8740140000000001,
          1.1259819999999998 4.980305000000138 0.8740140000000001,
          0.9330689999999934 -0.06692900000000651 -1.3385799999999999,
          0.9330689999999934 0.06692900000000651 -1.3385799999999999,
          1.0669270000000062 0.06692900000000651 -1.3385799999999999,
          1.0669270000000062 -0.06692900000000651 -1.3385799999999999,
          0.9330689999999934 5.03936 1.0669269999998754,
          1.0669270000000062 5.03936 1.0669269999998754,
          1.0669270000000062 5.03936 0.9330690000001247,
          0.9330689999999934 5.03936 0.9330690000001247 ] }
        coordIndex [
          0, 1, 17, 16, -1,
          0, 3, 12, 8, -1,
          0, 8, 9, 11, 10, 4, 6, 1, -1,
          0, 16, 19, 3, -1,
          1, 2, 18, 17, -1,
          1, 6, 7, 2, -1,
          2, 3, 19, 18, -1,
          2, 7, 5, 15, 14, 13, 12, 3, -1,
          4, 5, 21, 20, -1,
          4, 10, 15, 5, -1,
          4, 20, 22, 6, -1,
          5, 7, 23, 21, -1,
          6, 22, 23, 7, -1,
          8, 12, 13, 9, -1,
          9, 13, 14, 11, -1,
          10, 11, 14, 15, -1,
          16, 17, 25, 24, -1,
          16, 24, 27, 19, -1,
          17, 18, 26, 25, -1,
          18, 19, 27, 26, -1,
          20, 21, 29, 28, -1,
          20, 28, 31, 22, -1,
          21, 23, 30, 29, -1,
          22, 31, 30, 23, -1,
          24, 25, 26, 27, -1,
          28, 29, 30, 31, -1 ]
        normal Normal { vector [
          -0.7071067811865475 -0.7071067811865475 -4.680801433285574e-16,
          -0.8944271909999159 0.4472135954999579 0.0,
          0.8944271909999159 0.44721359549995804 0.0,
          0.7071067811865476 -0.7071067811865475 -4.6808014332855745e-16,
          -0.7071067811865475 0.0 0.7071067811865475,
          0.7071067811865475 9.036472029880135e-17 0.7071067811865475,
          -0.8944271909999159 0.0 -0.4472135954999579,
          0.8944271909999159 1.1430333450730543e-16 -0.4472135954999579,
          -0.45418154824956686 -0.8737905847217378 0.17380775380077207,
          -0.4541815482495378 -0.7407638891298587 0.4949626064571535,
          -0.4541815482495836 -0.17380775380097602 0.8737905847216885,
          -0.45418154824966867 -0.4949626064588158 0.7407638891286678,
          0.45418154824956686 -0.8737905847217378 0.17380775380077207,
          0.4541815482495378 -0.7407638891298587 0.4949626064571535,
          0.4541815482496687 -0.4949626064588157 0.7407638891286679,
          0.45418154824958373 -0.17380775380097593 0.8737905847216886,
          -0.6101314768990498 -0.6101314768990498 -0.5054494651238326,
          -0.6101314768990498 0.6101314768990498 -0.5054494651238326,
          0.6101314768990496 0.6101314768990498 -0.5054494651238329,
          0.6101314768990496 -0.6101314768990498 -0.5054494651238329,
          -0.6101314768985778 0.5054494651253107 0.6101314768982973,
          0.6101314768985776 0.505449465125311 0.6101314768982973,
          -0.6101314768985778 0.5054494651253107 -0.6101314768982973,
          0.6101314768985776 0.505449465125311 -0.6101314768982973,
          -0.2705980500735051 -0.2705980500735052 -0.9238795325110486,
          -0.2705980500735051 0.2705980500735052 -0.9238795325110486,
          0.2705980500735048 0.2705980500735051 -0.9238795325110486,
          0.2705980500735048 -0.2705980500735051 -0.9238795325110486,
          -0.27059805007263815 0.9238795325116445 0.27059805007233767,
          0.2705980500726378 0.9238795325116446 0.27059805007233767,
          0.2705980500726378 0.9238795325116446 -0.27059805007233767,
          -0.27059805007263815 0.9238795325116445 -0.27059805007233767 ] }
        normalIndex [
          0, 1, 17, 16, -1,
          0, 3, 12, 8, -1,
          0, 8, 9, 11, 10, 4, 6, 1, -1,
          0, 16, 19, 3, -1,
          1, 2, 18, 17, -1,
          1, 6, 7, 2, -1,
          2, 3, 19, 18, -1,
          2, 7, 5, 15, 14, 13, 12, 3, -1,
          4, 5, 21, 20, -1,
          4, 10, 15, 5, -1,
          4, 20, 22, 6, -1,
          5, 7, 23, 21, -1,
          6, 22, 23, 7, -1,
          8, 12, 13, 9, -1,
          9, 13, 14, 11, -1,
          10, 11, 14, 15, -1,
          16, 17, 25, 24, -1,
          16, 24, 27, 19, -1,
          17, 18, 26, 25, -1,
          18, 19, 27, 26, -1,
          20, 21, 29, 28, -1,
          20, 28, 31, 22, -1,
          21, 23, 30, 29, -1,
          22, 31, 30, 23, -1,
          24, 25, 26, 27, -1,
          28, 29, 30, 31, -1 ]
      }
    }
  ]
}

DEF cube5_copy4 Transform {
  children [
    Shape {
      appearance Appearance {
        material USE PIN
      }
      geometry IndexedFaceSet {
        normalPerVertex TRUE
        coord Coordinate { point [
          -0.1259840000000002 -0.125984 0.8740140000000001,
          -0.1259840000000002 0.125984 0.8740140000000001,
          0.12598399999999985 0.125984 0.8740140000000001,
          0.12598399999999985 -0.125984 0.8740140000000001,
          -0.1259840000000002 0.1259839999999998 1.125982,
          0.12598399999999985 0.1259839999999998 1.125982,
          -0.1259840000000002 0.1259839999999998 0.8740140000000001,
          0.12598399999999985 0.1259839999999998 0.8740140000000001,
          -0.1259840000000002 -0.12598400000000012 0.9578720999996452,
          -0.1259840000000002 -0.09619649044644073 1.0297855095532935,
          -0.1259840000000002 0.04212589999998601 1.125982,
          -0.1259840000000002 -0.02978750955356729 1.0961944904464405,
          0.12598399999999985 -0.12598400000000012 0.9578720999996452,
          0.12598399999999985 -0.09619649044644073 1.0297855095532935,
          0.12598399999999985 -0.02978750955356729 1.0961944904464405,
          0.12598399999999985 0.04212589999998601 1.125982,
          -0.1259840000000002 -0.125984 -1.2795249999998752,
          -0.1259840000000002 0.125984 -1.2795249999998752,
          0.12598399999999985 0.125984 -1.2795249999998752,
          0.12598399999999985 -0.125984 -1.2795249999998752,
          -0.1259840000000002 4.980305000000138 1.125982,
          0.12598399999999985 4.980305000000138 1.125982,
          -0.1259840000000002 4.980305000000138 0.8740140000000001,
          0.12598399999999985 4.980305000000138 0.8740140000000001,
          -0.0669290000000067 -0.06692900000000651 -1.3385799999999999,
          -0.0669290000000067 0.06692900000000651 -1.3385799999999999,
          0.06692900000000636 0.06692900000000651 -1.3385799999999999,
          0.06692900000000636 -0.06692900000000651 -1.3385799999999999,
          -0.0669290000000067 5.03936 1.0669269999998754,
          0.06692900000000636 5.03936 1.0669269999998754,
          0.06692900000000636 5.03936 0.9330690000001247,
          -0.0669290000000067 5.03936 0.9330690000001247 ] }
        coordIndex [
          0, 1, 17, 16, -1,
          0, 3, 12, 8, -1,
          0, 8, 9, 11, 10, 4, 6, 1, -1,
          0, 16, 19, 3, -1,
          1, 2, 18, 17, -1,
          1, 6, 7, 2, -1,
          2, 3, 19, 18, -1,
          2, 7, 5, 15, 14, 13, 12, 3, -1,
          4, 5, 21, 20, -1,
          4, 10, 15, 5, -1,
          4, 20, 22, 6, -1,
          5, 7, 23, 21, -1,
          6, 22, 23, 7, -1,
          8, 12, 13, 9, -1,
          9, 13, 14, 11, -1,
          10, 11, 14, 15, -1,
          16, 17, 25, 24, -1,
          16, 24, 27, 19, -1,
          17, 18, 26, 25, -1,
          18, 19, 27, 26, -1,
          20, 21, 29, 28, -1,
          20, 28, 31, 22, -1,
          21, 23, 30, 29, -1,
          22, 31, 30, 23, -1,
          24, 25, 26, 27, -1,
          28, 29, 30, 31, -1 ]
        normal Normal { vector [
          -0.7071067811865476 -0.7071067811865475 -4.680801433285574e-16,
          -0.8944271909999159 0.44721359549995804 0.0,
          0.8944271909999159 0.4472135954999579 0.0,
          0.7071067811865475 -0.7071067811865475 -4.680801433285573e-16,
          -0.7071067811865475 4.5182360149400674e-17 0.7071067811865475,
          0.7071067811865475 1.1295590037350168e-17 0.7071067811865475,
          -0.8944271909999159 5.715166725365271e-17 -0.4472135954999579,
          0.8944271909999159 1.428791681341318e-17 -0.4472135954999579,
          -0.45418154824956686 -0.8737905847217378 0.17380775380077207,
          -0.4541815482495378 -0.7407638891298587 0.4949626064571535,
          -0.45418154824958373 -0.17380775380097604 0.8737905847216886,
          -0.45418154824966867 -0.4949626064588158 0.7407638891286679,
          0.45418154824956686 -0.8737905847217378 0.17380775380077207,
          0.4541815482495378 -0.7407638891298588 0.4949626064571535,
          0.45418154824966867 -0.4949626064588158 0.7407638891286679,
          0.4541815482495836 -0.17380775380097602 0.8737905847216885,
          -0.6101314768990498 -0.6101314768990498 -0.5054494651238326,
          -0.6101314768990498 0.6101314768990498 -0.5054494651238326,
          0.6101314768990498 0.6101314768990498 -0.5054494651238326,
          0.6101314768990498 -0.6101314768990498 -0.5054494651238326,
          -0.6101314768985779 0.5054494651253107 0.6101314768982973,
          0.6101314768985779 0.5054494651253106 0.6101314768982973,
          -0.6101314768985779 0.5054494651253107 -0.6101314768982973,
          0.6101314768985779 0.5054494651253106 -0.6101314768982973,
          -0.2705980500735051 -0.2705980500735052 -0.9238795325110485,
          -0.2705980500735051 0.2705980500735052 -0.9238795325110485,
          0.2705980500735052 0.2705980500735052 -0.9238795325110485,
          0.2705980500735052 -0.2705980500735052 -0.9238795325110485,
          -0.2705980500726382 0.9238795325116443 0.2705980500723377,
          0.27059805007263826 0.9238795325116443 0.2705980500723377,
          0.27059805007263826 0.9238795325116443 -0.2705980500723377,
          -0.2705980500726382 0.9238795325116443 -0.2705980500723377 ] }
        normalIndex [
          0, 1, 17, 16, -1,
          0, 3, 12, 8, -1,
          0, 8, 9, 11, 10, 4, 6, 1, -1,
          0, 16, 19, 3, -1,
          1, 2, 18, 17, -1,
          1, 6, 7, 2, -1,
          2, 3, 19, 18, -1,
          2, 7, 5, 15, 14, 13, 12, 3, -1,
          4, 5, 21, 20, -1,
          4, 10, 15, 5, -1,
          4, 20, 22, 6, -1,
          5, 7, 23, 21, -1,
          6, 22, 23, 7, -1,
          8, 12, 13, 9, -1,
          9, 13, 14, 11, -1,
          10, 11, 14, 15, -1,
          16, 17, 25, 24, -1,
          16, 24, 27, 19, -1,
          17, 18, 26, 25, -1,
          18, 19, 27, 26, -1,
          20, 21, 29, 28, -1,
          20, 28, 31, 22, -1,
          21, 23, 30, 29, -1,
          22, 31, 30, 23, -1,
          24, 25, 26, 27, -1,
          28, 29, 30, 31, -1 ]
      }
    }
  ]
}

DEF cube3 Transform {
  children [
    Shape {
      appearance Appearance {
        material DEF Body Material {
          diffuseColor 1.0 1.0 0.8733333333333333
          emissiveColor 0.26073999999999997 0.26073999999999997 0.20859200000000006
          specularColor 0.29404 0.29404 0.29404
          ambientIntensity 0.9755555555555556
          transparency 0.0
          shininess 1.0
        }
      }
      geometry IndexedFaceSet {
        normalPerVertex TRUE
        coord Coordinate { point [
          -3.999992 1.8818859999999997 0.3937,
          3.999992 1.8818859999999997 0.3937,
          -3.999992 1.8818859999999997 0.0,
          3.999992 1.8818859999999997 0.0,
          -3.842512000000367 5.070855999999999 0.3937,
          -3.999992 4.913376000000366 0.3937,
          3.842512000000367 5.070855999999999 0.3937,
          3.999992 4.913376000000366 0.3937,
          -3.842512000000367 5.070855999999999 0.0,
          -3.999992 4.913376000000366 0.0,
          3.842512000000367 5.070855999999999 0.0,
          3.999992 4.913376000000366 0.0 ] }
        coordIndex [
          0, 1, 7, 6, 4, 5, -1,
          0, 2, 3, 1, -1,
          0, 5, 9, 2, -1,
          1, 3, 11, 7, -1,
          2, 9, 8, 10, 11, 3, -1,
          4, 6, 10, 8, -1,
          4, 8, 9, 5, -1,
          6, 7, 11, 10, -1 ]
        normal Normal { vector [
          -0.5773502691896258 -0.5773502691896258 0.5773502691896258,
          0.5773502691896258 -0.5773502691896258 0.5773502691896258,
          -0.5773502691896258 -0.5773502691896258 -0.5773502691896258,
          0.5773502691896258 -0.5773502691896258 -0.5773502691896258,
          -0.3365567705907769 0.8125199200687456 0.4759631494779678,
          -0.8125199200687451 0.33655677059077804 0.475963149477968,
          0.3365567705907769 0.8125199200687456 0.4759631494779678,
          0.8125199200687451 0.33655677059077804 0.475963149477968,
          -0.3365567705907769 0.8125199200687456 -0.4759631494779678,
          -0.8125199200687451 0.33655677059077804 -0.475963149477968,
          0.3365567705907769 0.8125199200687456 -0.4759631494779678,
          0.8125199200687451 0.33655677059077804 -0.475963149477968 ] }
        normalIndex [
          0, 1, 7, 6, 4, 5, -1,
          0, 2, 3, 1, -1,
          0, 5, 9, 2, -1,
          1, 3, 11, 7, -1,
          2, 9, 8, 10, 11, 3, -1,
          4, 6, 10, 8, -1,
          4, 8, 9, 5, -1,
          6, 7, 11, 10, -1 ]
      }
    }
  ]
}

DEF cube5 Transform {
  children [
    Shape {
      appearance Appearance {
        material USE PIN
      }
      geometry IndexedFaceSet {
        normalPerVertex TRUE
        coord Coordinate { point [
          -1.125982 -0.125984 0.8740140000000001,
          -1.125982 0.125984 0.8740140000000001,
          -0.8740139999999998 0.125984 0.8740140000000001,
          -0.8740139999999998 -0.125984 0.8740140000000001,
          -1.125982 0.1259839999999998 1.125982,
          -0.8740139999999998 0.1259839999999998 1.125982,
          -1.125982 0.1259839999999998 0.8740140000000001,
          -0.8740139999999998 0.1259839999999998 0.8740140000000001,
          -1.125982 -0.12598400000000012 0.9578720999996452,
          -1.125982 -0.09619649044644073 1.0297855095532935,
          -1.125982 0.04212589999998601 1.125982,
          -1.125982 -0.02978750955356729 1.0961944904464405,
          -0.8740139999999998 -0.12598400000000012 0.9578720999996452,
          -0.8740139999999998 -0.09619649044644073 1.0297855095532935,
          -0.8740139999999998 -0.02978750955356729 1.0961944904464405,
          -0.8740139999999998 0.04212589999998601 1.125982,
          -1.125982 -0.125984 -1.2795249999998752,
          -1.125982 0.125984 -1.2795249999998752,
          -0.8740139999999998 0.125984 -1.2795249999998752,
          -0.8740139999999998 -0.125984 -1.2795249999998752,
          -1.125982 4.980305000000138 1.125982,
          -0.8740139999999998 4.980305000000138 1.125982,
          -1.125982 4.980305000000138 0.8740140000000001,
          -0.8740139999999998 4.980305000000138 0.8740140000000001,
          -1.0669270000000066 -0.06692900000000651 -1.3385799999999999,
          -1.0669270000000066 0.06692900000000651 -1.3385799999999999,
          -0.9330689999999934 0.06692900000000651 -1.3385799999999999,
          -0.9330689999999934 -0.06692900000000651 -1.3385799999999999,
          -1.0669270000000066 5.03936 1.0669269999998754,
          -0.9330689999999934 5.03936 1.0669269999998754,
          -0.9330689999999934 5.03936 0.9330690000001247,
          -1.0669270000000066 5.03936 0.9330690000001247 ] }
        coordIndex [
          0, 1, 17, 16, -1,
          0, 3, 12, 8, -1,
          0, 8, 9, 11, 10, 4, 6, 1, -1,
          0, 16, 19, 3, -1,
          1, 2, 18, 17, -1,
          1, 6, 7, 2, -1,
          2, 3, 19, 18, -1,
          2, 7, 5, 15, 14, 13, 12, 3, -1,
          4, 5, 21, 20, -1,
          4, 10, 15, 5, -1,
          4, 20, 22, 6, -1,
          5, 7, 23, 21, -1,
          6, 22, 23, 7, -1,
          8, 12, 13, 9, -1,
          9, 13, 14, 11, -1,
          10, 11, 14, 15, -1,
          16, 17, 25, 24, -1,
          16, 24, 27, 19, -1,
          17, 18, 26, 25, -1,
          18, 19, 27, 26, -1,
          20, 21, 29, 28, -1,
          20, 28, 31, 22, -1,
          21, 23, 30, 29, -1,
          22, 31, 30, 23, -1,
          24, 25, 26, 27, -1,
          28, 29, 30, 31, -1 ]
        normal Normal { vector [
          -0.7071067811865475 -0.7071067811865475 -4.680801433285574e-16,
          -0.8944271909999159 0.4472135954999579 0.0,
          0.8944271909999159 0.4472135954999578 0.0,
          0.7071067811865475 -0.7071067811865477 -4.680801433285574e-16,
          -0.7071067811865475 0.0 0.7071067811865475,
          0.7071067811865475 -9.036472029880135e-17 0.7071067811865475,
          -0.8944271909999159 0.0 -0.4472135954999579,
          0.8944271909999159 -1.1430333450730543e-16 -0.4472135954999579,
          -0.45418154824956686 -0.8737905847217378 0.17380775380077207,
          -0.4541815482495378 -0.7407638891298587 0.4949626064571535,
          -0.4541815482495836 -0.17380775380097607 0.8737905847216885,
          -0.45418154824966867 -0.4949626064588158 0.7407638891286679,
          0.45418154824956686 -0.8737905847217379 0.17380775380077207,
          0.45418154824953777 -0.7407638891298588 0.49496260645715345,
          0.45418154824966855 -0.4949626064588159 0.7407638891286678,
          0.4541815482495836 -0.1738077538009762 0.8737905847216885,
          -0.61013147689905 -0.6101314768990498 -0.5054494651238325,
          -0.61013147689905 0.6101314768990498 -0.5054494651238325,
          0.6101314768990498 0.6101314768990498 -0.5054494651238326,
          0.6101314768990498 -0.6101314768990498 -0.5054494651238326,
          -0.610131476898578 0.5054494651253105 0.6101314768982973,
          0.6101314768985778 0.5054494651253107 0.6101314768982973,
          -0.610131476898578 0.5054494651253105 -0.6101314768982973,
          0.6101314768985778 0.5054494651253107 -0.6101314768982973,
          -0.2705980500735054 -0.2705980500735052 -0.9238795325110484,
          -0.2705980500735054 0.2705980500735052 -0.9238795325110484,
          0.2705980500735051 0.2705980500735052 -0.9238795325110486,
          0.2705980500735051 -0.2705980500735052 -0.9238795325110486,
          -0.2705980500726384 0.9238795325116443 0.2705980500723378,
          0.2705980500726381 0.9238795325116445 0.27059805007233767,
          0.2705980500726381 0.9238795325116445 -0.27059805007233767,
          -0.2705980500726384 0.9238795325116443 -0.2705980500723378 ] }
        normalIndex [
          0, 1, 17, 16, -1,
          0, 3, 12, 8, -1,
          0, 8, 9, 11, 10, 4, 6, 1, -1,
          0, 16, 19, 3, -1,
          1, 2, 18, 17, -1,
          1, 6, 7, 2, -1,
          2, 3, 19, 18, -1,
          2, 7, 5, 15, 14, 13, 12, 3, -1,
          4, 5, 21, 20, -1,
          4, 10, 15, 5, -1,
          4, 20, 22, 6, -1,
          5, 7, 23, 21, -1,
          6, 22, 23, 7, -1,
          8, 12, 13, 9, -1,
          9, 13, 14, 11, -1,
          10, 11, 14, 15, -1,
          16, 17, 25, 24, -1,
          16, 24, 27, 19, -1,
          17, 18, 26, 25, -1,
          18, 19, 27, 26, -1,
          20, 21, 29, 28, -1,
          20, 28, 31, 22, -1,
          21, 23, 30, 29, -1,
          22, 31, 30, 23, -1,
          24, 25, 26, 27, -1,
          28, 29, 30, 31, -1 ]
      }
    }
  ]
}

DEF cube1_sep4 Transform {
  children [
    Shape {
      appearance Appearance {
        material USE Body
      }
      geometry IndexedFaceSet {
        normalPerVertex TRUE
        coord Coordinate { point [
          -4.499991 0.582676 2.28346,
          -4.499991 1.8818859999999997 2.28346,
          4.499991 1.8818859999999997 2.28346,
          4.499991 0.582676 2.28346,
          -4.499991 0.582676 0.0,
          -4.499991 1.8818859999999997 0.0,
          4.499991 1.8818859999999997 0.0,
          4.499991 0.582676 0.0 ] }
        coordIndex [
          0, 1, 5, 4, -1,
          0, 3, 2, 1, -1,
          0, 4, 7, 3, -1,
          1, 2, 6, 5, -1,
          2, 3, 7, 6, -1,
          4, 5, 6, 7, -1 ]
        normal Normal { vector [
          -0.5773502691896258 -0.5773502691896258 0.5773502691896258,
          -0.5773502691896258 0.5773502691896258 0.5773502691896258,
          0.5773502691896258 0.5773502691896258 0.5773502691896258,
          0.5773502691896258 -0.5773502691896258 0.5773502691896258,
          -0.5773502691896258 -0.5773502691896258 -0.5773502691896258,
          -0.5773502691896258 0.5773502691896258 -0.5773502691896258,
          0.5773502691896258 0.5773502691896258 -0.5773502691896258,
          0.5773502691896258 -0.5773502691896258 -0.5773502691896258 ] }
        normalIndex [
          0, 1, 5, 4, -1,
          0, 3, 2, 1, -1,
          0, 4, 7, 3, -1,
          1, 2, 6, 5, -1,
          2, 3, 7, 6, -1,
          4, 5, 6, 7, -1 ]
      }
    }
  ]
}

