PCBNEW-LibModule-V1  21.8.2012 18:59:02
# encoding utf-8
Units deci-mils
$INDEX
c_0603
c_0805
c_1206
c_1210
c_1808
c_1812
c_2220
c_2225
c_elec_10x10
c_elec_10x10.5
c_elec_10x7.7
c_elec_3x5.3
c_elec_4x4.5
c_elec_4x5.3
c_elec_4x5.7
c_elec_4x5.8
c_elec_5x4.5
c_elec_5x5.3
c_elec_5x5.7
c_elec_5x5.8
c_elec_6.3x4.5
c_elec_6.3x5.3
c_elec_6.3x5.7
c_elec_6.3x5.8
c_elec_6.3x7.7
c_elec_8x10
c_elec_8x10.5
c_elec_8x6.5
c_elec_8x6.7
c_tant_A
c_tant_B
c_tant_C
c_tant_D
c_tant_E
c_tant_R
c_tant_S
c_tant_T
c_tant_U
c_tant_V
c_tant_X
$EndINDEX
$MODULE c_0603
Po 0 0 0 15 5033A2CB 00000000 ~~
Li c_0603
Cd SMT capacitor, 0603
Sc 0
AR 
Op 0 0 0
.LocalClearance 78
T0 0 -630 393 393 0 78 N V 21 N "c_0603"
T1 0 0 314 314 0 59 N I 21 N "Val"
DS -591 -315 591 -315 78 21
DS 591 -315 591 315 78 21
DS 591 315 -591 315 78 21
DS -591 315 -591 -315 78 21
$PAD
Sh "1" R 354 394 0 0 0
Dr 0 0 0
At SMD N 00888000
Ne 0 ""
Po 296 0
$EndPAD
$PAD
Sh "2" R 354 394 0 0 0
Dr 0 0 0
At SMD N 00888000
Ne 0 ""
Po -296 0
$EndPAD
$SHAPE3D
Na "walter\\smd_cap\\c_0603.wrl"
Sc 1 1 1
Of 0 0 0
Ro 0 0 0
$EndSHAPE3D
$EndMODULE c_0603
$MODULE c_0805
Po 0 0 0 15 5033A1FE 00000000 ~~
Li c_0805
Cd SMT capacitor, 0805
Sc 0
AR 
Op 0 0 0
.LocalClearance 78
T0 0 -709 393 393 0 78 N V 21 N "c_0805"
T1 0 0 315 315 0 59 N I 21 N "Val"
DS -748 -413 748 -413 78 21
DS 748 -413 748 413 78 21
DS 748 413 -748 413 78 21
DS -748 413 -748 -413 78 21
$PAD
Sh "1" R 512 590 0 0 0
Dr 0 0 0
At SMD N 00888000
Ne 0 ""
Po 375 0
$EndPAD
$PAD
Sh "2" R 512 590 0 0 0
Dr 0 0 0
At SMD N 00888000
Ne 0 ""
Po -375 0
$EndPAD
$SHAPE3D
Na "walter\\smd_cap\\c_0805.wrl"
Sc 1 1 1
Of 0 0 0
Ro 0 0 0
$EndSHAPE3D
$EndMODULE c_0805
$MODULE c_1206
Po 0 0 0 15 5033A348 00000000 ~~
Li c_1206
Cd SMT capacitor, 1206
Sc 0
AR 
Op 0 0 0
.LocalClearance 78
T0 0 -748 393 393 0 78 N V 21 N "c_1206"
T1 0 0 392 392 0 77 N I 21 N "Val"
DS -984 -472 984 -472 78 21
DS 984 -472 984 472 78 21
DS 984 472 -984 472 78 21
DS -984 472 -984 -472 78 21
$PAD
Sh "1" R 630 710 0 0 0
Dr 0 0 0
At SMD N 00888000
Ne 0 ""
Po 550 0
$EndPAD
$PAD
Sh "2" R 630 710 0 0 0
Dr 0 0 0
At SMD N 00888000
Ne 0 ""
Po -550 0
$EndPAD
$SHAPE3D
Na "walter\\smd_cap\\c_1206.wrl"
Sc 1 1 1
Of 0 0 0
Ro 0 0 0
$EndSHAPE3D
$EndMODULE c_1206
$MODULE c_1210
Po 0 0 0 15 5033A3E5 00000000 ~~
Li c_1210
Cd SMT capacitor, 1210
Sc 0
AR 
Op 0 0 0
.LocalClearance 78
T0 0 -965 393 393 0 78 N V 21 N "c_1210"
T1 0 0 392 392 0 78 N I 21 N "Val"
DS -984 -650 984 -650 78 21
DS 984 -650 984 650 78 21
DS 984 650 -984 650 78 21
DS -984 650 -984 -650 78 21
$PAD
Sh "1" R 630 1060 0 0 0
Dr 0 0 0
At SMD N 00888000
Ne 0 ""
Po 550 0
$EndPAD
$PAD
Sh "2" R 630 1060 0 0 0
Dr 0 0 0
At SMD N 00888000
Ne 0 ""
Po -550 0
$EndPAD
$SHAPE3D
Na "walter\\smd_cap\\c_1210.wrl"
Sc 1 1 1
Of 0 0 0
Ro 0 0 0
$EndSHAPE3D
$EndMODULE c_1210
$MODULE c_1808
Po 0 0 0 15 5033A45F 00000000 ~~
Li c_1808
Cd SMT capacitor, 1808
Sc 0
AR 
Op 0 0 0
.LocalClearance 78
T0 0 -924 393 393 0 78 N V 21 N "c_1808"
T1 0 0 393 393 0 78 N I 21 N "Val"
DS -1280 -591 1280 -591 78 21
DS 1280 -591 1280 591 78 21
DS 1280 591 -1280 591 78 21
DS -1280 591 -1280 -591 78 21
$PAD
Sh "1" R 709 945 0 0 0
Dr 0 0 0
At SMD N 00888000
Ne 0 ""
Po 807 0
$EndPAD
$PAD
Sh "2" R 709 945 0 0 0
Dr 0 0 0
At SMD N 00888000
Ne 0 ""
Po -807 0
$EndPAD
$SHAPE3D
Na "walter\\smd_cap\\c_1808.wrl"
Sc 1 1 1
Of 0 0 0
Ro 0 0 0
$EndSHAPE3D
$EndMODULE c_1808
$MODULE c_1812
Po 0 0 0 15 5033A4ED 00000000 ~~
Li c_1812
Cd SMT capacitor, 1812
Sc 0
AR 
Op 0 0 0
.LocalClearance 78
T0 0 -1181 393 393 0 78 N V 21 N "c_1812"
T1 0 0 393 393 0 78 N I 21 N "Val"
DS -1280 -846 1280 -846 78 21
DS 1280 -846 1280 846 78 21
DS 1280 846 -1280 846 78 21
DS -1280 846 -1280 -846 78 21
$PAD
Sh "1" R 709 1457 0 0 0
Dr 0 0 0
At SMD N 00888000
Ne 0 ""
Po 807 0
$EndPAD
$PAD
Sh "2" R 709 1457 0 0 0
Dr 0 0 0
At SMD N 00888000
Ne 0 ""
Po -807 0
$EndPAD
$SHAPE3D
Na "walter\\smd_cap\\c_1812.wrl"
Sc 1 1 1
Of 0 0 0
Ro 0 0 0
$EndSHAPE3D
$EndMODULE c_1812
$MODULE c_2220
Po 0 0 0 15 5033A566 00000000 ~~
Li c_2220
Cd SMT capacitor, 2220
Sc 0
AR 
Op 0 0 0
.LocalClearance 78
T0 0 -1516 393 393 0 78 N V 21 N "c_2220"
T1 0 0 393 393 0 78 N I 21 N "Val"
DS -1496 -1201 1496 -1201 78 21
DS 1496 -1201 1496 1201 78 21
DS 1496 1201 -1496 1201 78 21
DS -1496 1201 -1496 -1201 78 21
$PAD
Sh "1" R 728 2165 0 0 0
Dr 0 0 0
At SMD N 00888000
Ne 0 ""
Po 1014 0
$EndPAD
$PAD
Sh "2" R 728 2165 0 0 0
Dr 0 0 0
At SMD N 00888000
Ne 0 ""
Po -1014 0
$EndPAD
$SHAPE3D
Na "walter\\smd_cap\\c_2220.wrl"
Sc 1 1 1
Of 0 0 0
Ro 0 0 0
$EndSHAPE3D
$EndMODULE c_2220
$MODULE c_2225
Po 0 0 0 15 5033A5FF 00000000 ~~
Li c_2225
Cd SMT capacitor, 2225
Sc 0
AR 
Op 0 0 0
.LocalClearance 78
T0 0 -1811 393 393 0 78 N V 21 N "c_2225"
T1 0 0 393 393 0 78 N I 21 N "Val"
DS 1496 -1457 1496 1457 78 21
DS 1496 1457 -1496 1457 78 21
DS -1496 1457 -1496 -1457 78 21
DS -1496 -1457 1496 -1457 78 21
$PAD
Sh "1" R 728 2677 0 0 0
Dr 0 0 0
At SMD N 00888000
Ne 0 ""
Po 1014 0
$EndPAD
$PAD
Sh "2" R 728 2677 0 0 0
Dr 0 0 0
At SMD N 00888000
Ne 0 ""
Po -1014 0
$EndPAD
$SHAPE3D
Na "walter\\smd_cap\\c_2225.wrl"
Sc 1 1 1
Of 0 0 0
Ro 0 0 0
$EndSHAPE3D
$EndMODULE c_2225
$MODULE c_elec_10x10
Po 0 0 0 15 5033AAB1 00000000 ~~
Li c_elec_10x10
Cd SMT capacitor, aluminium electrolytic, 10x10
Sc 0
AR 
Op 0 0 0
T0 0 -2342 392 392 0 77 N V 21 N "c_elec_10x10"
T1 0 0 393 393 900 78 N I 21 N "Value"
DS -1900 400 -1900 -400 50 21
DS -1850 -550 -1850 600 50 21
DS -1800 700 -1800 -700 50 21
DS -1750 -850 -1750 850 50 21
DS -1700 950 -1700 -950 50 21
DS -1650 -1000 -1650 1000 50 21
DC 0 0 1950 0 50 21
DS -2050 -2050 -2050 2050 50 21
DS -2050 2050 1750 2050 50 21
DS 1750 2050 2050 1750 50 21
DS 2050 1750 2050 -1750 50 21
DS 2050 -1750 1750 -2050 50 21
DS 1750 -2050 -2050 -2050 50 21
DS 2450 -787 2150 -787 50 21
DS 2299 -938 2299 -638 50 21
$PAD
Sh "1" R 1575 945 0 0 0
Dr 0 0 0
At SMD N 00888000
Ne 0 ""
Po 1575 0
$EndPAD
$PAD
Sh "2" R 1575 945 0 0 0
Dr 0 0 0
At SMD N 00888000
Ne 0 ""
Po -1575 0
$EndPAD
$SHAPE3D
Na "walter\\smd_cap\\c_elec_10x10.wrl"
Sc 1 1 1
Of 0 0 0
Ro 0 0 0
$EndSHAPE3D
$EndMODULE c_elec_10x10
$MODULE c_elec_10x10.5
Po 0 0 0 15 5033AAB1 00000000 ~~
Li c_elec_10x10.5
Cd SMT capacitor, aluminium electrolytic, 10x10.5
Sc 0
AR 
Op 0 0 0
T0 0 -2342 392 392 0 77 N V 21 N "c_elec_10x10.5"
T1 0 0 393 393 900 78 N I 21 N "Value"
DS -1900 400 -1900 -400 50 21
DS -1850 -550 -1850 600 50 21
DS -1800 700 -1800 -700 50 21
DS -1750 -850 -1750 850 50 21
DS -1700 950 -1700 -950 50 21
DS -1650 -1000 -1650 1000 50 21
DC 0 0 1950 0 50 21
DS -2050 -2050 -2050 2050 50 21
DS -2050 2050 1750 2050 50 21
DS 1750 2050 2050 1750 50 21
DS 2050 1750 2050 -1750 50 21
DS 2050 -1750 1750 -2050 50 21
DS 1750 -2050 -2050 -2050 50 21
DS 2450 -787 2150 -787 50 21
DS 2299 -938 2299 -638 50 21
$PAD
Sh "1" R 1575 945 0 0 0
Dr 0 0 0
At SMD N 00888000
Ne 0 ""
Po 1575 0
$EndPAD
$PAD
Sh "2" R 1575 945 0 0 0
Dr 0 0 0
At SMD N 00888000
Ne 0 ""
Po -1575 0
$EndPAD
$SHAPE3D
Na "walter\\smd_cap\\c_elec_10x10_5.wrl"
Sc 1 1 1
Of 0 0 0
Ro 0 0 0
$EndSHAPE3D
$EndMODULE c_elec_10x10.5
$MODULE c_elec_10x7.7
Po 0 0 0 15 5033AAB1 00000000 ~~
Li c_elec_10x7.7
Cd SMT capacitor, aluminium electrolytic, 10x7.7
Sc 0
AR 
Op 0 0 0
T0 0 -2343 393 393 0 78 N V 21 N "c_elec_10x7.7"
T1 0 0 393 393 900 78 N I 21 N "Value"
DS -1900 400 -1900 -400 50 21
DS -1850 -550 -1850 600 50 21
DS -1800 700 -1800 -700 50 21
DS -1750 -850 -1750 850 50 21
DS -1700 950 -1700 -950 50 21
DS -1650 -1000 -1650 1000 50 21
DC 0 0 1950 0 50 21
DS -2050 -2050 -2050 2050 50 21
DS -2050 2050 1750 2050 50 21
DS 1750 2050 2050 1750 50 21
DS 2050 1750 2050 -1750 50 21
DS 2050 -1750 1750 -2050 50 21
DS 1750 -2050 -2050 -2050 50 21
DS 2450 -787 2150 -787 50 21
DS 2299 -938 2299 -638 50 21
$PAD
Sh "1" R 1575 945 0 0 0
Dr 0 0 0
At SMD N 00888000
Ne 0 ""
Po 1575 0
$EndPAD
$PAD
Sh "2" R 1575 945 0 0 0
Dr 0 0 0
At SMD N 00888000
Ne 0 ""
Po -1575 0
$EndPAD
$SHAPE3D
Na "walter\\smd_cap\\c_elec_10x7_7.wrl"
Sc 1 1 1
Of 0 0 0
Ro 0 0 0
$EndSHAPE3D
$EndMODULE c_elec_10x7.7
$MODULE c_elec_3x5.3
Po 0 0 0 15 5033A630 00000000 ~~
Li c_elec_3x5.3
Cd SMT capacitor, aluminium electrolytic, 3x5.3
Sc 0
AR 
Op 0 0 0
T0 0 -984 393 393 0 78 N V 21 N "c_elec_3x5.3"
T1 0 1004 393 393 0 78 N I 21 N "C***"
DS -650 -650 -650 650 50 21
DS -650 650 350 650 50 21
DS 350 650 650 350 50 21
DS 650 350 650 -350 50 21
DS 650 -350 350 -650 50 21
DS 350 -650 -650 -650 50 21
DS -550 -200 -550 200 50 21
DS -500 -300 -500 300 50 21
DS -450 -400 -450 400 50 21
DS -400 -450 -400 450 50 21
DC 0 0 600 0 50 21
DS 942 -590 642 -590 50 21
DS 792 -741 792 -441 50 21
$PAD
Sh "1" R 866 630 0 0 0
Dr 0 0 0
At SMD N 00888000
Ne 0 ""
Po 591 0
$EndPAD
$PAD
Sh "2" R 866 630 0 0 0
Dr 0 0 0
At SMD N 00888000
Ne 0 ""
Po -591 0
$EndPAD
$SHAPE3D
Na "walter\\smd_cap\\c_elec_3x5_3.wrl"
Sc 1 1 1
Of 0 0 0
Ro 0 0 0
$EndSHAPE3D
$EndMODULE c_elec_3x5.3
$MODULE c_elec_4x4.5
Po 0 0 0 15 5033A6AC 00000000 ~~
Li c_elec_4x4.5
Cd SMT capacitor, aluminium electrolytic, 4x4.5
Sc 0
AR 
Op 0 0 0
T0 0 -1220 393 393 0 78 N V 21 N "c_elec_4x4.5"
T1 0 1260 393 393 0 78 N I 21 N "Value"
DS 1319 -610 1019 -610 50 21
DS 1169 -760 1169 -460 50 21
DS 600 900 -900 900 50 21
DS 900 -600 900 600 50 21
DS 600 900 900 600 50 21
DS 600 -900 -900 -900 50 21
DS 600 -900 900 -600 50 21
DS -800 50 -800 -50 50 21
DS -750 -250 -750 250 50 21
DS -700 350 -700 -350 50 21
DS -650 450 -650 -450 50 21
DS -600 -500 -600 500 50 21
DS -550 550 -550 -550 50 21
DS -500 -600 -500 600 50 21
DS -450 -650 -450 650 50 21
DC 0 0 -800 0 50 21
DS -900 -900 -900 900 50 21
$PAD
Sh "1" R 1024 630 0 0 0
Dr 0 0 0
At SMD N 00888000
Ne 0 ""
Po 709 0
$EndPAD
$PAD
Sh "2" R 1024 630 0 0 0
Dr 0 0 0
At SMD N 00888000
Ne 0 ""
Po -709 0
$EndPAD
$SHAPE3D
Na "walter\\smd_cap\\c_elec_4x4_5.wrl"
Sc 1 1 1
Of 0 0 0
Ro 0 0 0
$EndSHAPE3D
$EndMODULE c_elec_4x4.5
$MODULE c_elec_4x5.3
Po 0 0 0 15 5033A6DD 00000000 ~~
Li c_elec_4x5.3
Cd SMT capacitor, aluminium electrolytic, 4x5.3
Sc 0
AR 
Op 0 0 0
T0 0 -1220 393 393 0 78 N V 21 N "c_elec_4x5.3"
T1 0 1260 393 393 0 78 N I 21 N "Value"
DS 1299 -630 999 -630 50 21
DS 1150 -780 1150 -480 50 21
DS 600 900 -900 900 50 21
DS 900 -600 900 600 50 21
DS 600 900 900 600 50 21
DS 600 -900 -900 -900 50 21
DS 600 -900 900 -600 50 21
DS -800 50 -800 -50 50 21
DS -750 -250 -750 250 50 21
DS -700 350 -700 -350 50 21
DS -650 450 -650 -450 50 21
DS -600 -500 -600 500 50 21
DS -550 550 -550 -550 50 21
DS -500 -600 -500 600 50 21
DS -450 -650 -450 650 50 21
DC 0 0 -800 0 50 21
DS -900 -900 -900 900 50 21
$PAD
Sh "1" R 1024 630 0 0 0
Dr 0 0 0
At SMD N 00888000
Ne 0 ""
Po 709 0
$EndPAD
$PAD
Sh "2" R 1024 630 0 0 0
Dr 0 0 0
At SMD N 00888000
Ne 0 ""
Po -709 0
$EndPAD
$SHAPE3D
Na "walter\\smd_cap\\c_elec_4x5_3.wrl"
Sc 1 1 1
Of 0 0 0
Ro 0 0 0
$EndSHAPE3D
$EndMODULE c_elec_4x5.3
$MODULE c_elec_4x5.7
Po 0 0 0 15 5033A72B 00000000 ~~
Li c_elec_4x5.7
Cd SMT capacitor, aluminium electrolytic, 4x5.7
Sc 0
AR 
Op 0 0 0
T0 0 -1220 392 392 0 77 N V 21 N "c_elec_4x5.7"
T1 0 1260 393 393 0 78 N I 21 N "Value"
DS 1299 -630 999 -630 50 21
DS 1150 -780 1150 -480 50 21
DS 600 900 -900 900 50 21
DS 900 -600 900 600 50 21
DS 600 900 900 600 50 21
DS 600 -900 -900 -900 50 21
DS 600 -900 900 -600 50 21
DS -800 50 -800 -50 50 21
DS -750 -250 -750 250 50 21
DS -700 350 -700 -350 50 21
DS -650 450 -650 -450 50 21
DS -600 -500 -600 500 50 21
DS -550 550 -550 -550 50 21
DS -500 -600 -500 600 50 21
DS -450 -650 -450 650 50 21
DC 0 0 -800 0 50 21
DS -900 -900 -900 900 50 21
$PAD
Sh "1" R 1024 630 0 0 0
Dr 0 0 0
At SMD N 00888000
Ne 0 ""
Po 709 0
$EndPAD
$PAD
Sh "2" R 1024 630 0 0 0
Dr 0 0 0
At SMD N 00888000
Ne 0 ""
Po -709 0
$EndPAD
$SHAPE3D
Na "walter\\smd_cap\\c_elec_4x5_7.wrl"
Sc 1 1 1
Of 0 0 0
Ro 0 0 0
$EndSHAPE3D
$EndMODULE c_elec_4x5.7
$MODULE c_elec_4x5.8
Po 0 0 0 15 5033A7E6 00000000 ~~
Li c_elec_4x5.8
Cd SMT capacitor, aluminium electrolytic, 4x5.8
Sc 0
AR 
Op 0 0 0
T0 0 -1220 392 392 0 77 N V 21 N "c_elec_4x5.8"
T1 0 1260 393 393 0 78 N I 21 N "Value"
DS 1299 -630 999 -630 50 21
DS 1150 -780 1150 -480 50 21
DS 600 900 -900 900 50 21
DS 900 -600 900 600 50 21
DS 600 900 900 600 50 21
DS 600 -900 -900 -900 50 21
DS 600 -900 900 -600 50 21
DS -800 50 -800 -50 50 21
DS -750 -250 -750 250 50 21
DS -700 350 -700 -350 50 21
DS -650 450 -650 -450 50 21
DS -600 -500 -600 500 50 21
DS -550 550 -550 -550 50 21
DS -500 -600 -500 600 50 21
DS -450 -650 -450 650 50 21
DC 0 0 -800 0 50 21
DS -900 -900 -900 900 50 21
$PAD
Sh "1" R 1024 630 0 0 0
Dr 0 0 0
At SMD N 00888000
Ne 0 ""
Po 709 0
$EndPAD
$PAD
Sh "2" R 1024 630 0 0 0
Dr 0 0 0
At SMD N 00888000
Ne 0 ""
Po -709 0
$EndPAD
$SHAPE3D
Na "walter\\smd_cap\\c_elec_4x5_8.wrl"
Sc 1 1 1
Of 0 0 0
Ro 0 0 0
$EndSHAPE3D
$EndMODULE c_elec_4x5.8
$MODULE c_elec_5x4.5
Po 0 0 0 15 5033A854 00000000 ~~
Li c_elec_5x4.5
Cd SMT capacitor, aluminium electrolytic, 5x4.5
Sc 0
AR 
Op 0 0 0
T0 0 -1378 393 393 0 78 N V 21 N "c_elec_5x4.5"
T1 0 0 314 314 900 45 N I 21 N "Value"
DS -900 -250 -900 300 50 21
DS -850 -350 -850 350 50 21
DS -800 -500 -800 500 50 21
DS -750 550 -750 -550 50 21
DS -700 -600 -700 600 50 21
DS -650 650 -650 -650 50 21
DS -600 -700 -600 700 50 21
DC 0 0 -950 0 50 21
DS -1050 -1050 750 -1050 50 21
DS 750 -1050 1050 -750 50 21
DS 1050 -750 1050 750 50 21
DS 1050 750 750 1050 50 21
DS 750 1050 -1050 1050 50 21
DS -1050 1050 -1050 -1050 50 21
DS 1480 -650 1180 -650 50 21
DS 1330 -799 1330 -499 50 21
$PAD
Sh "1" R 1181 630 0 0 0
Dr 0 0 0
At SMD N 00888000
Ne 0 ""
Po 866 0
$EndPAD
$PAD
Sh "2" R 1181 630 0 0 0
Dr 0 0 0
At SMD N 00888000
Ne 0 ""
Po -866 0
$EndPAD
$SHAPE3D
Na "walter\\smd_cap\\c_elec_5x4_5.wrl"
Sc 1 1 1
Of 0 0 0
Ro 0 0 0
$EndSHAPE3D
$EndMODULE c_elec_5x4.5
$MODULE c_elec_5x5.3
Po 0 0 0 15 5033A854 00000000 ~~
Li c_elec_5x5.3
Cd SMT capacitor, aluminium electrolytic, 5x5.3
Sc 0
AR 
Op 0 0 0
T0 0 -1377 392 392 0 77 N V 21 N "c_elec_5x5.3"
T1 0 0 314 314 900 45 N I 21 N "Value"
DS -900 -250 -900 300 50 21
DS -850 -350 -850 350 50 21
DS -800 -500 -800 500 50 21
DS -750 550 -750 -550 50 21
DS -700 -600 -700 600 50 21
DS -650 650 -650 -650 50 21
DS -600 -700 -600 700 50 21
DC 0 0 -950 0 50 21
DS -1050 -1050 750 -1050 50 21
DS 750 -1050 1050 -750 50 21
DS 1050 -750 1050 750 50 21
DS 1050 750 750 1050 50 21
DS 750 1050 -1050 1050 50 21
DS -1050 1050 -1050 -1050 50 21
DS 1480 -650 1180 -650 50 21
DS 1330 -799 1330 -499 50 21
$PAD
Sh "1" R 1181 630 0 0 0
Dr 0 0 0
At SMD N 00888000
Ne 0 ""
Po 866 0
$EndPAD
$PAD
Sh "2" R 1181 630 0 0 0
Dr 0 0 0
At SMD N 00888000
Ne 0 ""
Po -866 0
$EndPAD
$SHAPE3D
Na "walter\\smd_cap\\c_elec_5x5_3.wrl"
Sc 1 1 1
Of 0 0 0
Ro 0 0 0
$EndSHAPE3D
$EndMODULE c_elec_5x5.3
$MODULE c_elec_5x5.7
Po 0 0 0 15 5033A854 00000000 ~~
Li c_elec_5x5.7
Cd SMT capacitor, aluminium electrolytic, 5x5.7
Sc 0
AR 
Op 0 0 0
T0 0 -1377 392 392 0 77 N V 21 N "c_elec_5x5.7"
T1 0 0 314 314 900 45 N I 21 N "Value"
DS -900 -250 -900 300 50 21
DS -850 -350 -850 350 50 21
DS -800 -500 -800 500 50 21
DS -750 550 -750 -550 50 21
DS -700 -600 -700 600 50 21
DS -650 650 -650 -650 50 21
DS -600 -700 -600 700 50 21
DC 0 0 -950 0 50 21
DS -1050 -1050 750 -1050 50 21
DS 750 -1050 1050 -750 50 21
DS 1050 -750 1050 750 50 21
DS 1050 750 750 1050 50 21
DS 750 1050 -1050 1050 50 21
DS -1050 1050 -1050 -1050 50 21
DS 1480 -650 1180 -650 50 21
DS 1330 -799 1330 -499 50 21
$PAD
Sh "1" R 1181 630 0 0 0
Dr 0 0 0
At SMD N 00888000
Ne 0 ""
Po 866 0
$EndPAD
$PAD
Sh "2" R 1181 630 0 0 0
Dr 0 0 0
At SMD N 00888000
Ne 0 ""
Po -866 0
$EndPAD
$SHAPE3D
Na "walter\\smd_cap\\c_elec_5x5_7.wrl"
Sc 1 1 1
Of 0 0 0
Ro 0 0 0
$EndSHAPE3D
$EndMODULE c_elec_5x5.7
$MODULE c_elec_5x5.8
Po 0 0 0 15 5033A854 00000000 ~~
Li c_elec_5x5.8
Cd SMT capacitor, aluminium electrolytic, 5x5.8
Sc 0
AR 
Op 0 0 0
T0 0 -1377 392 392 0 77 N V 21 N "c_elec_5x5.8"
T1 0 0 314 314 900 45 N I 21 N "Value"
DS -900 -250 -900 300 50 21
DS -850 -350 -850 350 50 21
DS -800 -500 -800 500 50 21
DS -750 550 -750 -550 50 21
DS -700 -600 -700 600 50 21
DS -650 650 -650 -650 50 21
DS -600 -700 -600 700 50 21
DC 0 0 -950 0 50 21
DS -1050 -1050 750 -1050 50 21
DS 750 -1050 1050 -750 50 21
DS 1050 -750 1050 750 50 21
DS 1050 750 750 1050 50 21
DS 750 1050 -1050 1050 50 21
DS -1050 1050 -1050 -1050 50 21
DS 1480 -650 1180 -650 50 21
DS 1330 -799 1330 -499 50 21
$PAD
Sh "1" R 1181 630 0 0 0
Dr 0 0 0
At SMD N 00888000
Ne 0 ""
Po 866 0
$EndPAD
$PAD
Sh "2" R 1181 630 0 0 0
Dr 0 0 0
At SMD N 00888000
Ne 0 ""
Po -866 0
$EndPAD
$SHAPE3D
Na "walter\\smd_cap\\c_elec_5x5_8.wrl"
Sc 1 1 1
Of 0 0 0
Ro 0 0 0
$EndSHAPE3D
$EndMODULE c_elec_5x5.8
$MODULE c_elec_6.3x4.5
Po 0 0 0 15 5033A93B 00000000 ~~
Li c_elec_6.3x4.5
Cd SMT capacitor, aluminium electrolytic, 6.3x4.5
Sc 0
AR 
Op 0 0 0
T0 0 -1634 393 393 0 78 N V 21 N "c_elec_6.3x4.5"
T1 0 0 314 314 900 59 N I 21 N "Value"
DS -1150 -300 -1150 300 50 21
DS -1100 450 -1100 -450 50 21
DS -1050 -550 -1050 550 50 21
DS -1000 650 -1000 -650 50 21
DS -950 -700 -950 700 50 21
DC 0 0 -1200 0 50 21
DS -1300 -1300 -1300 1300 50 21
DS -1300 1300 1000 1300 50 21
DS 1000 1300 1300 1000 50 21
DS 1300 1000 1300 -1000 50 21
DS 1300 -1000 1000 -1300 50 21
DS 1000 -1300 -1300 -1300 50 21
DS 1696 -650 1396 -650 50 21
DS 1546 -800 1546 -500 50 21
$PAD
Sh "1" R 1417 630 0 0 0
Dr 0 0 0
At SMD N 00888000
Ne 0 ""
Po 1083 0
$EndPAD
$PAD
Sh "2" R 1417 630 0 0 0
Dr 0 0 0
At SMD N 00888000
Ne 0 ""
Po -1083 0
$EndPAD
$SHAPE3D
Na "walter\\smd_cap\\c_elec_6_3x4_5.wrl"
Sc 1 1 1
Of 0 0 0
Ro 0 0 0
$EndSHAPE3D
$EndMODULE c_elec_6.3x4.5
$MODULE c_elec_6.3x5.3
Po 0 0 0 15 5033A93B 00000000 ~~
Li c_elec_6.3x5.3
Cd SMT capacitor, aluminium electrolytic, 6.3x5.3
Sc 0
AR 
Op 0 0 0
T0 0 -1634 392 392 0 77 N V 21 N "c_elec_6.3x5.3"
T1 0 0 314 314 900 59 N I 21 N "Value"
DS -1150 -300 -1150 300 50 21
DS -1100 450 -1100 -450 50 21
DS -1050 -550 -1050 550 50 21
DS -1000 650 -1000 -650 50 21
DS -950 -700 -950 700 50 21
DC 0 0 -1200 0 50 21
DS -1300 -1300 -1300 1300 50 21
DS -1300 1300 1000 1300 50 21
DS 1000 1300 1300 1000 50 21
DS 1300 1000 1300 -1000 50 21
DS 1300 -1000 1000 -1300 50 21
DS 1000 -1300 -1300 -1300 50 21
DS 1696 -650 1396 -650 50 21
DS 1546 -800 1546 -500 50 21
$PAD
Sh "1" R 1417 630 0 0 0
Dr 0 0 0
At SMD N 00888000
Ne 0 ""
Po 1083 0
$EndPAD
$PAD
Sh "2" R 1417 630 0 0 0
Dr 0 0 0
At SMD N 00888000
Ne 0 ""
Po -1083 0
$EndPAD
$SHAPE3D
Na "walter\\smd_cap\\c_elec_6_3x5_3.wrl"
Sc 1 1 1
Of 0 0 0
Ro 0 0 0
$EndSHAPE3D
$EndMODULE c_elec_6.3x5.3
$MODULE c_elec_6.3x5.7
Po 0 0 0 15 5033A93B 00000000 ~~
Li c_elec_6.3x5.7
Cd SMT capacitor, aluminium electrolytic, 6.3x5.7
Sc 0
AR 
Op 0 0 0
T0 0 -1634 392 392 0 77 N V 21 N "c_elec_6.3x5.7"
T1 0 0 314 314 900 59 N I 21 N "Value"
DS -1150 -300 -1150 300 50 21
DS -1100 450 -1100 -450 50 21
DS -1050 -550 -1050 550 50 21
DS -1000 650 -1000 -650 50 21
DS -950 -700 -950 700 50 21
DC 0 0 -1200 0 50 21
DS -1300 -1300 -1300 1300 50 21
DS -1300 1300 1000 1300 50 21
DS 1000 1300 1300 1000 50 21
DS 1300 1000 1300 -1000 50 21
DS 1300 -1000 1000 -1300 50 21
DS 1000 -1300 -1300 -1300 50 21
DS 1696 -650 1396 -650 50 21
DS 1546 -800 1546 -500 50 21
$PAD
Sh "1" R 1417 630 0 0 0
Dr 0 0 0
At SMD N 00888000
Ne 0 ""
Po 1083 0
$EndPAD
$PAD
Sh "2" R 1417 630 0 0 0
Dr 0 0 0
At SMD N 00888000
Ne 0 ""
Po -1083 0
$EndPAD
$SHAPE3D
Na "walter\\smd_cap\\c_elec_6_3x5_7.wrl"
Sc 1 1 1
Of 0 0 0
Ro 0 0 0
$EndSHAPE3D
$EndMODULE c_elec_6.3x5.7
$MODULE c_elec_6.3x5.8
Po 0 0 0 15 5033A93B 00000000 ~~
Li c_elec_6.3x5.8
Cd SMT capacitor, aluminium electrolytic, 6.3x5.8
Sc 0
AR 
Op 0 0 0
T0 0 -1634 392 392 0 77 N V 21 N "c_elec_6.3x5.8"
T1 0 0 314 314 900 59 N I 21 N "Value"
DS -1150 -300 -1150 300 50 21
DS -1100 450 -1100 -450 50 21
DS -1050 -550 -1050 550 50 21
DS -1000 650 -1000 -650 50 21
DS -950 -700 -950 700 50 21
DC 0 0 -1200 0 50 21
DS -1300 -1300 -1300 1300 50 21
DS -1300 1300 1000 1300 50 21
DS 1000 1300 1300 1000 50 21
DS 1300 1000 1300 -1000 50 21
DS 1300 -1000 1000 -1300 50 21
DS 1000 -1300 -1300 -1300 50 21
DS 1696 -650 1396 -650 50 21
DS 1546 -800 1546 -500 50 21
$PAD
Sh "1" R 1417 630 0 0 0
Dr 0 0 0
At SMD N 00888000
Ne 0 ""
Po 1083 0
$EndPAD
$PAD
Sh "2" R 1417 630 0 0 0
Dr 0 0 0
At SMD N 00888000
Ne 0 ""
Po -1083 0
$EndPAD
$SHAPE3D
Na "walter\\smd_cap\\c_elec_6_3x5_8.wrl"
Sc 1 1 1
Of 0 0 0
Ro 0 0 0
$EndSHAPE3D
$EndMODULE c_elec_6.3x5.8
$MODULE c_elec_6.3x7.7
Po 0 0 0 15 5033A93B 00000000 ~~
Li c_elec_6.3x7.7
Cd SMT capacitor, aluminium electrolytic, 6.3x7.7
Sc 0
AR 
Op 0 0 0
T0 0 -1634 392 392 0 77 N V 21 N "c_elec_6.3x7.7"
T1 0 0 314 314 900 59 N I 21 N "Value"
DS -1150 -300 -1150 300 50 21
DS -1100 450 -1100 -450 50 21
DS -1050 -550 -1050 550 50 21
DS -1000 650 -1000 -650 50 21
DS -950 -700 -950 700 50 21
DC 0 0 -1200 0 50 21
DS -1300 -1300 -1300 1300 50 21
DS -1300 1300 1000 1300 50 21
DS 1000 1300 1300 1000 50 21
DS 1300 1000 1300 -1000 50 21
DS 1300 -1000 1000 -1300 50 21
DS 1000 -1300 -1300 -1300 50 21
DS 1696 -650 1396 -650 50 21
DS 1546 -800 1546 -500 50 21
$PAD
Sh "1" R 1417 630 0 0 0
Dr 0 0 0
At SMD N 00888000
Ne 0 ""
Po 1083 0
$EndPAD
$PAD
Sh "2" R 1417 630 0 0 0
Dr 0 0 0
At SMD N 00888000
Ne 0 ""
Po -1083 0
$EndPAD
$SHAPE3D
Na "walter\\smd_cap\\c_elec_6_3x7_7.wrl"
Sc 1 1 1
Of 0 0 0
Ro 0 0 0
$EndSHAPE3D
$EndMODULE c_elec_6.3x7.7
$MODULE c_elec_8x10
Po 0 0 0 15 5033AA18 00000000 ~~
Li c_elec_8x10
Cd SMT capacitor, aluminium electrolytic, 8x10
Sc 0
AR 
Op 0 0 0
T0 0 -1987 392 392 0 77 N V 21 N "c_elec_8x10"
T1 0 0 393 393 900 78 N I 21 N "Value"
DS -1500 -400 -1500 400 50 21
DS -1450 550 -1450 -550 50 21
DS -1400 -650 -1400 650 50 21
DS -1350 750 -1350 -750 50 21
DS -1300 800 -1300 -800 50 21
DS -1250 -900 -1250 900 50 21
DC 0 0 1550 0 50 21
DS -1650 -1650 -1650 1650 50 21
DS -1650 1650 1350 1650 50 21
DS 1350 1650 1650 1350 50 21
DS 1650 1350 1650 -1350 50 21
DS 1650 -1350 1350 -1650 50 21
DS 1350 -1650 -1650 -1650 50 21
DS 2040 -650 1740 -650 50 21
DS 1891 -799 1891 -499 50 21
$PAD
Sh "1" R 1575 630 0 0 0
Dr 0 0 0
At SMD N 00888000
Ne 0 ""
Po 1201 0
$EndPAD
$PAD
Sh "2" R 1575 630 0 0 0
Dr 0 0 0
At SMD N 00888000
Ne 0 ""
Po -1201 0
$EndPAD
$SHAPE3D
Na "walter\\smd_cap\\c_elec_8x10.wrl"
Sc 1 1 1
Of 0 0 0
Ro 0 0 0
$EndSHAPE3D
$EndMODULE c_elec_8x10
$MODULE c_elec_8x10.5
Po 0 0 0 15 5033AA18 00000000 ~~
Li c_elec_8x10.5
Cd SMT capacitor, aluminium electrolytic, 8x10.5
Sc 0
AR 
Op 0 0 0
T0 0 -1987 392 392 0 77 N V 21 N "c_elec_8x10.5"
T1 0 0 393 393 900 78 N I 21 N "Value"
DS -1500 -400 -1500 400 50 21
DS -1450 550 -1450 -550 50 21
DS -1400 -650 -1400 650 50 21
DS -1350 750 -1350 -750 50 21
DS -1300 800 -1300 -800 50 21
DS -1250 -900 -1250 900 50 21
DC 0 0 1550 0 50 21
DS -1650 -1650 -1650 1650 50 21
DS -1650 1650 1350 1650 50 21
DS 1350 1650 1650 1350 50 21
DS 1650 1350 1650 -1350 50 21
DS 1650 -1350 1350 -1650 50 21
DS 1350 -1650 -1650 -1650 50 21
DS 2040 -650 1740 -650 50 21
DS 1891 -799 1891 -499 50 21
$PAD
Sh "1" R 1575 630 0 0 0
Dr 0 0 0
At SMD N 00888000
Ne 0 ""
Po 1201 0
$EndPAD
$PAD
Sh "2" R 1575 630 0 0 0
Dr 0 0 0
At SMD N 00888000
Ne 0 ""
Po -1201 0
$EndPAD
$SHAPE3D
Na "walter\\smd_cap\\c_elec_8x10_5.wrl"
Sc 1 1 1
Of 0 0 0
Ro 0 0 0
$EndSHAPE3D
$EndMODULE c_elec_8x10.5
$MODULE c_elec_8x6.5
Po 0 0 0 15 5033AA18 00000000 ~~
Li c_elec_8x6.5
Cd SMT capacitor, aluminium electrolytic, 8x6.5
Sc 0
AR 
Op 0 0 0
T0 0 -1988 393 393 0 78 N V 21 N "c_elec_8x6.5"
T1 0 0 393 393 900 78 N I 21 N "Value"
DS -1500 -400 -1500 400 50 21
DS -1450 550 -1450 -550 50 21
DS -1400 -650 -1400 650 50 21
DS -1350 750 -1350 -750 50 21
DS -1300 800 -1300 -800 50 21
DS -1250 -900 -1250 900 50 21
DC 0 0 1550 0 50 21
DS -1650 -1650 -1650 1650 50 21
DS -1650 1650 1350 1650 50 21
DS 1350 1650 1650 1350 50 21
DS 1650 1350 1650 -1350 50 21
DS 1650 -1350 1350 -1650 50 21
DS 1350 -1650 -1650 -1650 50 21
DS 2040 -650 1740 -650 50 21
DS 1891 -799 1891 -499 50 21
$PAD
Sh "1" R 1575 630 0 0 0
Dr 0 0 0
At SMD N 00888000
Ne 0 ""
Po 1201 0
$EndPAD
$PAD
Sh "2" R 1575 630 0 0 0
Dr 0 0 0
At SMD N 00888000
Ne 0 ""
Po -1201 0
$EndPAD
$SHAPE3D
Na "walter\\smd_cap\\c_elec_8x6_5.wrl"
Sc 1 1 1
Of 0 0 0
Ro 0 0 0
$EndSHAPE3D
$EndMODULE c_elec_8x6.5
$MODULE c_elec_8x6.7
Po 0 0 0 15 5033AA18 00000000 ~~
Li c_elec_8x6.7
Cd SMT capacitor, aluminium electrolytic, 8x6.7
Sc 0
AR 
Op 0 0 0
T0 0 -1987 392 392 0 77 N V 21 N "c_elec_8x6.7"
T1 0 0 393 393 900 78 N I 21 N "Value"
DS -1500 -400 -1500 400 50 21
DS -1450 550 -1450 -550 50 21
DS -1400 -650 -1400 650 50 21
DS -1350 750 -1350 -750 50 21
DS -1300 800 -1300 -800 50 21
DS -1250 -900 -1250 900 50 21
DC 0 0 1550 0 50 21
DS -1650 -1650 -1650 1650 50 21
DS -1650 1650 1350 1650 50 21
DS 1350 1650 1650 1350 50 21
DS 1650 1350 1650 -1350 50 21
DS 1650 -1350 1350 -1650 50 21
DS 1350 -1650 -1650 -1650 50 21
DS 2040 -650 1740 -650 50 21
DS 1891 -799 1891 -499 50 21
$PAD
Sh "1" R 1575 630 0 0 0
Dr 0 0 0
At SMD N 00888000
Ne 0 ""
Po 1201 0
$EndPAD
$PAD
Sh "2" R 1575 630 0 0 0
Dr 0 0 0
At SMD N 00888000
Ne 0 ""
Po -1201 0
$EndPAD
$SHAPE3D
Na "walter\\smd_cap\\c_elec_8x6_7.wrl"
Sc 1 1 1
Of 0 0 0
Ro 0 0 0
$EndSHAPE3D
$EndMODULE c_elec_8x6.7
$MODULE c_tant_A
Po 0 0 0 15 5033ABDF 00000000 ~~
Li c_tant_A
Cd SMT capacitor, tantalum size A
Sc 0
AR /4E772463/4E774367
Op 0 0 0
.LocalClearance 78
T0 0 -728 393 393 0 78 N V 21 N "c_tant_A"
T1 0 0 314 314 0 59 N I 21 N "Value"
DS 1043 -413 1043 413 78 21
DS -1043 -413 -1043 413 78 21
DS -1043 413 1122 413 78 21
DS 1122 413 1122 -413 78 21
DS -1024 -413 1122 -413 78 21
T2 1260 -551 315 315 0 59 N V 21 N "+"
$PAD
Sh "1" R 767 590 0 0 0
Dr 0 0 0
At SMD N 00888000
Ne 0 ""
Po 540 0
$EndPAD
$PAD
Sh "2" R 767 590 0 0 0
Dr 0 0 0
At SMD N 00888000
Ne 0 ""
Po -540 0
$EndPAD
$SHAPE3D
Na "walter\\smd_cap\\c_tant_A.wrl"
Sc 1 1 1
Of 0 0 0
Ro 0 0 0
$EndSHAPE3D
$EndMODULE c_tant_A
$MODULE c_tant_B
Po 0 0 0 15 5033AC28 00000000 ~~
Li c_tant_B
Cd SMT capacitor, tantalum size B
Sc 0
AR 
Op 0 0 0
.LocalClearance 78
T0 0 -945 393 393 0 78 N V 21 N "c_tant_B"
T1 0 0 315 315 0 59 N I 21 N "Value"
T2 1378 -748 315 315 0 59 N V 21 N "+"
DS 1102 -630 1220 -630 79 21
DS 1220 -630 1220 630 79 21
DS 1220 630 1102 630 79 21
DS 1102 -630 1102 630 79 21
DS 1102 630 -1102 630 79 21
DS -1102 630 -1102 -630 79 21
DS -1102 -630 1102 -630 79 21
$PAD
Sh "1" R 768 984 0 0 0
Dr 0 0 0
At SMD N 00888000
Ne 0 ""
Po 600 0
$EndPAD
$PAD
Sh "2" R 768 984 0 0 0
Dr 0 0 0
At SMD N 00888000
Ne 0 ""
Po -600 0
$EndPAD
$SHAPE3D
Na "walter\\smd_cap\\c_tant_B.wrl"
Sc 1 1 1
Of 0 0 0
Ro 0 0 0
$EndSHAPE3D
$EndMODULE c_tant_B
$MODULE c_tant_C
Po 0 0 0 15 5033AC5C 00000000 ~~
Li c_tant_C
Cd SMT capacitor, tantalum size C
Sc 0
AR 
Op 0 0 0
.LocalClearance 78
T0 0 -945 393 393 0 78 N V 21 N "c_tant_C"
T1 0 0 315 315 0 59 N I 21 N "Value"
T2 1890 -748 315 315 0 59 N V 21 N "+"
DS 1614 -630 1732 -630 79 21
DS 1732 -630 1732 630 79 21
DS 1732 630 1614 630 79 21
DS -1614 -630 1614 -630 79 21
DS 1614 -630 1614 630 79 21
DS 1614 630 -1614 630 79 21
DS -1614 630 -1614 -630 79 21
$PAD
Sh "1" R 1004 984 0 0 0
Dr 0 0 0
At SMD N 00888000
Ne 0 ""
Po 994 0
$EndPAD
$PAD
Sh "2" R 1004 984 0 0 0
Dr 0 0 0
At SMD N 00888000
Ne 0 ""
Po -994 0
$EndPAD
$SHAPE3D
Na "walter\\smd_cap\\c_tant_C.wrl"
Sc 1 1 1
Of 0 0 0
Ro 0 0 0
$EndSHAPE3D
$EndMODULE c_tant_C
$MODULE c_tant_D
Po 0 0 0 15 5033AD4D 00000000 ~~
Li c_tant_D
Cd SMT capacitor, tantalum size D
Sc 0
AR 
Op 0 0 0
.LocalClearance 78
T0 0 -1201 393 393 0 78 N V 21 N "c_tant_D"
T1 0 0 392 392 0 77 N I 21 N "Value"
T2 2087 -1043 393 393 0 78 N V 21 N "+"
DS 1929 -886 1929 886 78 21
DS 1929 886 1811 886 78 21
DS 1811 -886 1929 -886 78 21
DS -1811 -886 1811 -886 78 21
DS 1811 -886 1811 886 78 21
DS 1811 886 -1811 886 78 21
DS -1811 886 -1811 -886 78 21
$PAD
Sh "1" R 1004 1496 0 0 0
Dr 0 0 0
At SMD N 00888000
Ne 0 ""
Po 1181 0
$EndPAD
$PAD
Sh "2" R 1004 1496 0 0 0
Dr 0 0 0
At SMD N 00888000
Ne 0 ""
Po -1181 0
$EndPAD
$SHAPE3D
Na "walter\\smd_cap\\c_tant_D.wrl"
Sc 1 1 1
Of 0 0 0
Ro 0 0 0
$EndSHAPE3D
$EndMODULE c_tant_D
$MODULE c_tant_E
Po 0 0 0 15 5033BAB1 00000000 ~~
Li c_tant_E
Cd SMT capacitor, tantalum size E
Sc 0
AR 
Op 0 0 0
T0 0 -1400 393 393 0 78 N V 21 N "c_tant_E"
T1 0 0 393 393 0 78 N I 21 N "Value"
T2 2146 -1181 393 393 0 78 N V 21 N "+"
DS 1831 -1024 1949 -1024 78 21
DS 1949 -1024 1949 1024 78 21
DS 1949 1024 1831 1024 78 21
DS -1831 -1024 1831 -1024 78 21
DS 1831 -1024 1831 1024 78 21
DS 1831 1024 -1831 1024 78 21
DS -1831 1024 -1831 -1024 78 21
$PAD
Sh "1" R 1004 1732 0 0 0
Dr 0 0 0
At SMD N 00888000
Ne 0 ""
Po 1181 0
$EndPAD
$PAD
Sh "2" R 1004 1732 0 0 0
Dr 0 0 0
At SMD N 00888000
Ne 0 ""
Po -1181 0
$EndPAD
$SHAPE3D
Na "walter\\smd_cap\\c_tant_E.wrl"
Sc 1 1 1
Of 0 0 0
Ro 0 0 0
$EndSHAPE3D
$EndMODULE c_tant_E
$MODULE c_tant_R
Po 0 0 0 15 5033BB43 00000000 ~~
Li c_tant_R
Cd SMT capacitor, tantalum size R
Sc 0
AR 
Op 0 0 0
.LocalClearance 78
T0 0 -787 393 393 0 78 N V 21 N "c_tant_R"
T1 0 0 314 314 0 59 N I 21 N "Value"
T2 1161 -610 393 393 0 78 N V 21 N "+"
DS 886 -472 984 -472 78 21
DS 984 -472 984 472 78 21
DS 984 472 886 472 78 21
DS -886 -472 886 -472 78 21
DS 886 -472 886 472 78 21
DS 886 472 -886 472 78 21
DS -886 472 -886 -472 78 21
$PAD
Sh "1" R 610 709 0 0 0
Dr 0 0 0
At SMD N 00888000
Ne 0 ""
Po 463 0
$EndPAD
$PAD
Sh "2" R 610 709 0 0 0
Dr 0 0 0
At SMD N 00888000
Ne 0 ""
Po -463 0
$EndPAD
$SHAPE3D
Na "walter\\smd_cap\\c_tant_R.wrl"
Sc 1 1 1
Of 0 0 0
Ro 0 0 0
$EndSHAPE3D
$EndMODULE c_tant_R
$MODULE c_tant_S
Po 0 0 0 15 5033BC11 00000000 ~~
Li c_tant_S
Cd SMT capacitor, tantalum size S
Sc 0
AR 
Op 0 0 0
T0 0 -748 393 393 0 78 N V 21 N "c_tant_S"
T1 0 0 314 314 0 59 N I 21 N "Value"
DS 1063 -433 1181 -433 78 21
DS 1181 -433 1181 433 78 21
DS 1181 433 1063 433 78 21
DS -1063 -433 1063 -433 78 21
DS 1063 -433 1063 433 78 21
DS 1063 433 -1063 433 78 21
DS -1063 433 -1063 -433 78 21
$PAD
Sh "1" R 768 591 0 0 0
Dr 0 0 0
At SMD N 00888000
Ne 0 ""
Po 541 0
$EndPAD
$PAD
Sh "2" R 768 591 0 0 0
Dr 0 0 0
At SMD N 00888000
Ne 0 ""
Po -541 0
$EndPAD
$SHAPE3D
Na "walter\\smd_cap\\c_tant_S.wrl"
Sc 1 1 1
Of 0 0 0
Ro 0 0 0
$EndSHAPE3D
$EndMODULE c_tant_S
$MODULE c_tant_T
Po 0 0 0 15 5033BC82 00000000 ~~
Li c_tant_T
Cd SMT capacitor, tantalum size T
Sc 0
AR 
Op 0 0 0
T0 0 -925 393 393 0 78 N V 21 N "c_tant_T"
T1 0 0 314 314 0 59 N I 21 N "Value"
T2 1398 -787 393 393 0 78 N V 21 N "+"
DS 1122 -630 1240 -630 78 21
DS 1240 -630 1240 630 78 21
DS 1240 630 1122 630 78 21
DS -1122 -630 1122 -630 78 21
DS 1122 -630 1122 630 78 21
DS 1122 630 -1122 630 78 21
DS -1122 630 -1122 -630 78 21
$PAD
Sh "1" R 768 984 0 0 0
Dr 0 0 0
At SMD N 00888000
Ne 0 ""
Po 600 0
$EndPAD
$PAD
Sh "2" R 768 984 0 0 0
Dr 0 0 0
At SMD N 00888000
Ne 0 ""
Po -600 0
$EndPAD
$SHAPE3D
Na "walter\\smd_cap\\c_tant_T.wrl"
Sc 1 1 1
Of 0 0 0
Ro 0 0 0
$EndSHAPE3D
$EndMODULE c_tant_T
$MODULE c_tant_U
Po 0 0 0 15 5033BD06 00000000 ~~
Li c_tant_U
Cd SMT capacitor, tantalum size U
Sc 0
AR 
Op 0 0 0
T0 0 -945 393 393 0 78 N V 21 N "c_tant_U"
T1 0 0 393 393 0 78 N I 21 N "Value"
T2 1929 -787 393 393 0 78 N V 21 N "+"
DS 1634 -630 1772 -630 78 21
DS 1772 -630 1772 630 78 21
DS 1772 630 1614 630 78 21
DS -1634 -630 1634 -630 78 21
DS 1634 -630 1634 630 78 21
DS 1634 630 -1634 630 78 21
DS -1634 630 -1634 -630 78 21
$PAD
Sh "1" R 1004 984 0 0 0
Dr 0 0 0
At SMD N 00888000
Ne 0 ""
Po 994 0
$EndPAD
$PAD
Sh "2" R 1004 984 0 0 0
Dr 0 0 0
At SMD N 00888000
Ne 0 ""
Po -994 0
$EndPAD
$SHAPE3D
Na "walter\\smd_cap\\c_tant_U.wrl"
Sc 1 1 1
Of 0 0 0
Ro 0 0 0
$EndSHAPE3D
$EndMODULE c_tant_U
$MODULE c_tant_V
Po 0 0 0 15 5033BDA0 00000000 ~~
Li c_tant_V
Cd SMT capacitor, tantalum size V
Sc 0
AR 
Op 0 0 0
T0 0 -1240 393 393 0 78 N V 21 N "c_tant_V"
T1 0 0 393 393 0 78 N I 21 N "Value"
DS 1831 -886 1969 -886 78 21
DS 1969 -886 1969 886 78 21
DS 1969 886 1831 886 78 21
DS -1831 -886 1831 -886 78 21
DS 1831 -886 1831 886 78 21
DS 1831 886 -1831 886 78 21
DS -1831 886 -1831 -886 78 21
$PAD
Sh "1" R 1004 1063 0 0 0
Dr 0 0 0
At SMD N 00888000
Ne 0 ""
Po 1181 0
$EndPAD
$PAD
Sh "2" R 1004 1496 0 0 0
Dr 0 0 0
At SMD N 00888000
Ne 0 ""
Po -1181 0
$EndPAD
$SHAPE3D
Na "walter\\smd_cap\\c_tant_V.wrl"
Sc 1 1 1
Of 0 0 0
Ro 0 0 0
$EndSHAPE3D
$EndMODULE c_tant_V
$MODULE c_tant_X
Po 0 0 0 15 5033BE3B 00000000 ~~
Li c_tant_X
Cd SMT capacitor, tantalum size X
Sc 0
AR 
Op 0 0 0
T0 -20 -1220 393 393 0 78 N V 21 N "c_tant_X"
T1 0 0 393 393 0 78 N I 21 N "Value"
DS 1831 -886 1949 -886 78 21
DS 1949 -886 1949 886 78 21
DS 1949 886 1831 886 78 21
DS -1831 -886 1831 -886 78 21
DS 1831 -886 1831 886 78 21
DS 1831 886 -1831 886 78 21
DS -1831 886 -1831 -886 78 21
$PAD
Sh "1" R 1004 1063 0 0 0
Dr 0 0 0
At SMD N 00888000
Ne 0 ""
Po 1181 0
$EndPAD
$PAD
Sh "2" R 1004 1496 0 0 0
Dr 0 0 0
At SMD N 00888000
Ne 0 ""
Po -1181 0
$EndPAD
$SHAPE3D
Na "walter\\smd_cap\\c_tant_X.wrl"
Sc 1 1 1
Of 0 0 0
Ro 0 0 0
$EndSHAPE3D
$EndMODULE c_tant_X
$EndLIBRARY
