PCBNEW-LibModule-V1  St 20. červen 2012, 17:57:10 CEST
# encoding utf-8
Units deci-mils
$INDEX
MPX5700AP
MPX5700AP_h
MPX5700AP_h2
MPX5700AS
MPX5700ASX
MPX5700AS_h
MPX5700D
MPX5700DP
MPX5700DP_h
MPX5700D_h
$EndINDEX
$MODULE MPX5700AP
Po 0 0 0 15 4FE1EF1E 00000000 ~~
Li MPX5700AP
Cd 50 KPA PRESSURE SENSOR
Kw 50 KPA PRESSURE SENSOR
Sc 0
AR 
Op 0 0 0
At VIRTUAL
T0 0 -2500 393 393 0 78 N V 21 N "MPX5700AP"
T1 0 1500 393 393 0 78 N I 21 N "Value"
DS -5807 629 -5807 -2125 100 21
DS -5807 -2125 -3425 -2125 100 21
DS -3425 -2125 5807 -2125 100 21
DS 5807 -2125 5807 629 100 21
DS -5767 -629 -3425 -629 100 21
DS -3425 -629 3759 -629 100 21
DS 3759 -629 5787 -629 100 21
DS 3425 0 -3425 0 100 21
DS -5275 -2086 -5275 610 40 21
DS -3818 -2086 -3818 629 40 21
DS -2460 -2086 -2460 -669 100 21
DS -3425 629 -3818 629 100 21
DS -3818 629 -5807 629 100 21
DS 5275 -649 5275 -2106 40 21
DS 3818 -669 3818 -2106 40 21
DS -3425 -2125 -3425 -629 100 21
DS -3425 -629 -3425 0 100 21
DS -3425 0 -3425 629 100 21
DS 3759 -629 3759 629 100 21
DS 5334 -610 5334 590 100 21
DS -2657 1023 2657 1023 100 21
DS -2657 1023 -3425 629 100 21
DS 2657 1023 3425 629 100 21
DS 5807 629 3759 629 100 21
DS 3759 629 3425 629 100 21
DS 3425 0 3425 629 100 21
DS 3425 0 3425 -610 100 21
DC -1574 -1377 -1957 -1760 50 21
DC -1574 -1377 -2026 -1829 50 21
$PAD
Sh "2" C 436 436 0 0 0
Dr 236 0 0
At STD N 00A8FFFF
Ne 0 ""
Po -1500 0
$EndPAD
$PAD
Sh "3" C 436 436 0 0 0
Dr 236 0 0
At STD N 00A8FFFF
Ne 0 ""
Po -500 0
$EndPAD
$PAD
Sh "4" C 436 436 0 0 0
Dr 236 0 0
At STD N 00A8FFFF
Ne 0 ""
Po 500 0
$EndPAD
$PAD
Sh "5" C 436 436 0 0 0
Dr 236 0 0
At STD N 00A8FFFF
Ne 0 ""
Po 1500 0
$EndPAD
$PAD
Sh "1" C 436 436 0 0 0
Dr 236 0 0
At STD N 00A8FFFF
Ne 0 ""
Po -2500 0
$EndPAD
$PAD
Sh "6" C 436 436 0 0 0
Dr 236 0 0
At STD N 00A8FFFF
Ne 0 ""
Po 2500 0
$EndPAD
$SHAPE3D
Na "Sensors/MPX5700AP.wrl"
Sc 1.54 1.54 1.54
Of 0 0 0
Ro 0 0 0
$EndSHAPE3D
$EndMODULE MPX5700AP
$MODULE MPX5700AP_h
Po 0 0 0 15 4FE1EF5B 00000000 ~~
Li MPX5700AP_h
Cd 50 KPA PRESSURE SENSOR
Kw 50 KPA PRESSURE SENSOR
Sc 0
AR 
Op 0 0 0
At VIRTUAL
T0 -6250 0 393 393 900 78 N V 21 N "MPX5700AP_h"
T1 1250 -4250 392 392 0 77 N I 21 N "Value"
DS 2500 5500 2500 2650 150 21
DS 1500 5500 1500 3200 150 21
DS 500 5500 500 3500 150 21
DS -500 5500 -500 3450 150 21
DS -1500 5500 -1500 3150 150 21
DS -2500 5500 -2500 2650 150 21
DS 5196 -1102 1653 -3070 100 21
DS 3740 1023 3346 1023 100 21
DS 5196 1102 1653 3070 100 21
DS -5196 1102 -1653 3070 100 21
DS -3740 -1023 -3346 -1023 100 21
DS -39 -3503 -2519 -3503 100 21
DS -2519 -3503 -2519 -2598 100 21
DS -2519 -2598 -2519 -2440 100 21
DS -708 -3543 -866 -3818 100 21
DS -866 -3818 -2322 -3818 100 21
DS -2322 -3818 -2480 -3543 100 21
DS -866 -3818 -866 -5078 100 21
DS -2322 -5078 -2322 -3818 100 21
DS -708 -5078 -866 -5078 100 21
DS -866 -5078 -2322 -5078 100 21
DS -2322 -5078 -2480 -5078 100 21
DS -2480 -5078 -2322 -7401 100 21
DS -2322 -7401 -866 -7401 100 21
DS -866 -7401 -708 -5078 100 21
DS -866 -7401 -866 -7913 100 21
DS -866 -7913 -2322 -7913 100 21
DS -2322 -7913 -2322 -7401 100 21
DS -5196 -1102 -2519 -2598 100 21
DC 0 0 -1751 1751 50 21
DC 0 0 -1555 1555 39 21
DC 0 0 -1318 1318 39 21
DC 0 0 -1102 1102 39 21
DC 4549 0 4942 393 50 21
DS 3761 0 5336 0 50 21
DS 4549 787 4549 -787 50 21
DC -4549 0 -4942 393 50 21
DS -5336 0 -3761 0 50 21
DS -4549 787 -4549 -787 50 21
DA 4527 1 5196 -1102 1863 100 21
DA -34 0 0 -3503 282 100 21
DA -4 0 3346 1023 729 100 21
DA -4527 -1 -5196 1102 1863 100 21
DA 34 0 0 3503 282 100 21
DA 0 -21 -3346 -1023 271 100 21
$PAD
Sh "2" C 436 436 0 0 0
Dr 236 0 0
At STD N 00A8FFFF
Ne 0 ""
Po -1500 5500
$EndPAD
$PAD
Sh "3" C 436 436 0 0 0
Dr 236 0 0
At STD N 00A8FFFF
Ne 0 ""
Po -500 5500
$EndPAD
$PAD
Sh "4" C 436 436 0 0 0
Dr 236 0 0
At STD N 00A8FFFF
Ne 0 ""
Po 500 5500
$EndPAD
$PAD
Sh "5" C 436 436 0 0 0
Dr 236 0 0
At STD N 00A8FFFF
Ne 0 ""
Po 1500 5500
$EndPAD
$PAD
Sh "6" C 436 436 0 0 0
Dr 236 0 0
At STD N 00A8FFFF
Ne 0 ""
Po 2500 5500
$EndPAD
$PAD
Sh "1" C 436 436 0 0 0
Dr 236 0 0
At STD N 00A8FFFF
Ne 0 ""
Po -2500 5500
$EndPAD
$SHAPE3D
Na "Sensors/MPX5700AP_h.wrl"
Sc 1.54 1.5 1.5
Of 0 0 0
Ro 0 0 0
$EndSHAPE3D
$EndMODULE MPX5700AP_h
$MODULE MPX5700AP_h2
Po 0 0 0 15 4FE1EFFE 00000000 ~~
Li MPX5700AP_h2
Cd 50 KPA PRESSURE SENSOR
Kw 50 KPA PRESSURE SENSOR
Sc 0
AR 
Op 0 0 0
At VIRTUAL
T0 -6250 0 393 393 900 78 N V 21 N "MPX5700AP_h2"
T1 0 0 393 393 900 78 N I 21 N "Value"
DS 2500 -5500 2500 -2650 150 21
DS 1500 -5500 1500 -3200 150 21
DS 500 -5500 500 -3500 150 21
DS -500 -5500 -500 -3450 150 21
DS -1500 -5500 -1500 -3150 150 21
DS -2500 -5500 -2500 -2650 150 21
DS 5196 1102 1653 3070 100 21
DS 3740 -1023 3346 -1023 100 21
DS 5196 -1102 1653 -3070 100 21
DS -5196 -1102 -1653 -3070 100 21
DS -3740 1023 -3346 1023 100 21
DS -39 3503 -2519 3503 100 21
DS -2519 3503 -2519 2598 100 21
DS -2519 2598 -2519 2440 100 21
DS -708 3543 -866 3818 100 21
DS -866 3818 -2322 3818 100 21
DS -2322 3818 -2480 3543 100 21
DS -866 3818 -866 5078 100 21
DS -2322 5078 -2322 3818 100 21
DS -708 5078 -866 5078 100 21
DS -866 5078 -2322 5078 100 21
DS -2322 5078 -2480 5078 100 21
DS -2480 5078 -2322 7401 100 21
DS -2322 7401 -866 7401 100 21
DS -866 7401 -708 5078 100 21
DS -866 7401 -866 7913 100 21
DS -866 7913 -2322 7913 100 21
DS -2322 7913 -2322 7401 100 21
DS -5196 1102 -2519 2598 100 21
DC 4549 0 4942 -393 50 21
DS 3761 0 5336 0 50 21
DS 4549 -787 4549 787 50 21
DC -4549 0 -4942 -393 50 21
DS -5336 0 -3761 0 50 21
DS -4549 -787 -4549 787 50 21
DA 4527 -1 5196 1102 -1863 100 21
DA -34 0 0 3503 -282 100 21
DA -4 0 3346 -1023 -729 100 21
DA -4527 1 -5196 -1102 -1863 100 21
DA 34 0 0 -3503 -282 100 21
DA 0 21 -3346 1023 -271 100 21
$PAD
Sh "5" C 436 436 0 0 0
Dr 236 0 0
At STD N 00A8FFFF
Ne 0 ""
Po -1500 -5500
$EndPAD
$PAD
Sh "4" C 436 436 0 0 0
Dr 236 0 0
At STD N 00A8FFFF
Ne 0 ""
Po -500 -5500
$EndPAD
$PAD
Sh "3" C 436 436 0 0 0
Dr 236 0 0
At STD N 00A8FFFF
Ne 0 ""
Po 500 -5500
$EndPAD
$PAD
Sh "2" C 436 436 0 0 0
Dr 236 0 0
At STD N 00A8FFFF
Ne 0 ""
Po 1500 -5500
$EndPAD
$PAD
Sh "1" C 436 436 0 0 0
Dr 236 0 0
At STD N 00A8FFFF
Ne 0 ""
Po 2500 -5500
$EndPAD
$PAD
Sh "6" C 436 436 0 0 0
Dr 236 0 0
At STD N 00A8FFFF
Ne 0 ""
Po -2500 -5500
$EndPAD
$SHAPE3D
Na "Sensors/MPX5700AP_h2.wrl"
Sc 1.5 1.5 1.5
Of 0 0 0
Ro 0 0 0
$EndSHAPE3D
$EndMODULE MPX5700AP_h2
$MODULE MPX5700AS
Po 0 0 0 15 4FE1F089 00000000 ~~
Li MPX5700AS
Cd 50 KPA PRESSURE SENSOR
Kw 50 KPA PRESSURE SENSOR
Sc 0
AR 
Op 0 0 0
At VIRTUAL
T0 0 -1500 393 393 0 78 N V 21 N "MPX5700AS"
T1 0 1250 392 392 0 77 N I 21 N "Value"
DS -3400 -1050 3450 -1050 100 21
DS 3425 -1043 3425 1870 100 21
DS -3425 -1043 -3425 1870 100 21
DS 3425 1870 -3425 1870 100 21
DS -787 5334 787 5334 100 21
DS 787 5334 787 5019 100 21
DS -787 5334 -787 5019 100 21
DS -787 5019 787 5019 100 21
DS 787 5019 944 3503 100 21
DS -787 5019 -944 3503 100 21
DS -944 3503 944 3503 100 21
DS -787 1889 -787 3464 100 21
DS 787 1889 787 3484 100 21
$PAD
Sh "2" C 436 436 0 0 0
Dr 236 0 0
At STD N 00A8FFFF
Ne 0 ""
Po -1500 0
$EndPAD
$PAD
Sh "3" C 436 436 0 0 0
Dr 236 0 0
At STD N 00A8FFFF
Ne 0 ""
Po -500 0
$EndPAD
$PAD
Sh "4" C 436 436 0 0 0
Dr 236 0 0
At STD N 00A8FFFF
Ne 0 ""
Po 500 0
$EndPAD
$PAD
Sh "5" C 436 436 0 0 0
Dr 236 0 0
At STD N 00A8FFFF
Ne 0 ""
Po 1500 0
$EndPAD
$PAD
Sh "1" C 436 436 0 0 0
Dr 236 0 0
At STD N 00A8FFFF
Ne 0 ""
Po -2500 0
$EndPAD
$PAD
Sh "6" C 436 436 0 0 0
Dr 236 0 0
At STD N 00A8FFFF
Ne 0 ""
Po 2500 0
$EndPAD
$SHAPE3D
Na "Sensors/MPX5700AS.wrl"
Sc 1.5 1.5 1.5
Of 0 0 0
Ro 0 0 0
$EndSHAPE3D
$EndMODULE MPX5700AS
$MODULE MPX5700ASX
Po 0 0 0 15 4FE1F0FE 00000000 ~~
Li MPX5700ASX
Cd 50 KPA PRESSURE SENSOR
Kw 50 KPA PRESSURE SENSOR
Sc 0
AR 
Op 0 0 0
At VIRTUAL
T0 0 -1500 393 392 0 77 N V 21 N "MPX5700ASX"
T1 0 1250 393 393 0 78 N I 21 N "Value"
DS 3425 -1043 3425 1870 100 21
DS -3425 -1043 -3425 1870 100 21
DS -5551 -1062 5551 -1062 100 21
DS 5551 -1062 5551 1870 100 21
DS 5551 1870 3425 1870 100 21
DS 3425 1870 -3425 1870 100 21
DS -3425 1870 -5551 1870 100 21
DS -5551 1870 -5551 -1062 100 21
DS -787 5334 787 5334 100 21
DS 787 5334 787 5019 100 21
DS -787 5334 -787 5019 100 21
DS -787 5019 787 5019 100 21
DS 787 5019 944 3503 100 21
DS -787 5019 -944 3503 100 21
DS -944 3503 944 3503 100 21
DS -787 1889 -787 3464 100 21
DS 787 1889 787 3484 100 21
$PAD
Sh "2" C 436 436 0 0 0
Dr 236 0 0
At STD N 00A8FFFF
Ne 0 ""
Po -1500 0
$EndPAD
$PAD
Sh "3" C 436 436 0 0 0
Dr 236 0 0
At STD N 00A8FFFF
Ne 0 ""
Po -500 0
$EndPAD
$PAD
Sh "4" C 436 436 0 0 0
Dr 236 0 0
At STD N 00A8FFFF
Ne 0 ""
Po 500 0
$EndPAD
$PAD
Sh "5" C 436 436 0 0 0
Dr 236 0 0
At STD N 00A8FFFF
Ne 0 ""
Po 1500 0
$EndPAD
$PAD
Sh "1" C 436 436 0 0 0
Dr 236 0 0
At STD N 00A8FFFF
Ne 0 ""
Po -2500 0
$EndPAD
$PAD
Sh "6" C 436 436 0 0 0
Dr 236 0 0
At STD N 00A8FFFF
Ne 0 ""
Po 2500 0
$EndPAD
$SHAPE3D
Na "Sensors/MPX5700ASX.wrl"
Sc 1.5 1.5 1.5
Of 0 0 0
Ro 0 0 0
$EndSHAPE3D
$EndMODULE MPX5700ASX
$MODULE MPX5700AS_h
Po 0 0 0 15 4FE1F141 00000000 ~~
Li MPX5700AS_h
Cd 50 KPA PRESSURE SENSOR
Kw 50 KPA PRESSURE SENSOR
Sc 0
AR 
Op 0 0 0
At VIRTUAL
T0 -4500 0 393 393 900 78 N V 21 N "MPX5700AS_h"
T1 4500 0 393 393 900 78 N I 21 N "Value"
DS 2500 5500 2500 2850 150 21
DS 1500 5500 1500 3450 150 21
DS 500 5500 500 3750 150 21
DS -500 5500 -500 3750 150 21
DS -1500 5500 -1500 3500 150 21
DS -2500 5500 -2500 2850 150 21
DC 0 0 3750 500 150 21
DS -1614 5492 -1377 5492 26 21
DS -614 5492 -377 5492 26 21
DS 385 5492 622 5492 26 21
DS 1385 5492 1622 5492 26 21
DC 0 0 -1318 1318 39 21
DC 0 0 -1102 1102 39 21
DC 0 0 -1663 1663 50 21
DC 0 0 -472 472 50 21
DC 0 0 -393 393 50 21
DA 0 0 -3405 -1555 1315 100 21
DA 9 -33 3425 1515 379 100 21
DA 54 0 1220 3543 71 100 21
DA 0 0 236 3740 72 100 21
DA -9 -33 -1751 3287 379 100 21
DA -54 0 -767 3661 71 100 21
$PAD
Sh "2" C 436 436 0 0 0
Dr 236 0 0
At STD N 00A8FFFF
Ne 0 ""
Po -1500 5500
$EndPAD
$PAD
Sh "3" C 436 436 0 0 0
Dr 236 0 0
At STD N 00A8FFFF
Ne 0 ""
Po -500 5500
$EndPAD
$PAD
Sh "4" C 436 436 0 0 0
Dr 236 0 0
At STD N 00A8FFFF
Ne 0 ""
Po 500 5500
$EndPAD
$PAD
Sh "5" C 436 436 0 0 0
Dr 236 0 0
At STD N 00A8FFFF
Ne 0 ""
Po 1500 5500
$EndPAD
$PAD
Sh "1" C 436 436 0 0 0
Dr 236 0 0
At STD N 00A8FFFF
Ne 0 ""
Po -2500 5500
$EndPAD
$PAD
Sh "6" C 436 436 0 0 0
Dr 236 0 0
At STD N 00A8FFFF
Ne 0 ""
Po 2500 5500
$EndPAD
$SHAPE3D
Na "Sensors/MPX5700AP_h.wrl"
Sc 1.5 1.5 1.5
Of 0 0 0
Ro 0 0 0
$EndSHAPE3D
$EndMODULE MPX5700AS_h
$MODULE MPX5700D
Po 0 0 0 15 4FE1F1A0 00000000 ~~
Li MPX5700D
Cd 50 KPA PRESSURE SENSOR
Kw 50 KPA PRESSURE SENSOR
Sc 0
AR 
Op 0 0 0
At VIRTUAL
T0 0 -1500 393 393 0 78 N V 21 N "MPX5700D"
T1 0 1500 393 393 0 78 N I 21 N "Value"
DS -2992 39 -2992 -39 100 21
DS -2992 -39 -2401 -1062 100 21
DS -2401 -1062 2401 -1062 100 21
DS 2401 -1062 2992 -39 100 21
DS 2992 -39 2992 39 100 21
DS 2992 39 2401 984 100 21
DS 2401 984 2401 1062 100 21
DS 2401 1062 -2401 1062 100 21
DS -2401 1062 -2401 984 100 21
DS -2401 984 -2992 39 100 21
DS -2952 0 2952 0 100 21
DS 2401 984 -2401 984 100 21
DS -2451 -912 2451 -912 40 21
$PAD
Sh "2" C 436 436 0 0 0
Dr 236 0 0
At STD N 00A8FFFF
Ne 0 ""
Po -1500 0
$EndPAD
$PAD
Sh "3" C 436 436 0 0 0
Dr 236 0 0
At STD N 00A8FFFF
Ne 0 ""
Po -500 0
$EndPAD
$PAD
Sh "4" C 436 436 0 0 0
Dr 236 0 0
At STD N 00A8FFFF
Ne 0 ""
Po 500 0
$EndPAD
$PAD
Sh "5" C 436 436 0 0 0
Dr 236 0 0
At STD N 00A8FFFF
Ne 0 ""
Po 1500 0
$EndPAD
$PAD
Sh "1" C 436 436 0 0 0
Dr 236 0 0
At STD N 00A8FFFF
Ne 0 ""
Po -2500 0
$EndPAD
$PAD
Sh "6" C 436 436 0 0 0
Dr 236 0 0
At STD N 00A8FFFF
Ne 0 ""
Po 2500 0
$EndPAD
$SHAPE3D
Na "Sensors/MPX5700D.wrl"
Sc 1.5 1.5 1.5
Of 0 0 0
Ro 0 0 0
$EndSHAPE3D
$EndMODULE MPX5700D
$MODULE MPX5700DP
Po 0 0 0 15 4FE1F1E5 00000000 ~~
Li MPX5700DP
Cd 50 KPA PRESSURE SENSOR
Kw 50 KPA PRESSURE SENSOR
Sc 0
AR 
Op 0 0 0
At VIRTUAL
T0 0 -2500 393 393 0 78 N V 21 N "MPX5700DP"
T1 0 2500 393 393 0 78 N I 21 N "Value"
DS -5807 2125 -5807 -2125 100 21
DS -5807 -2125 -3425 -2125 100 21
DS -3425 -2125 5807 -2125 100 21
DS 5807 -2125 5807 2125 100 21
DS 5807 2125 -5807 2125 100 21
DS -5767 -629 -3425 -629 100 21
DS -3425 -629 -2460 -629 100 21
DS -2460 -629 5767 -629 100 21
DS 5748 0 -5767 0 100 21
DS -5275 -2086 -5275 2106 40 21
DS -3818 -2086 -3818 2106 40 21
DS -2460 -2086 -2460 -669 100 21
DS 5767 629 3425 629 100 21
DS 3425 629 2460 629 100 21
DS 2460 629 -5767 629 100 21
DS 5275 2086 5275 -2106 40 21
DS 3818 2086 3818 -2106 40 21
DS 2460 2086 2460 669 100 21
DS 3425 2086 3425 629 100 21
DS -3425 -2125 -3425 -629 100 21
DS 2460 59 2460 629 100 21
DS -2460 -629 -2460 -19 100 21
DC -1574 -1377 -1957 -1760 50 21
DC -1574 -1377 -2026 -1829 50 21
DC 1574 1377 1957 1760 50 21
DC 1574 1377 2026 1829 50 21
$PAD
Sh "2" C 436 436 0 0 0
Dr 236 0 0
At STD N 00A8FFFF
Ne 0 ""
Po -1500 0
$EndPAD
$PAD
Sh "3" C 436 436 0 0 0
Dr 236 0 0
At STD N 00A8FFFF
Ne 0 ""
Po -500 0
$EndPAD
$PAD
Sh "4" C 436 436 0 0 0
Dr 236 0 0
At STD N 00A8FFFF
Ne 0 ""
Po 500 0
$EndPAD
$PAD
Sh "5" C 436 436 0 0 0
Dr 236 0 0
At STD N 00A8FFFF
Ne 0 ""
Po 1500 0
$EndPAD
$PAD
Sh "1" C 436 436 0 0 0
Dr 236 0 0
At STD N 00A8FFFF
Ne 0 ""
Po -2500 0
$EndPAD
$PAD
Sh "6" C 436 436 0 0 0
Dr 236 0 0
At STD N 00A8FFFF
Ne 0 ""
Po 2500 0
$EndPAD
$SHAPE3D
Na "Sensors/MPX5700DP.wrl"
Sc 1.5 1.5 1.5
Of 0 0 0
Ro 0 0 0
$EndSHAPE3D
$EndMODULE MPX5700DP
$MODULE MPX5700DP_h
Po 0 0 0 15 4FE1F234 00000000 ~~
Li MPX5700DP_h
Cd 50 KPA PRESSURE SENSOR
Kw 50 KPA PRESSURE SENSOR
Sc 0
AR 
Op 0 0 0
At VIRTUAL
T0 -6250 0 393 393 900 78 N V 21 N "MPX5700DP_h"
T1 0 0 393 393 0 78 N I 21 N "Value"
DS 2500 5500 2500 2650 150 21
DS 1500 5500 1500 3150 150 21
DS 500 5500 500 3450 150 21
DS -500 5500 -500 3450 150 21
DS -1500 5500 -1500 3150 150 21
DS -2500 5500 -2500 2600 150 21
DS 5196 1102 1653 3070 100 21
DS 3740 -1023 3346 -1023 100 21
DS 5196 -1102 2519 -2598 100 21
DS -5196 -1102 -1653 -3070 100 21
DS -3740 1023 -3346 1023 100 21
DS -39 -3503 -2519 -3503 100 21
DS -2519 -3503 -2519 -2598 100 21
DS -708 -3543 -866 -3818 100 21
DS -866 -3818 -2322 -3818 100 21
DS -2322 -3818 -2480 -3543 100 21
DS -866 -3818 -866 -5078 100 21
DS -2322 -5078 -2322 -3818 100 21
DS -708 -5078 -866 -5078 100 21
DS -866 -5078 -2322 -5078 100 21
DS -2322 -5078 -2480 -5078 100 21
DS -2480 -5078 -2322 -7401 100 21
DS -2322 -7401 -866 -7401 100 21
DS -866 -7401 -708 -5078 100 21
DS -866 -7401 -866 -7913 100 21
DS -866 -7913 -2322 -7913 100 21
DS -2322 -7913 -2322 -7401 100 21
DS 39 -3503 2519 -3503 100 21
DS 2519 -3503 2519 -2598 100 21
DS 2519 -2598 2519 -2440 100 21
DS 708 -3543 866 -3818 100 21
DS 866 -3818 2322 -3818 100 21
DS 2322 -3818 2480 -3543 100 21
DS 866 -3818 866 -5078 100 21
DS 2322 -5078 2322 -3818 100 21
DS 708 -5078 866 -5078 100 21
DS 866 -5078 2322 -5078 100 21
DS 2322 -5078 2480 -5078 100 21
DS 2480 -5078 2322 -7401 100 21
DS 2322 -7401 866 -7401 100 21
DS 866 -7401 708 -5078 100 21
DS 866 -7401 866 -7913 100 21
DS 866 -7913 2322 -7913 100 21
DS 2322 -7913 2322 -7401 100 21
DS -5196 1102 -1653 3070 100 21
DC 4549 0 4942 393 50 21
DS 3761 0 5336 0 50 21
DS 4549 787 4549 -787 50 21
DC -4549 0 -4942 393 50 21
DS -5336 0 -3761 0 50 21
DS -4549 787 -4549 -787 50 21
DA 4527 -1 3740 -1023 1863 100 21
DA -34 0 1653 3070 282 100 21
DA -4527 1 -3740 1023 1863 100 21
DA 34 0 -1653 -3070 282 100 21
DA 0 -21 2519 -2440 271 100 21
DA 4 0 0 3503 729 100 21
$PAD
Sh "2" C 436 436 0 0 0
Dr 236 0 0
At STD N 00A8FFFF
Ne 0 ""
Po -1500 5500
$EndPAD
$PAD
Sh "3" C 436 436 0 0 0
Dr 236 0 0
At STD N 00A8FFFF
Ne 0 ""
Po -500 5500
$EndPAD
$PAD
Sh "4" C 436 436 0 0 0
Dr 236 0 0
At STD N 00A8FFFF
Ne 0 ""
Po 500 5500
$EndPAD
$PAD
Sh "5" C 436 436 0 0 0
Dr 236 0 0
At STD N 00A8FFFF
Ne 0 ""
Po 1500 5500
$EndPAD
$PAD
Sh "1" C 436 436 0 0 0
Dr 236 0 0
At STD N 00A8FFFF
Ne 0 ""
Po -2500 5500
$EndPAD
$PAD
Sh "6" C 436 436 0 0 0
Dr 236 0 0
At STD N 00A8FFFF
Ne 0 ""
Po 2500 5500
$EndPAD
$SHAPE3D
Na "Sensors/MPX5700DP_h.wrl"
Sc 1.5 1.5 1.5
Of 0 0 0
Ro 0 0 0
$EndSHAPE3D
$EndMODULE MPX5700DP_h
$MODULE MPX5700D_h
Po 0 0 0 15 4FE1F2B2 00000000 ~~
Li MPX5700D_h
Cd 50 KPA PRESSURE SENSOR
Kw 50 KPA PRESSURE SENSOR
Sc 0
AR 
Op 0 0 0
At VIRTUAL
T0 -2750 0 393 393 900 78 N V 21 N "MPX5700D_h"
T1 2750 0 393 393 900 78 N I 21 N "Value"
DS -2300 4800 -2700 4800 50 21
DS -2700 4800 -2700 2700 50 21
DS -2700 2700 -2300 2700 50 21
DS -2300 4800 -2300 2700 50 21
DS -1300 4800 -1300 2700 50 21
DS -1700 2700 -1300 2700 50 21
DS -1700 4800 -1700 2700 50 21
DS -1300 4800 -1700 4800 50 21
DS 700 4800 700 2700 50 21
DS 300 2700 700 2700 50 21
DS 300 4800 300 2700 50 21
DS 700 4800 300 4800 50 21
DS -300 4800 -700 4800 50 21
DS -700 4800 -700 2700 50 21
DS -700 2700 -300 2700 50 21
DS -300 4800 -300 2700 50 21
DS 1700 4800 1700 2700 50 21
DS 1300 2700 1700 2700 50 21
DS 1300 4800 1300 2700 50 21
DS 1700 4800 1300 4800 50 21
DS 2700 4800 2300 4800 50 21
DS 2300 4800 2300 2700 50 21
DS 2300 2700 2700 2700 50 21
DS 2700 4800 2700 2700 50 21
DC 0 0 -1555 1555 50 21
DC 0 0 -1318 1318 50 21
DC 0 0 -1102 1102 50 21
$PAD
Sh "1" C 436 436 0 0 0
Dr 236 0 0
At STD N 00A88001
Ne 0 ""
Po -2500 5511
$EndPAD
$PAD
Sh "2" C 436 436 0 0 0
Dr 236 0 0
At STD N 00A8FFFF
Ne 0 ""
Po -1500 5511
$EndPAD
$PAD
Sh "3" C 436 436 0 0 0
Dr 236 0 0
At STD N 00A8FFFF
Ne 0 ""
Po -500 5511
$EndPAD
$PAD
Sh "4" C 436 436 0 0 0
Dr 236 0 0
At STD N 00A8FFFF
Ne 0 ""
Po 500 5511
$EndPAD
$PAD
Sh "5" C 436 436 0 0 0
Dr 236 0 0
At STD N 00A8FFFF
Ne 0 ""
Po 1500 5500
$EndPAD
$PAD
Sh "6" C 436 436 0 0 0
Dr 236 0 0
At STD N 00A8FFFF
Ne 0 ""
Po 2500 5500
$EndPAD
$SHAPE3D
Na "Sensors/MPX5700D_h.wrl"
Sc 1.5 1.5 1.5
Of 0 0 0
Ro 0 0 0
$EndSHAPE3D
$EndMODULE MPX5700D_h
$EndLIBRARY
