PCBNEW-LibModule-V1  sab 15 ago 2009 21:09:39 CEST
$INDEX
minidin-8
SCART
$EndINDEX
$MODULE SCART
Po 0 0 0 15 4A859AC5 00000000 ~~
Li SCART
Cd SCART socket, Tyco P/N 1483465-1
Sc 00000000
AR
Op 0 0 0
T0 0 2008 600 600 0 120 N V 21 N"SCART"
T1 0 -3900 600 600 0 120 N V 21 N"JP***"
DS -10000 -550 -10000 650 150 21
DS 10000 -550 10000 650 150 21
DS -9200 3350 9400 3350 150 21
DS -10650 -550 -10650 650 150 21
DS 10650 -550 10650 650 150 21
DS -9200 -550 -9200 -3350 150 21
DS -9200 -3350 9400 -3350 150 21
DS 9400 -3350 9400 -550 150 21
DS -10650 -550 10650 -550 150 21
DS 10650 650 -10650 650 150 21
DS -9200 3350 -9200 650 150 21
DS 9400 3350 9400 650 150 21
$PAD
Sh "1" C 787 787 0 0 0
Dr 472 0 0
At STD N 0000FFFF
Ne 0 ""
Po 7500 -2866
$EndPAD
$PAD
Sh "2" C 787 787 0 0 0
Dr 472 0 0
At STD N 0000FFFF
Ne 0 ""
Po 6750 -866
$EndPAD
$PAD
Sh "3" C 787 787 0 0 0
Dr 472 0 0
At STD N 0000FFFF
Ne 0 ""
Po 6000 -2866
$EndPAD
$PAD
Sh "4" C 787 787 0 0 0
Dr 472 0 0
At STD N 0000FFFF
Ne 0 ""
Po 5250 -866
$EndPAD
$PAD
Sh "5" C 787 787 0 0 0
Dr 472 0 0
At STD N 0000FFFF
Ne 0 ""
Po 4500 -2866
$EndPAD
$PAD
Sh "6" C 787 787 0 0 0
Dr 472 0 0
At STD N 0000FFFF
Ne 0 ""
Po 3750 -866
$EndPAD
$PAD
Sh "7" C 787 787 0 0 0
Dr 472 0 0
At STD N 0000FFFF
Ne 0 ""
Po 3000 -2866
$EndPAD
$PAD
Sh "8" C 787 787 0 0 0
Dr 472 0 0
At STD N 0000FFFF
Ne 0 ""
Po 2250 -866
$EndPAD
$PAD
Sh "9" C 787 787 0 0 0
Dr 472 0 0
At STD N 0000FFFF
Ne 0 ""
Po 1500 -2866
$EndPAD
$PAD
Sh "10" C 787 787 0 0 0
Dr 472 0 0
At STD N 0000FFFF
Ne 0 ""
Po 750 -866
$EndPAD
$PAD
Sh "11" C 787 787 0 0 0
Dr 472 0 0
At STD N 0000FFFF
Ne 0 ""
Po 0 -2866
$EndPAD
$PAD
Sh "12" C 787 787 0 0 0
Dr 472 0 0
At STD N 0000FFFF
Ne 0 ""
Po -750 -866
$EndPAD
$PAD
Sh "13" C 787 787 0 0 0
Dr 472 0 0
At STD N 0000FFFF
Ne 0 ""
Po -1500 -2866
$EndPAD
$PAD
Sh "14" C 787 787 0 0 0
Dr 472 0 0
At STD N 0000FFFF
Ne 0 ""
Po -2250 -866
$EndPAD
$PAD
Sh "15" C 787 787 0 0 0
Dr 472 0 0
At STD N 0000FFFF
Ne 0 ""
Po -3000 -2866
$EndPAD
$PAD
Sh "16" C 787 787 0 0 0
Dr 472 0 0
At STD N 0000FFFF
Ne 0 ""
Po -3750 -866
$EndPAD
$PAD
Sh "17" C 787 787 0 0 0
Dr 472 0 0
At STD N 0000FFFF
Ne 0 ""
Po -4500 -2866
$EndPAD
$PAD
Sh "18" C 787 787 0 0 0
Dr 472 0 0
At STD N 0000FFFF
Ne 0 ""
Po -5250 -866
$EndPAD
$PAD
Sh "19" C 787 787 0 0 0
Dr 472 0 0
At STD N 0000FFFF
Ne 0 ""
Po -6000 -2866
$EndPAD
$PAD
Sh "20" C 787 787 0 0 0
Dr 472 0 0
At STD N 0000FFFF
Ne 0 ""
Po -6750 -866
$EndPAD
$PAD
Sh "21" C 787 787 0 0 0
Dr 472 0 0
At STD N 0000FFFF
Ne 0 ""
Po -7500 -2866
$EndPAD
$PAD
Sh "22" R 1181 1575 0 0 0
Dr 1181 0 0 O 1181 1575
At STD N 0000FFFF
Ne 0 ""
Po 10433 -79
$EndPAD
$PAD
Sh "23" R 1181 1575 0 0 0
Dr 1181 0 0 O 1181 1575
At STD N 0000FFFF
Ne 0 ""
Po -10433 -79
$EndPAD
$SHAPE3D
Na "walter\conn_av\scart.wrl"
Sc 1.000000 1.000000 1.000000
Of 0.000000 0.000000 0.000000
Ro 0.000000 0.000000 0.000000
$EndSHAPE3D
$EndMODULE  SCART
$MODULE minidin-8
Po 0 0 0 15 4A8707DA 00000000 ~~
Li minidin-8
Cd MiniDin 8 (S-Video), Tyco P/N 1734096-1
Sc 00000000
AR 
Op 0 0 0
T0 0 3200 600 600 0 120 N V 21 N"minidin-8"
T1 0 -2900 600 600 0 120 N V 21 N"JP***"
DS -1550 2300 -1550 2500 150 21
DS 1550 2300 1550 2500 150 21
DS -1550 2300 1550 2300 150 21
DS -1550 2400 1550 2400 150 21
DS 1550 2500 -1550 2500 150 21
DS 2800 2550 2800 -2550 150 21
DS 2800 -2550 -2800 -2550 150 21
DS -2800 -2550 -2800 2550 150 21
DS -2800 2550 2800 2550 150 21
$PAD
Sh "9" C 1378 1378 0 0 0
Dr 866 0 0
At STD N 0000FFFF
Ne 0 ""
Po -2657 394
$EndPAD
$PAD
Sh "11" C 1378 1378 0 0 0
Dr 866 0 0
At STD N 0000FFFF
Ne 0 ""
Po 2657 394
$EndPAD
$PAD
Sh "6" C 591 591 0 0 0
Dr 354 0 0
At STD N 0000FFFF
Ne 0 ""
Po -1142 -787
$EndPAD
$PAD
Sh "7" C 591 591 0 0 0
Dr 354 0 0
At STD N 0000FFFF
Ne 0 ""
Po -354 -787
$EndPAD
$PAD
Sh "8" C 591 591 0 0 0
Dr 354 0 0
At STD N 0000FFFF
Ne 0 ""
Po 1142 -787
$EndPAD
$PAD
Sh "1" C 591 591 0 0 0
Dr 354 0 0
At STD N 0000FFFF
Ne 0 ""
Po -39 -1772
$EndPAD
$PAD
Sh "2" C 591 591 0 0 0
Dr 354 0 0
At STD N 0000FFFF
Ne 0 ""
Po 748 -1772
$EndPAD
$PAD
Sh "3" C 591 591 0 0 0
Dr 354 0 0
At STD N 0000FFFF
Ne 0 ""
Po -1535 -1772
$EndPAD
$PAD
Sh "4" C 591 591 0 0 0
Dr 354 0 0
At STD N 0000FFFF
Ne 0 ""
Po -709 -1772
$EndPAD
$PAD
Sh "5" C 591 591 0 0 0
Dr 354 0 0
At STD N 0000FFFF
Ne 0 ""
Po 1535 -1772
$EndPAD
$PAD
Sh "10" C 1378 1378 0 0 0
Dr 866 0 0
At STD N 0000FFFF
Ne 0 ""
Po 0 709
$EndPAD
$SHAPE3D
Na "walter\conn_av\minidin-8.wrl"
Sc 1.000000 1.000000 1.000000
Of 0.000000 0.000000 0.000000
Ro 0.000000 0.000000 0.000000
$EndSHAPE3D
$EndMODULE  minidin-8
$EndLIBRARY
