PCBNEW-LibModule-V1  Čt 7. červen 2012, 18:46:35 CEST
# encoding utf-8
Units deci-mils
$INDEX
BNC-pan
bnc-pcb
$EndINDEX
$MODULE BNC-pan
Po 0 0 0 15 4FD0D8BE 00000000 ~~
Li BNC-pan
Sc 0
AR 
Op 0 0 0
T0 0 -3000 393 393 0 78 N V 21 N "BNC-pan"
T1 0 3900 393 393 0 78 N V 21 N "Value"
DC 0 0 0 2500 50 21
DS -3000 3000 3000 3000 50 21
DC 0 0 -1000 1000 150 21
DC 0 0 -500 1000 150 21
$PAD
Sh "1" C 4000 4000 0 0 0
Dr 340 0 0
At STD N 00E0FFFF
Ne 0 ""
Po 0 0
$EndPAD
$PAD
Sh "2" C 2000 2000 0 0 0
Dr 340 0 0
At STD N 00E0FFFF
Ne 0 ""
Po 0 2250
$EndPAD
$EndMODULE BNC-pan
$MODULE bnc-pcb
Po 0 0 0 15 4FD0DAD5 00000000 ~~
Li bnc-pcb
Sc 0
AR 
Op 0 0 0
T0 0 -2700 393 393 0 78 N V 21 N "bnc-pcb"
T1 0 1200 393 393 0 78 N I 21 N "Value"
DS -1750 750 1750 750 100 21
DS 1750 750 1750 -1500 100 21
DS 1750 -1500 1000 -2250 100 21
DS 1000 -2250 -750 -2250 100 21
DS -750 -2250 -1000 -2250 100 21
DS -1000 -2250 -1750 -1500 100 21
DS -1750 -1500 -1750 750 100 21
$PAD
Sh "1" C 930 930 0 0 0
Dr 320 0 0
At STD N 00E0FFFF
Ne 0 ""
Po 0 -1500
$EndPAD
$PAD
Sh "2" R 930 930 0 0 0
Dr 320 0 0
At STD N 00E0FFFF
Ne 0 ""
Po -1000 0
$EndPAD
$PAD
Sh "3" R 930 930 0 0 0
Dr 320 0 0
At STD N 00E0FFFF
Ne 0 ""
Po 1000 0
$EndPAD
$EndMODULE bnc-pcb
$EndLIBRARY
