PCBNEW-LibModule-V1  Po 11. červen 2012, 21:52:50 CEST
# encoding utf-8
Units deci-mils
$INDEX
LCD-16x2B
LCD-8x1B
LCD_16x2
LCD_16x2_2
LCD_16x2_3
LCD_16x2_4
LCD_16x4
LCD_8x1B
$EndINDEX
$MODULE LCD-16x2B
Po 0 0 0 15 4FD647F8 00000000 ~~
Li LCD-16x2B
Cd Convertido por ToKicad
Kw ToKicad
Sc 0
AR 
Op 0 0 0
T0 0 -8500 393 393 0 78 N V 21 N "LCD-16x2B"
T1 0 0 392 392 0 77 N I 21 N "Value"
DS 16250 -6000 16500 -6000 50 21
DS 16250 -7000 16500 -7000 50 21
DS 16250 -7000 14750 -7000 50 21
DS 14750 -7000 14750 -6000 50 21
DS 14750 -6000 16250 -6000 50 21
DS -16500 -7000 -14750 -7000 50 21
DS -14750 -7000 -14750 -6000 50 21
DS -14750 -6000 -16500 -6000 50 21
DS 3000 7750 3000 8750 50 21
DS 3000 8750 -13000 8750 50 21
DS -13000 8750 -13000 7750 50 21
DS -13000 7750 3000 7750 50 21
DS -12000 -3000 12000 -3000 250 21
DS 12000 -3000 12000 3500 250 21
DS 12000 3500 -12000 3500 250 21
DS -12000 3500 -12000 -3000 250 21
DS -14500 -4750 14500 -4750 250 21
DS 14500 -4750 14500 5250 250 21
DS 14500 5250 -14500 5250 250 21
DS -14500 5250 -14500 -4750 250 21
DS -16500 -8000 16500 -8000 150 21
DS 16500 -8000 16500 9250 150 21
DS 16500 9250 -16500 9250 150 21
DS -16500 9250 -16500 -8000 150 21
$PAD
Sh "0" C 2165 2165 0 0 0
Dr 984 0 0
At STD N 00F0FFFF
Ne 0 ""
Po -15750 -6500
$EndPAD
$PAD
Sh "0" C 2165 2165 0 0 0
Dr 984 0 0
At STD N 00F0FFFF
Ne 0 ""
Po 15750 -6500
$EndPAD
$PAD
Sh "0" C 1811 1811 0 0 0
Dr 984 0 0
At STD N 00F0FFFF
Ne 0 ""
Po 15000 7750
$EndPAD
$PAD
Sh "0" C 1811 1811 0 0 0
Dr 984 0 0
At STD N 00F0FFFF
Ne 0 ""
Po -15000 7750
$EndPAD
$PAD
Sh "1" R 620 620 0 0 0
Dr 393 0 0
At STD N 00F0FFFF
Ne 0 ""
Po 2500 8250
$EndPAD
$PAD
Sh "2" C 620 620 0 0 0
Dr 393 0 0
At STD N 00F0FFFF
Ne 0 ""
Po 1500 8250
$EndPAD
$PAD
Sh "3" C 620 620 0 0 0
Dr 393 0 0
At STD N 00F0FFFF
Ne 0 ""
Po 500 8250
$EndPAD
$PAD
Sh "4" C 620 620 0 0 0
Dr 393 0 0
At STD N 00F0FFFF
Ne 0 ""
Po -500 8250
$EndPAD
$PAD
Sh "5" C 620 620 0 0 0
Dr 393 0 0
At STD N 00F0FFFF
Ne 0 ""
Po -1500 8250
$EndPAD
$PAD
Sh "6" C 620 620 0 0 0
Dr 393 0 0
At STD N 00F0FFFF
Ne 0 ""
Po -2500 8250
$EndPAD
$PAD
Sh "7" C 620 620 0 0 0
Dr 393 0 0
At STD N 00F0FFFF
Ne 0 ""
Po -3500 8250
$EndPAD
$PAD
Sh "8" C 620 620 0 0 0
Dr 393 0 0
At STD N 00F0FFFF
Ne 0 ""
Po -4500 8250
$EndPAD
$PAD
Sh "9" C 620 620 0 0 0
Dr 393 0 0
At STD N 00F0FFFF
Ne 0 ""
Po -5500 8250
$EndPAD
$PAD
Sh "10" C 620 620 0 0 0
Dr 393 0 0
At STD N 00F0FFFF
Ne 0 ""
Po -6500 8250
$EndPAD
$PAD
Sh "11" C 620 620 0 0 0
Dr 393 0 0
At STD N 00F0FFFF
Ne 0 ""
Po -7500 8250
$EndPAD
$PAD
Sh "12" C 620 620 0 0 0
Dr 393 0 0
At STD N 00F0FFFF
Ne 0 ""
Po -8500 8250
$EndPAD
$PAD
Sh "13" C 620 620 0 0 0
Dr 393 0 0
At STD N 00F0FFFF
Ne 0 ""
Po -9500 8250
$EndPAD
$PAD
Sh "14" C 620 620 0 0 0
Dr 393 0 0
At STD N 00F0FFFF
Ne 0 ""
Po -10500 8250
$EndPAD
$PAD
Sh "15" C 620 620 0 0 0
Dr 393 0 0
At STD N 00F0FFFF
Ne 0 ""
Po -11500 8250
$EndPAD
$PAD
Sh "16" C 620 620 0 0 0
Dr 393 0 0
At STD N 00F0FFFF
Ne 0 ""
Po -12500 8250
$EndPAD
$SHAPE3D
Na "LCD/lcd_16x2_h1_blue.wrl"
Sc 2 2 2
Of 0 0 0
Ro 0 0 0
$EndSHAPE3D
$EndMODULE LCD-16x2B
$MODULE LCD-8x1B
Po 0 0 0 15 4FD64673 00000000 ~~
Li LCD-8x1B
Cd Convertido por ToKicad
Kw ToKicad
Sc 0
AR 
Op 0 0 0
T0 0 -8500 393 393 0 78 N V 21 N "LCD-8x1B"
T1 0 0 392 392 0 77 N I 21 N "Value"
DS 16250 -6000 16500 -6000 50 21
DS 16250 -7000 16500 -7000 50 21
DS 16250 -7000 14750 -7000 50 21
DS 14750 -7000 14750 -6000 50 21
DS 14750 -6000 16250 -6000 50 21
DS -16500 -7000 -14750 -7000 50 21
DS -14750 -7000 -14750 -6000 50 21
DS -14750 -6000 -16500 -6000 50 21
DS 3000 7750 3000 8750 50 21
DS 3000 8750 -13000 8750 50 21
DS -13000 8750 -13000 7750 50 21
DS -13000 7750 3000 7750 50 21
DS -12000 -3000 12000 -3000 250 21
DS 12000 -3000 12000 3500 250 21
DS 12000 3500 -12000 3500 250 21
DS -12000 3500 -12000 -3000 250 21
DS -14500 -4750 14500 -4750 250 21
DS 14500 -4750 14500 5250 250 21
DS 14500 5250 -14500 5250 250 21
DS -14500 5250 -14500 -4750 250 21
DS -16500 -8000 16500 -8000 150 21
DS 16500 -8000 16500 9250 150 21
DS 16500 9250 -16500 9250 150 21
DS -16500 9250 -16500 -8000 150 21
$PAD
Sh "0" C 2165 2165 0 0 0
Dr 984 0 0
At STD N 00F0FFFF
Ne 0 ""
Po -15750 -6500
$EndPAD
$PAD
Sh "0" C 2165 2165 0 0 0
Dr 984 0 0
At STD N 00F0FFFF
Ne 0 ""
Po 15750 -6500
$EndPAD
$PAD
Sh "0" C 1811 1811 0 0 0
Dr 984 0 0
At STD N 00F0FFFF
Ne 0 ""
Po 15000 7750
$EndPAD
$PAD
Sh "0" C 1811 1811 0 0 0
Dr 984 0 0
At STD N 00F0FFFF
Ne 0 ""
Po -15000 7750
$EndPAD
$PAD
Sh "1" R 620 620 0 0 0
Dr 393 0 0
At STD N 00F0FFFF
Ne 0 ""
Po 2500 8250
$EndPAD
$PAD
Sh "2" C 620 620 0 0 0
Dr 393 0 0
At STD N 00F0FFFF
Ne 0 ""
Po 1500 8250
$EndPAD
$PAD
Sh "3" C 620 620 0 0 0
Dr 393 0 0
At STD N 00F0FFFF
Ne 0 ""
Po 500 8250
$EndPAD
$PAD
Sh "4" C 620 620 0 0 0
Dr 393 0 0
At STD N 00F0FFFF
Ne 0 ""
Po -500 8250
$EndPAD
$PAD
Sh "5" C 620 620 0 0 0
Dr 393 0 0
At STD N 00F0FFFF
Ne 0 ""
Po -1500 8250
$EndPAD
$PAD
Sh "6" C 620 620 0 0 0
Dr 393 0 0
At STD N 00F0FFFF
Ne 0 ""
Po -2500 8250
$EndPAD
$PAD
Sh "7" C 620 620 0 0 0
Dr 393 0 0
At STD N 00F0FFFF
Ne 0 ""
Po -3500 8250
$EndPAD
$PAD
Sh "8" C 620 620 0 0 0
Dr 393 0 0
At STD N 00F0FFFF
Ne 0 ""
Po -4500 8250
$EndPAD
$PAD
Sh "9" C 620 620 0 0 0
Dr 393 0 0
At STD N 00F0FFFF
Ne 0 ""
Po -5500 8250
$EndPAD
$PAD
Sh "10" C 620 620 0 0 0
Dr 393 0 0
At STD N 00F0FFFF
Ne 0 ""
Po -6500 8250
$EndPAD
$PAD
Sh "11" C 620 620 0 0 0
Dr 393 0 0
At STD N 00F0FFFF
Ne 0 ""
Po -7500 8250
$EndPAD
$PAD
Sh "12" C 620 620 0 0 0
Dr 393 0 0
At STD N 00F0FFFF
Ne 0 ""
Po -8500 8250
$EndPAD
$PAD
Sh "13" C 620 620 0 0 0
Dr 393 0 0
At STD N 00F0FFFF
Ne 0 ""
Po -9500 8250
$EndPAD
$PAD
Sh "14" C 620 620 0 0 0
Dr 393 0 0
At STD N 00F0FFFF
Ne 0 ""
Po -10500 8250
$EndPAD
$PAD
Sh "15" C 620 620 0 0 0
Dr 393 0 0
At STD N 00F0FFFF
Ne 0 ""
Po -11500 8250
$EndPAD
$PAD
Sh "16" C 620 620 0 0 0
Dr 393 0 0
At STD N 00F0FFFF
Ne 0 ""
Po -12500 8250
$EndPAD
$SHAPE3D
Na "LCD/lcd_16x2_h1_blue.wrl"
Sc 2 2 2
Of 0 0 0
Ro 0 0 0
$EndSHAPE3D
$EndMODULE LCD-8x1B
$MODULE LCD_16x2
Po 0 0 0 15 4FD64A7E 00000000 ~~
Li LCD_16x2
Cd Convertido por ToKicad
Kw ToKicad
Sc 0
AR 
Op 0 0 0
T0 0 -9000 393 393 0 78 N V 21 N "LCD_16x2"
T1 0 0 393 393 0 78 N I 21 N "Value"
DS -13880 -6250 14000 -6250 100 21
DS -13880 6130 -13880 -6250 100 21
DS 14000 6130 14000 -6250 100 21
DS -13880 6130 14000 6130 100 21
DS -16500 9250 -16500 -8120 100 21
DS -16500 -8120 16620 -8120 100 21
DS -16500 9250 16620 9250 100 21
DS 16620 9250 16620 -8120 100 21
DS -12000 3500 -12000 -3500 100 21
DS -12000 -3500 12000 -3500 100 21
DS -12000 3500 12000 3500 100 21
DS 12000 3500 12000 -3500 100 21
$PAD
Sh "1" R 591 800 0 0 0
Dr 400 0 0
At STD N 00E0FFFF
Ne 0 ""
Po 2500 8250
$EndPAD
$PAD
Sh "2" R 591 800 0 0 0
Dr 400 0 0
At STD N 00E0FFFF
Ne 0 ""
Po 1500 8250
$EndPAD
$PAD
Sh "" C 1969 1969 0 0 0
Dr 1000 0 0
At STD N 00E0FFFF
Ne 0 ""
Po -14880 7630
$EndPAD
$PAD
Sh "" C 1969 1969 0 0 0
Dr 1000 0 0
At STD N 00E0FFFF
Ne 0 ""
Po 15000 7630
$EndPAD
$PAD
Sh "16" R 591 787 0 0 0
Dr 400 0 0
At STD N 00E0FFFF
Ne 0 ""
Po -12500 8250
$EndPAD
$PAD
Sh "" C 1969 1969 0 0 0
Dr 1000 0 0
At STD N 00E0FFFF
Ne 0 ""
Po 15870 -6370
$EndPAD
$PAD
Sh "" C 1969 1969 0 0 0
Dr 1000 0 0
At STD N 00E0FFFF
Ne 0 ""
Po -15750 -6370
$EndPAD
$PAD
Sh "15" R 591 787 0 0 0
Dr 400 0 0
At STD N 00E0FFFF
Ne 0 ""
Po -11500 8250
$EndPAD
$PAD
Sh "14" R 591 800 0 0 0
Dr 400 0 0
At STD N 00E0FFFF
Ne 0 ""
Po -10500 8250
$EndPAD
$PAD
Sh "13" R 591 800 0 0 0
Dr 400 0 0
At STD N 00E0FFFF
Ne 0 ""
Po -9500 8250
$EndPAD
$PAD
Sh "12" R 591 800 0 0 0
Dr 400 0 0
At STD N 00E0FFFF
Ne 0 ""
Po -8500 8250
$EndPAD
$PAD
Sh "11" R 591 800 0 0 0
Dr 400 0 0
At STD N 00E0FFFF
Ne 0 ""
Po -7500 8250
$EndPAD
$PAD
Sh "10" R 591 800 0 0 0
Dr 400 0 0
At STD N 00E0FFFF
Ne 0 ""
Po -6500 8250
$EndPAD
$PAD
Sh "9" R 591 800 0 0 0
Dr 400 0 0
At STD N 00E0FFFF
Ne 0 ""
Po -5500 8250
$EndPAD
$PAD
Sh "8" R 591 800 0 0 0
Dr 400 0 0
At STD N 00E0FFFF
Ne 0 ""
Po -4500 8250
$EndPAD
$PAD
Sh "7" R 591 800 0 0 0
Dr 400 0 0
At STD N 00E0FFFF
Ne 0 ""
Po -3500 8250
$EndPAD
$PAD
Sh "6" R 591 800 0 0 0
Dr 400 0 0
At STD N 00E0FFFF
Ne 0 ""
Po -2500 8250
$EndPAD
$PAD
Sh "5" R 591 800 0 0 0
Dr 400 0 0
At STD N 00E0FFFF
Ne 0 ""
Po -1500 8250
$EndPAD
$PAD
Sh "4" R 591 800 0 0 0
Dr 400 0 0
At STD N 00E0FFFF
Ne 0 ""
Po -500 8250
$EndPAD
$PAD
Sh "3" R 591 800 0 0 0
Dr 400 0 0
At STD N 00E0FFFF
Ne 0 ""
Po 500 8250
$EndPAD
$SHAPE3D
Na "LCD/lcd_16x2_h1_blue.wrl"
Sc 2 2 2
Of 0 0 0
Ro 0 0 0
$EndSHAPE3D
$EndMODULE LCD_16x2
$MODULE LCD_16x2_2
Po 0 0 0 15 4FD64944 00000000 ~~
Li LCD_16x2_2
Cd Convertido por ToKicad
Kw ToKicad
Sc 0
AR 
Op 0 0 0
T0 0 -8000 393 393 0 78 N V 21 N "LCD_16_x_2_2"
T1 0 0 393 393 0 78 N I 21 N "LCD_16_x_2_2"
DS -11300 4100 -11300 -3450 150 21
DS -11300 -3450 12450 -3500 150 21
DS 12450 -3500 12450 4050 150 21
DS 12450 4050 -11250 4100 150 21
DS 13550 5200 -12500 5200 150 21
DS -12500 5200 -12500 5050 150 21
DS -12500 4950 -12500 -4550 150 21
DS -12500 -4550 13550 -4550 150 21
DS 13550 -4550 13550 5200 150 21
DS -15500 6800 16000 6850 150 21
DS 16000 6850 16000 -7000 150 21
DS 16000 -7000 -15450 -6950 150 21
DS -15450 -6950 -15450 6900 150 21
$PAD
Sh "16" C 590 590 0 0 0
Dr 393 0 0
At STD N 00E0FFFF
Ne 0 ""
Po 2500 -5950
$EndPAD
$PAD
Sh "15" C 590 590 0 0 0
Dr 393 0 0
At STD N 00E0FFFF
Ne 0 ""
Po 1500 -5950
$EndPAD
$PAD
Sh "" C 1811 1811 0 0 0
Dr 984 0 0
At STD N 00E0FFFF
Ne 0 ""
Po -14450 5900
$EndPAD
$PAD
Sh "" C 1811 1811 0 0 0
Dr 984 0 0
At STD N 00E0FFFF
Ne 0 ""
Po 15000 5900
$EndPAD
$PAD
Sh "1" R 590 787 0 0 0
Dr 392 0 0
At STD N 00E0FFFF
Ne 0 ""
Po -12500 -5950
$EndPAD
$PAD
Sh "" C 2165 2165 0 0 0
Dr 984 0 0
At STD N 00E0FFFF
Ne 0 ""
Po 15150 -6050
$EndPAD
$PAD
Sh "" C 2165 2165 0 0 0
Dr 984 0 0
At STD N 00E0FFFF
Ne 0 ""
Po -14600 -6000
$EndPAD
$PAD
Sh "2" C 590 590 0 0 0
Dr 393 0 0
At STD N 00E0FFFF
Ne 0 ""
Po -11500 -5950
$EndPAD
$PAD
Sh "3" C 590 590 0 0 0
Dr 393 0 0
At STD N 00E0FFFF
Ne 0 ""
Po -10500 -5950
$EndPAD
$PAD
Sh "4" C 590 590 0 0 0
Dr 393 0 0
At STD N 00E0FFFF
Ne 0 ""
Po -9500 -5950
$EndPAD
$PAD
Sh "5" C 590 590 0 0 0
Dr 393 0 0
At STD N 00E0FFFF
Ne 0 ""
Po -8500 -5950
$EndPAD
$PAD
Sh "6" C 590 590 0 0 0
Dr 393 0 0
At STD N 00E0FFFF
Ne 0 ""
Po -7500 -5950
$EndPAD
$PAD
Sh "7" C 590 590 0 0 0
Dr 393 0 0
At STD N 00E0FFFF
Ne 0 ""
Po -6500 -5950
$EndPAD
$PAD
Sh "8" C 590 590 0 0 0
Dr 393 0 0
At STD N 00E0FFFF
Ne 0 ""
Po -5500 -5950
$EndPAD
$PAD
Sh "9" C 590 590 0 0 0
Dr 393 0 0
At STD N 00E0FFFF
Ne 0 ""
Po -4500 -5950
$EndPAD
$PAD
Sh "10" C 590 590 0 0 0
Dr 393 0 0
At STD N 00E0FFFF
Ne 0 ""
Po -3500 -5950
$EndPAD
$PAD
Sh "11" C 590 590 0 0 0
Dr 393 0 0
At STD N 00E0FFFF
Ne 0 ""
Po -2500 -5950
$EndPAD
$PAD
Sh "12" C 590 590 0 0 0
Dr 393 0 0
At STD N 00E0FFFF
Ne 0 ""
Po -1500 -5950
$EndPAD
$PAD
Sh "13" C 590 590 0 0 0
Dr 393 0 0
At STD N 00E0FFFF
Ne 0 ""
Po -500 -5950
$EndPAD
$PAD
Sh "14" C 590 590 0 0 0
Dr 393 0 0
At STD N 00E0FFFF
Ne 0 ""
Po 500 -5950
$EndPAD
$SHAPE3D
Na "LCD/lcd_16x2_h2_blue.wrl"
Sc 2 2 2
Of 0 0 0
Ro 0 0 0
$EndSHAPE3D
$EndMODULE LCD_16x2_2
$MODULE LCD_16x2_3
Po 0 0 0 15 4FD64B27 00000000 ~~
Li LCD_16x2_3
Cd Convertido por ToKicad
Kw ToKicad
Sc 0
AR 
Op 0 0 0
T0 0 -7500 393 393 0 78 N V 21 N "LCD_16x2_3"
T1 0 0 392 392 0 77 N I 21 N "Value"
DS -11900 4225 -11900 -4025 150 21
DS -11900 -4025 11650 -4025 150 21
DS 11650 -4025 11650 4100 150 21
DS 11650 4100 -11900 4025 150 21
DS -13250 5450 -13250 -5375 150 21
DS -13250 -5375 13125 -5450 150 21
DS 13125 -5450 13125 5450 150 21
DS 13125 5450 -13250 5500 150 21
DS 15575 -6900 15575 6775 150 21
DS 15575 6775 -16050 6775 150 21
DS -16050 6775 -16050 -6975 150 21
DS -15900 -6900 15500 -6950 150 21
$PAD
Sh "16" C 591 591 0 0 0
Dr 400 0 0
At STD N 00E0FFFF
Ne 0 ""
Po -15225 -3500
$EndPAD
$PAD
Sh "15" C 591 591 0 0 0
Dr 400 0 0
At STD N 00E0FFFF
Ne 0 ""
Po -14225 -3500
$EndPAD
$PAD
Sh "" C 1969 1969 0 0 0
Dr 1000 0 0
At STD N 00E0FFFF
Ne 0 ""
Po -14975 5750
$EndPAD
$PAD
Sh "" C 1969 1969 0 0 0
Dr 1000 0 0
At STD N 00E0FFFF
Ne 0 ""
Po 14600 5750
$EndPAD
$PAD
Sh "1" R 590 590 0 0 0
Dr 400 0 0
At STD N 00E0FFFF
Ne 0 ""
Po -14225 3450
$EndPAD
$PAD
Sh "" C 1969 1969 0 0 0
Dr 1000 0 0
At STD N 00E0FFFF
Ne 0 ""
Po 14675 -5900
$EndPAD
$PAD
Sh "" C 1969 1969 0 0 0
Dr 1000 0 0
At STD N 00E0FFFF
Ne 0 ""
Po -15025 -5900
$EndPAD
$PAD
Sh "2" C 591 591 0 0 0
Dr 400 0 0
At STD N 00E0FFFF
Ne 0 ""
Po -15225 3450
$EndPAD
$PAD
Sh "3" C 591 591 0 0 0
Dr 400 0 0
At STD N 00E0FFFF
Ne 0 ""
Po -14225 2475
$EndPAD
$PAD
Sh "4" C 591 591 0 0 0
Dr 400 0 0
At STD N 00E0FFFF
Ne 0 ""
Po -15225 2500
$EndPAD
$PAD
Sh "5" C 591 591 0 0 0
Dr 400 0 0
At STD N 00E0FFFF
Ne 0 ""
Po -14225 1475
$EndPAD
$PAD
Sh "6" C 591 591 0 0 0
Dr 400 0 0
At STD N 00E0FFFF
Ne 0 ""
Po -15225 1475
$EndPAD
$PAD
Sh "7" C 591 591 0 0 0
Dr 400 0 0
At STD N 00E0FFFF
Ne 0 ""
Po -14225 450
$EndPAD
$PAD
Sh "8" C 591 591 0 0 0
Dr 400 0 0
At STD N 00E0FFFF
Ne 0 ""
Po -15225 475
$EndPAD
$PAD
Sh "9" C 591 591 0 0 0
Dr 400 0 0
At STD N 00E0FFFF
Ne 0 ""
Po -14225 -500
$EndPAD
$PAD
Sh "10" C 591 591 0 0 0
Dr 400 0 0
At STD N 00E0FFFF
Ne 0 ""
Po -15225 -475
$EndPAD
$PAD
Sh "11" C 591 591 0 0 0
Dr 400 0 0
At STD N 00E0FFFF
Ne 0 ""
Po -14225 -1475
$EndPAD
$PAD
Sh "12" C 591 591 0 0 0
Dr 400 0 0
At STD N 00E0FFFF
Ne 0 ""
Po -15225 -1475
$EndPAD
$PAD
Sh "13" C 591 591 0 0 0
Dr 400 0 0
At STD N 00E0FFFF
Ne 0 ""
Po -14225 -2475
$EndPAD
$PAD
Sh "14" C 591 591 0 0 0
Dr 400 0 0
At STD N 00E0FFFF
Ne 0 ""
Po -15225 -2475
$EndPAD
$SHAPE3D
Na "novos2/lcd_16x2_3_cinza.wrl"
Sc 2 2 2
Of 0 0 0
Ro 0 0 0
$EndSHAPE3D
$EndMODULE LCD_16x2_3
$MODULE LCD_16x2_4
Po 0 0 0 15 4FD64B7C 00000000 ~~
Li LCD_16x2_4
Cd Convertido por ToKicad
Kw ToKicad
Sc 0
AR 
Op 0 0 0
T0 0 -8000 500 500 0 10 N V 21 N "LCD_16x2_4"
T1 0 0 393 393 0 78 N I 21 N "Value"
DS -14600 4025 -14600 -4150 150 21
DS -14600 -4150 15750 -4150 150 21
DS 15750 -4150 15750 3975 150 21
DS 15750 3975 -14600 3975 150 21
DS -15800 -5950 17025 -5950 150 21
DS 17025 -5950 17025 5950 150 21
DS 17025 5950 -15800 6025 150 21
DS -15800 6025 -15800 -5950 150 21
DS -22400 0 -22400 -7300 150 21
DS -22400 -7300 23300 -7225 150 21
DS 23300 -7225 23300 7300 150 21
DS 23300 7300 -22450 7225 150 21
DS -22450 7225 -22450 -75 150 21
$PAD
Sh "16" C 591 591 0 0 0
Dr 400 0 0
At STD N 00E0FFFF
Ne 0 ""
Po -20725 -3500
$EndPAD
$PAD
Sh "15" C 591 591 0 0 0
Dr 400 0 0
At STD N 00E0FFFF
Ne 0 ""
Po -19725 -3500
$EndPAD
$PAD
Sh "" C 1969 1969 0 0 0
Dr 1000 0 0
At STD N 00E0FFFF
Ne 0 ""
Po -20475 5750
$EndPAD
$PAD
Sh "" C 1969 1969 0 0 0
Dr 1000 0 0
At STD N 00E0FFFF
Ne 0 ""
Po 21825 5700
$EndPAD
$PAD
Sh "1" R 590 590 0 0 0
Dr 400 0 0
At STD N 00E0FFFF
Ne 0 ""
Po -19725 3450
$EndPAD
$PAD
Sh "" C 1969 1969 0 0 0
Dr 1000 0 0
At STD N 00E0FFFF
Ne 0 ""
Po 21825 -5750
$EndPAD
$PAD
Sh "" C 1969 1969 0 0 0
Dr 1000 0 0
At STD N 00E0FFFF
Ne 0 ""
Po -20475 -5750
$EndPAD
$PAD
Sh "2" C 591 591 0 0 0
Dr 400 0 0
At STD N 00E0FFFF
Ne 0 ""
Po -20725 3450
$EndPAD
$PAD
Sh "3" C 591 591 0 0 0
Dr 400 0 0
At STD N 00E0FFFF
Ne 0 ""
Po -19725 2475
$EndPAD
$PAD
Sh "4" C 591 591 0 0 0
Dr 400 0 0
At STD N 00E0FFFF
Ne 0 ""
Po -20725 2500
$EndPAD
$PAD
Sh "5" C 591 591 0 0 0
Dr 400 0 0
At STD N 00E0FFFF
Ne 0 ""
Po -19725 1475
$EndPAD
$PAD
Sh "6" C 591 591 0 0 0
Dr 400 0 0
At STD N 00E0FFFF
Ne 0 ""
Po -20725 1475
$EndPAD
$PAD
Sh "7" C 591 591 0 0 0
Dr 400 0 0
At STD N 00E0FFFF
Ne 0 ""
Po -19725 450
$EndPAD
$PAD
Sh "8" C 591 591 0 0 0
Dr 400 0 0
At STD N 00E0FFFF
Ne 0 ""
Po -20725 475
$EndPAD
$PAD
Sh "9" C 591 591 0 0 0
Dr 400 0 0
At STD N 00E0FFFF
Ne 0 ""
Po -19725 -500
$EndPAD
$PAD
Sh "10" C 591 591 0 0 0
Dr 400 0 0
At STD N 00E0FFFF
Ne 0 ""
Po -20725 -475
$EndPAD
$PAD
Sh "11" C 591 591 0 0 0
Dr 400 0 0
At STD N 00E0FFFF
Ne 0 ""
Po -19725 -1475
$EndPAD
$PAD
Sh "12" C 591 591 0 0 0
Dr 400 0 0
At STD N 00E0FFFF
Ne 0 ""
Po -20725 -1475
$EndPAD
$PAD
Sh "13" C 591 591 0 0 0
Dr 400 0 0
At STD N 00E0FFFF
Ne 0 ""
Po -19725 -2475
$EndPAD
$PAD
Sh "14" C 591 591 0 0 0
Dr 400 0 0
At STD N 00E0FFFF
Ne 0 ""
Po -20725 -2475
$EndPAD
$SHAPE3D
Na "LCD/lcd_16x2_gray.wrl"
Sc 2 2 2
Of 0 0 0
Ro 0 0 0
$EndSHAPE3D
$EndMODULE LCD_16x2_4
$MODULE LCD_16x4
Po 0 0 0 15 4FD64C5B 00000000 ~~
Li LCD_16x4
Cd Convertido por ToKicad
Kw ToKicad
Sc 0
AR 
Op 0 0 0
T0 0 -13500 393 393 0 78 N V 21 N "LCD_16_x_4"
T1 0 0 393 393 0 78 N I 21 N "Value"
DS -15050 5650 -15050 -7050 150 21
DS -15050 -7050 15150 -7100 150 21
DS 15150 -7100 15150 5550 150 21
DS 15150 5550 -15050 5500 150 21
DS -17750 -9000 18050 -9100 150 21
DS 18050 -9100 18050 7600 150 21
DS 18050 7600 -17800 7600 150 21
DS -17800 7600 -17800 -9100 150 21
DS 19450 -12800 19450 11800 150 21
DS 19450 11800 -18850 11900 150 21
DS -18850 11900 -18850 -12900 150 21
DS -18750 -12900 19500 -12800 150 21
$PAD
Sh "16" C 590 590 0 0 0
Dr 400 0 0
At STD N 00E0FFFF
Ne 0 ""
Po 250 -11950
$EndPAD
$PAD
Sh "15" C 590 590 0 0 0
Dr 400 0 0
At STD N 00E0FFFF
Ne 0 ""
Po -750 -11950
$EndPAD
$PAD
Sh "" C 1969 1969 0 0 0
Dr 1000 0 0
At STD N 00E0FFFF
Ne 0 ""
Po -17550 10600
$EndPAD
$PAD
Sh "" C 1969 1969 0 0 0
Dr 1000 0 0
At STD N 00E0FFFF
Ne 0 ""
Po 18350 10650
$EndPAD
$PAD
Sh "1" R 591 787 0 0 0
Dr 400 0 0
At STD N 00E0FFFF
Ne 0 ""
Po -14750 -11950
$EndPAD
$PAD
Sh "" C 1969 1969 0 0 0
Dr 1000 0 0
At STD N 00E0FFFF
Ne 0 ""
Po 18300 -11600
$EndPAD
$PAD
Sh "" C 1969 1969 0 0 0
Dr 1000 0 0
At STD N 00E0FFFF
Ne 0 ""
Po -17800 -11700
$EndPAD
$PAD
Sh "2" C 590 590 0 0 0
Dr 400 0 0
At STD N 00E0FFFF
Ne 0 ""
Po -13750 -11950
$EndPAD
$PAD
Sh "3" C 590 590 0 0 0
Dr 400 0 0
At STD N 00E0FFFF
Ne 0 ""
Po -12750 -11950
$EndPAD
$PAD
Sh "4" C 590 590 0 0 0
Dr 400 0 0
At STD N 00E0FFFF
Ne 0 ""
Po -11750 -11950
$EndPAD
$PAD
Sh "5" C 590 590 0 0 0
Dr 400 0 0
At STD N 00E0FFFF
Ne 0 ""
Po -10750 -11950
$EndPAD
$PAD
Sh "6" C 590 590 0 0 0
Dr 400 0 0
At STD N 00E0FFFF
Ne 0 ""
Po -9750 -11950
$EndPAD
$PAD
Sh "7" C 590 590 0 0 0
Dr 400 0 0
At STD N 00E0FFFF
Ne 0 ""
Po -8750 -11950
$EndPAD
$PAD
Sh "8" C 590 590 0 0 0
Dr 400 0 0
At STD N 00E0FFFF
Ne 0 ""
Po -7750 -11950
$EndPAD
$PAD
Sh "9" C 590 590 0 0 0
Dr 400 0 0
At STD N 00E0FFFF
Ne 0 ""
Po -6750 -11950
$EndPAD
$PAD
Sh "10" C 590 590 0 0 0
Dr 400 0 0
At STD N 00E0FFFF
Ne 0 ""
Po -5750 -11950
$EndPAD
$PAD
Sh "11" C 590 590 0 0 0
Dr 400 0 0
At STD N 00E0FFFF
Ne 0 ""
Po -4750 -11950
$EndPAD
$PAD
Sh "12" C 590 590 0 0 0
Dr 400 0 0
At STD N 00E0FFFF
Ne 0 ""
Po -3750 -11950
$EndPAD
$PAD
Sh "13" C 590 590 0 0 0
Dr 400 0 0
At STD N 00E0FFFF
Ne 0 ""
Po -2750 -11950
$EndPAD
$PAD
Sh "14" C 590 590 0 0 0
Dr 400 0 0
At STD N 00E0FFFF
Ne 0 ""
Po -1750 -11950
$EndPAD
$SHAPE3D
Na "LCD/lcd_16x4_h1_blue.wrl"
Sc 2 2 2
Of 0 0 0
Ro 0 0 0
$EndSHAPE3D
$EndMODULE LCD_16x4
$MODULE LCD_8x1B
Po 0 0 0 15 4FD64A21 00000000 ~~
Li LCD_8x1B
Cd Convertido por ToKicad
Kw ToKicad
Sc 0
AR 
Op 0 0 0
T0 0 -8500 393 393 0 78 N V 21 N "LCD_8x1B"
T1 0 0 393 393 0 78 N I 21 N "Value"
DS 16250 -6000 16500 -6000 50 21
DS 16250 -7000 16500 -7000 50 21
DS 16250 -7000 14750 -7000 50 21
DS 14750 -7000 14750 -6000 50 21
DS 14750 -6000 16250 -6000 50 21
DS -16500 -7000 -14750 -7000 50 21
DS -14750 -7000 -14750 -6000 50 21
DS -14750 -6000 -16500 -6000 50 21
DS 3000 7750 3000 8750 50 21
DS 3000 8750 -13000 8750 50 21
DS -13000 8750 -13000 7750 50 21
DS -13000 7750 3000 7750 50 21
DS -12000 -3000 12000 -3000 250 21
DS 12000 -3000 12000 3500 250 21
DS 12000 3500 -12000 3500 250 21
DS -12000 3500 -12000 -3000 250 21
DS -14500 -4750 14500 -4750 250 21
DS 14500 -4750 14500 5250 250 21
DS 14500 5250 -14500 5250 250 21
DS -14500 5250 -14500 -4750 250 21
DS -16500 -8000 16500 -8000 150 21
DS 16500 -8000 16500 9250 150 21
DS 16500 9250 -16500 9250 150 21
DS -16500 9250 -16500 -8000 150 21
$PAD
Sh "0" C 2165 2165 0 0 0
Dr 984 0 0
At STD N 00F0FFFF
Ne 0 ""
Po -15750 -6500
$EndPAD
$PAD
Sh "0" C 2165 2165 0 0 0
Dr 984 0 0
At STD N 00F0FFFF
Ne 0 ""
Po 15750 -6500
$EndPAD
$PAD
Sh "0" C 1811 1811 0 0 0
Dr 984 0 0
At STD N 00F0FFFF
Ne 0 ""
Po 15000 7750
$EndPAD
$PAD
Sh "0" C 1811 1811 0 0 0
Dr 984 0 0
At STD N 00F0FFFF
Ne 0 ""
Po -15000 7750
$EndPAD
$PAD
Sh "1" R 620 620 0 0 0
Dr 393 0 0
At STD N 00F0FFFF
Ne 0 ""
Po 2500 8250
$EndPAD
$PAD
Sh "2" C 620 620 0 0 0
Dr 393 0 0
At STD N 00F0FFFF
Ne 0 ""
Po 1500 8250
$EndPAD
$PAD
Sh "3" C 620 620 0 0 0
Dr 393 0 0
At STD N 00F0FFFF
Ne 0 ""
Po 500 8250
$EndPAD
$PAD
Sh "4" C 620 620 0 0 0
Dr 393 0 0
At STD N 00F0FFFF
Ne 0 ""
Po -500 8250
$EndPAD
$PAD
Sh "5" C 620 620 0 0 0
Dr 393 0 0
At STD N 00F0FFFF
Ne 0 ""
Po -1500 8250
$EndPAD
$PAD
Sh "6" C 620 620 0 0 0
Dr 393 0 0
At STD N 00F0FFFF
Ne 0 ""
Po -2500 8250
$EndPAD
$PAD
Sh "7" C 620 620 0 0 0
Dr 393 0 0
At STD N 00F0FFFF
Ne 0 ""
Po -3500 8250
$EndPAD
$PAD
Sh "8" C 620 620 0 0 0
Dr 393 0 0
At STD N 00F0FFFF
Ne 0 ""
Po -4500 8250
$EndPAD
$PAD
Sh "9" C 620 620 0 0 0
Dr 393 0 0
At STD N 00F0FFFF
Ne 0 ""
Po -5500 8250
$EndPAD
$PAD
Sh "10" C 620 620 0 0 0
Dr 393 0 0
At STD N 00F0FFFF
Ne 0 ""
Po -6500 8250
$EndPAD
$PAD
Sh "11" C 620 620 0 0 0
Dr 393 0 0
At STD N 00F0FFFF
Ne 0 ""
Po -7500 8250
$EndPAD
$PAD
Sh "12" C 620 620 0 0 0
Dr 393 0 0
At STD N 00F0FFFF
Ne 0 ""
Po -8500 8250
$EndPAD
$PAD
Sh "13" C 620 620 0 0 0
Dr 393 0 0
At STD N 00F0FFFF
Ne 0 ""
Po -9500 8250
$EndPAD
$PAD
Sh "14" C 620 620 0 0 0
Dr 393 0 0
At STD N 00F0FFFF
Ne 0 ""
Po -10500 8250
$EndPAD
$PAD
Sh "15" C 620 620 0 0 0
Dr 393 0 0
At STD N 00F0FFFF
Ne 0 ""
Po -11500 8250
$EndPAD
$PAD
Sh "16" C 620 620 0 0 0
Dr 393 0 0
At STD N 00F0FFFF
Ne 0 ""
Po -12500 8250
$EndPAD
$EndMODULE LCD_8x1B
$EndLIBRARY
