PCBNEW-LibModule-V1  4.10.2011 13:19:38
# encoding utf-8
$INDEX
CP_6.3x11mm
$EndINDEX
$MODULE CP_6.3x11mm
Po 0 0 0 15 4E8ACF27 00000000 ~~
Li CP_6.3x11mm
Cd Capacitor, pol, cyl 6.3x11mm
Sc 00000000
AR CP_6.3x11mm
Op 0 0 0
T0 0 -1700 600 600 0 120 N V 21 N "CP_6.3x11mm"
T1 0 1850 600 600 0 120 N V 21 N "C**"
DS -700 -1000 700 -1000 98 21
DS -650 -1050 650 -1050 98 21
DS -550 -1100 550 -1100 98 21
DS -400 -1150 400 -1150 98 21
DC 0 0 1240 0 98 21
DS 550 -500 900 -500 100 21
$PAD
Sh "1" R 787 787 0 0 0
Dr 315 0 0
At STD N 00E0FFFF
Ne 0 ""
Po 0 500
$EndPAD
$PAD
Sh "2" C 787 787 0 0 0
Dr 315 0 0
At STD N 00E0FFFF
Ne 0 ""
Po 0 -500
$EndPAD
$SHAPE3D
Na "walter\\capacitors\\cp_6.3x11mm.wrl"
Sc 1.000000 1.000000 1.000000
Of 0.000000 0.000000 0.000000
Ro 0.000000 0.000000 0.000000
$EndSHAPE3D
$EndMODULE  CP_6.3x11mm
$EndLIBRARY
