PCBNEW-LibModule-V1  13.5.2012 17:52:32
# encoding utf-8
$INDEX
Diode-MELF_Handsoldering
Diode-MELF_Standard
Diode-MiniMELF_Handsoldering
Diode-MiniMELF_Standard
Diode-SMA_Handsoldering
Diode-SMA_Standard
Diode-SMB_Handsoldering
Diode-SMB_Standard
Diode-SMC_Handsoldering
Diode-SMC_Standard
Diode-Universal-MELF-RM10_Handsoldering
Diode-Universal-SMA-SMB_Handsoldering
Diode-Universal-SMB-SMC_Handsoldering
Diode-Universal-SMC-RM10_Handsoldering
Diode_SOT23_Handsoldering
Diode_SOT23
MiniMelf
$EndINDEX
$MODULE Diode-MELF_Handsoldering
Po 0 0 0 15 4FAFD16A 00000000 ~~
Li Diode-MELF_Handsoldering
Cd Diode MELF Handsoldering
Kw Diode MELF Handsoldering
Sc 00000000
AR
Op 0 0 0
T0 0 -1000 600 600 0 120 N V 21 N "D"
T1 0 1500 600 600 0 120 N I 21 N "Diode-MELF_Handsoldering"
DS -157 0 -433 0 150 21
DS 217 0 433 0 150 21
DS 217 0 217 315 150 21
DS 217 0 217 -315 150 21
DS 217 0 -157 -315 150 21
DS -157 -315 -157 315 150 21
DS -157 315 217 0 150 21
T2 -1004 807 197 197 0 39 N V 21 N "A"
T2 925 846 197 197 0 39 N V 21 N "K"
DS -433 -492 -472 -492 150 21
DS -433 492 -472 492 150 21
DS 472 -492 -453 -492 150 21
DS 472 492 -413 492 150 21
$PAD
Sh "1" R 1378 1063 0 0 0
Dr 0 0 0
At SMD N 00888000
Ne 0 ""
Po -1339 0
$EndPAD
$PAD
Sh "2" R 1378 1063 0 0 0
Dr 0 0 0
At SMD N 00888000
Ne 0 ""
Po 1339 0
$EndPAD
$SHAPE3D
Na "Diode\\melf.wrl"
Sc 1.000000 1.000000 1.000000
Of 0.000000 0.000000 0.000000
Ro 0.000000 0.000000 0.000000
$EndSHAPE3D
$EndMODULE  Diode-MELF_Handsoldering
$MODULE Diode-MELF_Standard
Po 0 0 0 15 4FAFD1FA 00000000 ~~
Li Diode-MELF_Standard
Cd Diode MELF Standard
Kw Diode MELF Standard
Sc 00000000
AR
Op 0 0 0
T0 0 -1000 600 600 0 120 N V 21 N "D"
T1 0 1500 600 600 0 120 N I 21 N "Diode-MELF_Standard"
T2 -1004 807 197 197 0 39 N V 21 N "A"
T2 925 846 197 197 0 39 N V 21 N "K"
DC 0 0 315 118 150 17
DC 0 0 0 217 150 17
DC 0 0 0 79 150 17
DS -433 -492 -472 -492 150 21
DS -433 492 -472 492 150 21
DS 472 -492 -453 -492 150 21
DS 472 492 -413 492 150 21
$PAD
Sh "1" R 591 1063 0 0 0
Dr 0 0 0
At SMD N 00888000
Ne 0 ""
Po -945 0
$EndPAD
$PAD
Sh "2" R 591 1063 0 0 0
Dr 0 0 0
At SMD N 00888000
Ne 0 ""
Po 945 0
$EndPAD
$SHAPE3D
Na "Diode\\melf.wrl"
Sc 1.000000 1.000000 1.000000
Of 0.000000 0.000000 0.000000
Ro 0.000000 0.000000 0.000000
$EndSHAPE3D
$EndMODULE  Diode-MELF_Standard
$MODULE Diode-MiniMELF_Standard
Po 0 0 0 15 4FAFD243 00000000 ~~
Li Diode-MiniMELF_Standard
Cd Diode Mini-MELF Standard
Kw Diode Mini-MELF Standard
Sc 00000000
AR
Op 0 0 0
.SolderPasteRatio 1.34056e+242
T0 0 -1000 600 600 0 120 N V 21 N "D"
T1 0 1500 600 600 0 120 N I 21 N "Diode-MiniMELF_Standard"
T2 -709 610 197 197 0 39 N V 21 N "A"
T2 709 610 197 197 0 39 N V 21 N "K"
DC 0 0 0 217 150 17
DC 0 0 0 79 150 17
$PAD
Sh "1" R 512 669 0 0 0
Dr 0 0 0
At SMD N 00888000
Ne 0 ""
Po -689 0
$EndPAD
$PAD
Sh "2" R 512 669 0 0 0
Dr 0 0 0
At SMD N 00888000
Ne 0 ""
Po 689 0
$EndPAD
$SHAPE3D
Na "Diode\\sod80c.wrl"
Sc 1.000000 1.000000 1.000000
Of 0.000000 0.000000 0.000000
Ro 0.000000 0.000000 0.000000
$EndSHAPE3D
$EndMODULE  Diode-MiniMELF_Standard
$MODULE Diode-MiniMELF_Handsoldering
Po 0 0 0 15 4FAFD216 00000000 ~~
Li Diode-MiniMELF_Handsoldering
Cd Diode Mini-MELF Handsoldering
Kw Diode Mini-MELF Handsoldering
Sc 00000000
AR
Op 0 0 0
T0 0 -1000 600 600 0 120 N V 21 N "D"
T1 0 1500 600 600 0 120 N I 21 N "Diode-MiniMELF_Handsoldering"
DS 177 0 236 0 150 21
DS -157 0 -236 0 150 21
DS 177 0 177 295 150 21
DS 177 0 177 -276 150 21
DS 177 0 -157 -276 150 21
DS -157 -276 -157 276 150 21
DS -157 276 177 0 150 21
T2 -709 610 197 197 0 39 N V 21 N "A"
T2 709 610 197 197 0 39 N V 21 N "K"
$PAD
Sh "1" R 1299 669 0 0 0
Dr 0 0 0
At SMD N 00888000
Ne 0 ""
Po -1083 0
$EndPAD
$PAD
Sh "2" R 1299 669 0 0 0
Dr 0 0 0
At SMD N 00888000
Ne 0 ""
Po 1083 0
$EndPAD
$SHAPE3D
Na "Diode\\sod80c.wrl"
Sc 1.000000 1.000000 1.000000
Of 0.000000 0.000000 0.000000
Ro 0.000000 0.000000 0.000000
$EndSHAPE3D
$EndMODULE  Diode-MiniMELF_Handsoldering
$MODULE Diode-SMA_Handsoldering
Po 0 0 0 15 4FAFD37B 00000000 ~~
Li Diode-SMA_Handsoldering
Cd Diode SMA Handsoldering
Kw Diode SMA Handsoldering
Sc 00000000
AR
Op 0 0 0
T0 0 -1500 600 600 0 120 N V 21 N "D"
T1 0 1500 600 600 0 120 N I 21 N "Diode-SMA_Handsoldering"
DS 79 -256 79 256 150 21
DS 79 0 -79 98 150 21
DS 79 0 -79 -118 150 21
T2 -1299 630 197 197 0 39 N V 21 N "A"
T2 1181 669 197 197 0 39 N V 21 N "K"
DS 709 689 709 551 150 21
DS 709 -689 709 -551 150 21
DS 886 689 886 551 150 21
DS -886 689 -886 551 150 21
DS -886 -689 -886 -551 150 21
DS 886 -689 886 -551 150 21
DS -886 689 886 689 150 21
DS -886 -689 886 -689 150 21
$PAD
Sh "1" R 1378 709 0 0 0
Dr 0 0 0
At SMD N 00888000
Ne 0 ""
Po -984 0
$EndPAD
$PAD
Sh "2" R 1378 709 0 0 0
Dr 0 0 0
At SMD N 00888000
Ne 0 ""
Po 984 0
$EndPAD
$SHAPE3D
Na "Diode\\do214ac.wrl"
Sc 1.000000 1.000000 1.000000
Of 0.000000 0.000000 0.000000
Ro 0.000000 0.000000 0.000000
$EndSHAPE3D
$EndMODULE  Diode-SMA_Handsoldering
$MODULE Diode-SMA_Standard
Po 0 0 0 15 4FAFD3CD 00000000 ~~
Li Diode-SMA_Standard
Cd Diode SMA
Kw Diode SMA
Sc 00000000
AR
Op 0 0 0
T0 0 -1500 600 600 0 120 N V 21 N "D"
T1 0 1500 600 600 0 120 N I 21 N "Diode-SMA_Standard"
T2 -1299 630 197 197 0 39 N V 21 N "A"
T2 1181 669 197 197 0 39 N V 21 N "K"
DC 0 0 79 -20 150 17
DS 709 689 709 551 150 21
DS 709 -689 709 -551 150 21
DS 886 689 886 551 150 21
DS -886 689 -886 551 150 21
DS -886 -689 -886 -551 150 21
DS 886 -689 886 -551 150 21
DS -886 689 886 689 150 21
DS -886 -689 886 -689 150 21
$PAD
Sh "1" R 984 709 0 0 0
Dr 0 0 0
At SMD N 00888000
Ne 0 ""
Po -787 0
$EndPAD
$PAD
Sh "2" R 984 709 0 0 0
Dr 0 0 0
At SMD N 00888000
Ne 0 ""
Po 787 0
$EndPAD
$SHAPE3D
Na "Diode\\do214ac.wrl"
Sc 1.000000 1.000000 1.000000
Of 0.000000 0.000000 0.000000
Ro 0.000000 0.000000 0.000000
$EndSHAPE3D
$EndMODULE  Diode-SMA_Standard
$MODULE Diode-SMB_Handsoldering
Po 0 0 0 15 4FAFD3E2 00000000 ~~
Li Diode-SMB_Handsoldering
Cd Diode SMB Handsoldering
Kw Diode SMB Handsoldering
Sc 00000000
AR
Op 0 0 0
.SolderPasteRatio 1.34056e+242
T0 0 -1500 600 600 0 120 N V 21 N "D"
T1 0 1500 600 600 0 120 N I 21 N "Diode-SMB_Handsoldering"
DS 177 0 -157 -394 150 21
DS -157 -394 -157 394 150 21
DS -157 394 177 0 150 21
DS 177 0 177 394 150 21
DS 177 0 177 -394 150 21
T2 -1260 768 197 197 0 39 N V 21 N "A"
T2 1181 768 197 197 0 39 N V 21 N "K"
DS -906 689 -906 630 150 21
DS 768 689 768 650 150 21
DS 906 689 906 650 150 21
DS -906 -689 -906 -650 150 21
DS 768 -689 768 -650 150 21
DS 906 -689 906 -650 150 21
DS 768 787 768 709 150 21
DS 768 -787 768 -709 150 21
DS 904 786 904 708 150 21
DS -908 786 904 786 150 21
DS -908 786 -908 708 150 21
DS -906 -787 -906 -709 150 21
DS -906 -787 906 -787 150 21
DS 906 -787 906 -709 150 21
$PAD
Sh "1" R 1378 906 0 0 0
Dr 0 0 0
At SMD N 00888000
Ne 0 ""
Po -1063 0
$EndPAD
$PAD
Sh "2" R 1378 906 0 0 0
Dr 0 0 0
At SMD N 00888000
Ne 0 ""
Po 1063 0
$EndPAD
$SHAPE3D
Na "smd\\do214.wrl"
Sc 1.000000 1.000000 1.000000
Of 0.000000 0.000000 0.000000
Ro 0.000000 0.000000 0.000000
$EndSHAPE3D
$EndMODULE  Diode-SMB_Handsoldering
$MODULE Diode-SMB_Standard
Po 0 0 0 15 4FAFD4C9 00000000 ~~
Li Diode-SMB_Standard
Cd Diode SMB Standard
Kw Diode SMB Standard
Sc 00000000
AR
Op 0 0 0
T0 0 -1500 600 600 0 120 N V 21 N "D"
T1 0 1500 600 600 0 120 N I 21 N "Diode-SMB_Standard"
T2 -1260 768 197 197 0 39 N V 21 N "A"
T2 1181 768 197 197 0 39 N V 21 N "K"
DS -906 689 -906 630 150 21
DS 768 689 768 650 150 21
DS 906 689 906 650 150 21
DS -906 -689 -906 -650 150 21
DS 768 -689 768 -650 150 21
DS 906 -689 906 -650 150 21
DC 0 0 177 39 150 17
DC 0 0 79 39 150 17
DS 768 787 768 709 150 21
DS 768 -787 768 -709 150 21
DS 904 786 904 708 150 21
DS -908 786 904 786 150 21
DS -908 786 -908 708 150 21
DS -906 -787 -906 -709 150 21
DS -906 -787 906 -787 150 21
DS 906 -787 906 -709 150 21
$PAD
Sh "1" R 984 906 0 0 0
Dr 0 0 0
At SMD N 00888000
Ne 0 ""
Po -846 0
$EndPAD
$PAD
Sh "2" R 984 906 0 0 0
Dr 0 0 0
At SMD N 00888000
Ne 0 ""
Po 846 0
$EndPAD
$SHAPE3D
Na "smd\\do214.wrl"
Sc 1.000000 1.000000 1.000000
Of 0.000000 0.000000 0.000000
Ro 0.000000 0.000000 0.000000
$EndSHAPE3D
$EndMODULE  Diode-SMB_Standard
$MODULE Diode-SMC_Handsoldering
Po 0 0 0 15 4FAFD5EE 00000000 ~~
Li Diode-SMC_Handsoldering
Cd Diode SMC Handsoldering
Kw Diode SMC Handsoldering
Sc 00000000
AR
Op 0 0 0
T0 0 -2000 600 600 0 120 N V 21 N "D"
T1 0 2000 600 600 0 120 N I 21 N "Diode-SMC_Handsoldering"
DS 255 0 610 0 150 21
DS -198 0 -591 0 150 21
DS 1201 1339 1201 866 150 21
DS 1201 -1339 1201 -866 150 21
DS 1417 1339 1417 866 150 21
DS 1417 -1339 1417 -866 150 21
DS -1417 1339 -1417 846 150 21
DS -1417 -1339 -1417 -846 150 21
DS 255 -315 255 315 150 21
DS -198 295 -198 -315 150 21
DS 255 0 -198 295 150 21
DS 255 0 -198 -315 150 21
DS -1417 1339 1417 1339 150 21
DS -1417 -1339 1417 -1339 150 21
$PAD
Sh "1" R 1299 1772 0 0 900
Dr 0 0 0
At SMD N 00888000
Ne 0 ""
Po -1732 0
$EndPAD
$PAD
Sh "2" R 1299 1771 0 0 900
Dr 0 0 0
At SMD N 00888000
Ne 0 ""
Po 1732 0
$EndPAD
$SHAPE3D
Na "Diode\\do214ab.wrl"
Sc 1.000000 1.000000 1.000000
Of 0.000000 0.000000 0.000000
Ro 0.000000 0.000000 0.000000
$EndSHAPE3D
$EndMODULE  Diode-SMC_Handsoldering
$MODULE Diode-SMC_Standard
Po 0 0 0 15 4FAFD5FF 00000000 ~~
Li Diode-SMC_Standard
Cd Diode SMC Standard
Kw Diode SMC Standard
Sc 00000000
AR
Op 0 0 0
T0 0 -2000 600 600 0 120 N V 21 N "D"
T1 0 2000 600 600 0 120 N I 21 N "Diode-SMC_Standard"
DC 0 0 295 138 150 17
DC 0 0 177 79 150 17
DC 0 0 59 59 150 17
DS 236 -787 591 -787 150 21
DS -217 -787 -610 -787 150 21
DS 1201 1339 1201 866 150 21
DS 1201 -1339 1201 -866 150 21
DS 1417 1339 1417 866 150 21
DS 1417 -1339 1417 -866 150 21
DS -1417 1339 -1417 846 150 21
DS -1417 -1339 -1417 -846 150 21
DS 236 -1102 236 -472 150 21
DS -217 -492 -217 -1102 150 21
DS 236 -787 -217 -492 150 21
DS 236 -787 -217 -1102 150 21
DS -1417 1339 1417 1339 150 21
DS -1417 -1339 1417 -1339 150 21
$PAD
Sh "1" R 1299 984 0 0 900
Dr 0 0 0
At SMD N 00888000
Ne 0 ""
Po -1339 0
$EndPAD
$PAD
Sh "2" R 1299 984 0 0 900
Dr 0 0 0
At SMD N 00888000
Ne 0 ""
Po 1339 0
$EndPAD
$SHAPE3D
Na "Diode\\do214ab.wrl"
Sc 1.000000 1.000000 1.000000
Of 0.000000 0.000000 0.000000
Ro 0.000000 0.000000 0.000000
$EndSHAPE3D
$EndMODULE  Diode-SMC_Standard
$MODULE Diode-Universal-MELF-RM10_Handsoldering
Po 0 0 0 15 4FAFD6F1 00000000 ~~
Li Diode-Universal-MELF-RM10_Handsoldering
Cd Diode, Universal, MELF, RM10, Handsoldering, SMD, Thruhole,
Kw Diode, Universal, MELF, RM10, Handsoldering, SMD, Thruhole,
Sc 00000000
AR
Op 0 0 0
T0 0 -1000 600 600 0 120 N V 21 N "D"
T1 0 1500 600 600 0 120 N I 21 N "Diode-Universal-MELF-RM10_Handsoldering"
DS -157 0 -433 0 150 21
DS 217 0 433 0 150 21
DS 217 0 217 315 150 21
DS 217 0 217 -315 150 21
DS 217 0 -157 -315 150 21
DS -157 -315 -157 315 150 21
DS -157 315 217 0 150 21
T2 -1004 807 197 197 0 39 N V 21 N "A"
T2 925 846 197 197 0 39 N V 21 N "K"
DS -433 -492 -472 -492 150 21
DS -433 492 -472 492 150 21
DS 472 -492 -453 -492 150 21
DS 472 492 -413 492 150 21
$PAD
Sh "1" R 1771 1063 0 0 0
Dr 472 433 0
At STD N 00E0FFFF
Ne 0 ""
Po -1969 0
$EndPAD
$PAD
Sh "2" R 1771 1063 0 0 1800
Dr 472 433 0
At STD N 00E0FFFF
Ne 0 ""
Po 1969 0
$EndPAD
$EndMODULE  Diode-Universal-MELF-RM10_Handsoldering
$MODULE Diode-Universal-SMA-SMB_Handsoldering
Po 0 0 0 15 4FAFD700 00000000 ~~
Li Diode-Universal-SMA-SMB_Handsoldering
Cd Diode, Universal, SMA, SMB, Handsoldering,
Kw Diode, Universal, SMA, SMB, Handsoldering,
Sc 00000000
AR
Op 0 0 0
T0 0 -1500 600 600 0 120 N V 21 N "D"
T1 0 1500 600 600 0 120 N I 21 N "Diode-Universal-SMA-SMB_Handsoldering"
DS 177 0 -197 -276 150 21
DS -197 -276 -197 276 150 21
DS -197 276 177 0 150 21
DS 177 -276 177 276 150 21
DS -886 551 -886 492 150 21
DS -886 -551 -886 -492 150 21
DS 709 551 709 472 150 21
DS 886 531 886 492 150 21
DS 709 -531 709 -472 150 21
DS 886 -551 886 -492 150 21
T2 -1299 630 197 197 0 39 N V 21 N "A"
T2 1181 669 197 197 0 39 N V 21 N "K"
DS 709 689 709 551 150 21
DS 709 -689 709 -551 150 21
DS 886 689 886 551 150 21
DS -886 689 -886 551 150 21
DS -886 -689 -886 -551 150 21
DS 886 -689 886 -551 150 21
DS -886 689 886 689 150 21
DS -886 -689 886 -689 150 21
$PAD
Sh "1" T 1418 669 236 0 0
Dr 0 0 0
At SMD N 00888000
Ne 0 ""
Po -1142 0
$EndPAD
$PAD
Sh "2" T 1418 669 236 0 1800
Dr 0 0 0
At SMD N 00888000
Ne 0 ""
Po 1142 0
$EndPAD
$EndMODULE  Diode-Universal-SMA-SMB_Handsoldering
$MODULE Diode-Universal-SMB-SMC_Handsoldering
Po 0 0 0 15 4FAFD712 00000000 ~~
Li Diode-Universal-SMB-SMC_Handsoldering
Cd Diode, Universal, SMB, SMC, Handsoldering,
Kw Diode, Universal, SMB, SMC, Handsoldering,
Sc 00000000
AR
Op 0 0 0
T0 0 -1500 600 600 0 120 N V 21 N "D"
T1 0 1500 600 600 0 120 N I 21 N "Diode-Universal-SMB-SMC_Handsoldering"
DS 177 0 -157 -394 150 21
DS -157 -394 -157 394 150 21
DS -157 394 177 0 150 21
DS 177 0 177 394 150 21
DS 177 0 177 -394 150 21
T2 -1260 768 197 197 0 39 N V 21 N "A"
T2 1181 768 197 197 0 39 N V 21 N "K"
DS -906 689 -906 630 150 21
DS 768 689 768 650 150 21
DS 906 689 906 650 150 21
DS -906 -689 -906 -650 150 21
DS 768 -689 768 -650 150 21
DS 906 -689 906 -650 150 21
DS 768 787 768 709 150 21
DS 768 -787 768 -709 150 21
DS 904 786 904 708 150 21
DS -908 786 904 786 150 21
DS -908 786 -908 708 150 21
DS -906 -787 -906 -709 150 21
DS -906 -787 906 -787 150 21
DS 906 -787 906 -709 150 21
$PAD
Sh "1" T 1693 1024 394 0 0
Dr 0 0 0
At SMD N 00888000
Ne 0 ""
Po -1260 0
$EndPAD
$PAD
Sh "2" T 1693 1024 394 0 1800
Dr 0 0 0
At SMD N 00888000
Ne 0 ""
Po 1260 0
$EndPAD
$EndMODULE  Diode-Universal-SMB-SMC_Handsoldering
$MODULE Diode-Universal-SMC-RM10_Handsoldering
Po 0 0 0 15 4FAFD723 00000000 ~~
Li Diode-Universal-SMC-RM10_Handsoldering
Cd Diode, Universal, SMC, RM10, Handsoldering, SMD, Thruhole,
Kw Diode, Universal, SMC, RM10, Handsoldering, SMD, Thruhole,
Sc 00000000
AR
Op 0 0 0
T0 0 -2000 600 600 0 120 N V 21 N "D"
T1 0 2000 600 600 0 120 N I 21 N "Diode-Universal-SMC-RM10_Handsoldering"
DS 255 0 610 0 150 21
DS -198 0 -591 0 150 21
DS 1201 1339 1201 866 150 21
DS 1201 -1339 1201 -866 150 21
DS 1417 1339 1417 866 150 21
DS 1417 -1339 1417 -866 150 21
DS -1417 1339 -1417 846 150 21
DS -1417 -1339 -1417 -846 150 21
DS 255 -315 255 315 150 21
DS -198 295 -198 -315 150 21
DS 255 0 -198 295 150 21
DS 255 0 -198 -315 150 21
DS -1417 1339 1417 1339 150 21
DS -1417 -1339 1417 -1339 150 21
$PAD
Sh "1" R 1772 1299 0 0 0
Dr 472 236 0
At STD N 00E0FFFF
Ne 0 ""
Po -1969 0
$EndPAD
$PAD
Sh "2" R 1772 1299 0 0 1800
Dr 472 236 0
At STD N 00E0FFFF
Ne 0 ""
Po 1969 0
$EndPAD
$EndMODULE  Diode-Universal-SMC-RM10_Handsoldering
$MODULE Diode_SOT23_Handsoldering
Po 0 0 0 15 4FAFD731 00000000 ~~
Li Diode_SOT23_Handsoldering
Cd SOT23,  Transistor, Handsoldering,
Kw SOT23,  Transistor, Handsoldering,
Sc 00000000
AR
Op 0 0 0
T0 0 -1500 600 600 0 120 N V 21 N "T"
T1 0 1500 600 600 0 120 N I 21 N "SOT23_Transistor_Handsoldering"
DS -433 20 -433 -256 150 21
DS -433 -256 -335 -256 150 21
DS 354 -256 433 -256 150 21
DS 433 -256 433 20 150 21
$PAD
Sh "1" R 315 709 0 0 0
Dr 0 0 0
At SMD N 00888000
Ne 0 ""
Po -276 591
$EndPAD
$PAD
Sh "2" R 315 709 0 0 0
Dr 0 0 0
At SMD N 00888000
Ne 0 ""
Po 276 591
$EndPAD
$PAD
Sh "3" R 315 709 0 0 0
Dr 0 0 0
At SMD N 00888000
Ne 0 ""
Po 0 -591
$EndPAD
$SHAPE3D
Na "smd\\SOT23_3.wrl"
Sc 0.300000 -0.300000 0.300000
Of 0.000000 0.000000 0.000000
Ro 0.000000 0.000000 0.000000
$EndSHAPE3D
$EndMODULE  Diode_SOT23_Handsoldering
$MODULE Diode_SOT23
Po 0 0 0 15 4FAFD7D1 00000000 ~~
Li Diode_SOT23
Cd SOT23, Standard, Diode,
Kw SOT23, Standard, Diode,
Sc 00000000
AR
Op 0 0 0
T0 0 -1500 600 600 0 120 N V 21 N "D"
T1 0 1500 600 600 0 120 N I 21 N "Diode_SOT23"
DS 354 -256 335 -256 150 21
DS -433 20 -433 -256 150 21
DS -433 -256 -335 -256 150 21
DS 354 -256 433 -256 150 21
DS 433 -256 433 20 150 21
$PAD
Sh "1" R 315 315 0 0 0
Dr 0 0 0
At SMD N 00888000
Ne 0 ""
Po -276 394
$EndPAD
$PAD
Sh "2" R 315 315 0 0 0
Dr 0 0 0
At SMD N 00888000
Ne 0 ""
Po 276 394
$EndPAD
$PAD
Sh "3" R 315 315 0 0 0
Dr 0 0 0
At SMD N 00888000
Ne 0 ""
Po 0 -393
$EndPAD
$SHAPE3D
Na "smd\\SOT23_3.wrl"
Sc 0.300000 -0.300000 0.300000
Of 0.000000 0.000000 0.000000
Ro 0.000000 0.000000 0.000000
$EndSHAPE3D
$EndMODULE  Diode_SOT23
$MODULE MiniMelf
Po 0 0 0 15 4FAFD098 00000000 ~~
Li MiniMelf
Cd MINI MELF DIODE
Kw MINI MELF DIODE
Sc 00000000
AR MiniMelf
Op 0 0 0
.SolderPasteRatio 1.34056e+242
At SMD 
T0 0 -787 394 394 0 79 N V 21 N "MiniMelf"
T1 0 800 394 394 0 79 N I 21 N "Val***"
DS -335 305 305 305 80 21
DS -335 -305 295 -305 80 21
DS 295 -305 300 -305 80 21
DS -340 310 -100 310 26 21
DS -100 310 -100 -310 26 21
DS -340 -310 -100 -310 26 21
DS -340 310 -340 -310 26 21
DS 196 -196 -196 0 80 21
DS -196 0 196 196 80 21
DS 196 196 196 -196 80 21
$PAD
Sh "1" R 551 708 0 0 0
Dr 0 0 0
At SMD N 00888000
Ne 1 "A"
Po 669 0
$EndPAD
$PAD
Sh "2" R 551 708 0 0 0
Dr 0 0 0
At SMD N 00888000
Ne 2 "K"
Po -669 0
$EndPAD
$SHAPE3D
Na "Diode\\minimelf.wrl"
Sc 1.000000 1.000000 1.000000
Of 0.000000 0.000000 0.000000
Ro 0.000000 0.000000 180.000000
$EndSHAPE3D
$EndMODULE  MiniMelf
$EndLIBRARY
