PCBNEW-LibModule-V1  St 20. červen 2012, 18:06:30 CEST
# encoding utf-8
Units deci-mils
$INDEX
Inductor-shield-5mm
Inductor-shield-7mm
$EndINDEX
$MODULE Inductor-shield-5mm
Po 0 0 0 15 4FE1F479 00000000 ~~
Li Inductor-shield-5mm
Kw BOBINA
Sc 0
AR 
Op 0 0 0
T0 0 -3000 393 393 0 78 N V 21 N "Inductor-shield-5mm"
T1 0 3250 393 393 0 78 N I 21 N "Value"
DC 0 -10 40 990 150 21
DS -2600 -2220 -2600 -2510 150 21
DS -2590 -2250 -2590 2600 150 21
DS -2590 2600 2540 2600 150 21
DS 2540 2600 2540 -2540 150 21
DS 2540 -2540 -2540 -2540 150 21
$PAD
Sh "1" C 787 787 0 0 0
Dr 394 0 0
At STD N 00E0FFFF
Ne 0 ""
Po -2010 -1870
$EndPAD
$PAD
Sh "2" C 787 787 0 0 0
Dr 394 0 0
At STD N 00E0FFFF
Ne 0 ""
Po -2000 2050
$EndPAD
$PAD
Sh "3" C 787 787 0 0 0
Dr 394 0 0
At STD N 00E0FFFF
Ne 0 ""
Po 1940 2070
$EndPAD
$PAD
Sh "4" C 787 787 0 0 0
Dr 394 0 0
At STD N 00E0FFFF
Ne 0 ""
Po 1950 -1870
$EndPAD
$PAD
Sh "5" C 787 787 0 0 0
Dr 394 0 0
At STD N 00E0FFFF
Ne 0 ""
Po 1950 130
$EndPAD
$SHAPE3D
Na "Inductor/Inductor-Shield.wrl"
Sc 1 1 1
Of 0 0 0
Ro 0 0 0
$EndSHAPE3D
$EndMODULE Inductor-shield-5mm
$MODULE Inductor-shield-7mm
Po 0 0 0 15 4FE1F4D4 00000000 ~~
Li Inductor-shield-7mm
Kw BOBINA
Sc 0
AR 
Op 0 0 0
T0 0 -4500 393 393 0 78 N V 21 N "Inductor-shield-7mm"
T1 0 3500 393 393 0 78 N I 21 N "Value"
DS -3880 3930 3970 3900 150 21
DS 3970 3900 3970 -3920 150 21
DS 3970 -3920 -3930 -3940 150 21
DC 30 20 60 1410 150 21
DS -3900 -3940 -3880 3900 150 21
$PAD
Sh "1" C 787 787 0 0 0
Dr 394 0 0
At STD N 00E0FFFF
Ne 0 ""
Po -2540 -2580
$EndPAD
$PAD
Sh "2" C 787 787 0 0 0
Dr 394 0 0
At STD N 00E0FFFF
Ne 0 ""
Po -2540 2540
$EndPAD
$PAD
Sh "3" C 787 787 0 0 0
Dr 394 0 0
At STD N 00E0FFFF
Ne 0 ""
Po 2580 2540
$EndPAD
$PAD
Sh "4" C 787 787 0 0 0
Dr 394 0 0
At STD N 00E0FFFF
Ne 0 ""
Po 2580 -2580
$EndPAD
$PAD
Sh "5" C 787 787 0 0 0
Dr 394 0 0
At STD N 00E0FFFF
Ne 0 ""
Po 2600 40
$EndPAD
$SHAPE3D
Na "Inductor/Inductor-Shield.wrl"
Sc 1.3 1.3 1.3
Of 0 0 0
Ro 0 0 0
$EndSHAPE3D
$EndMODULE Inductor-shield-7mm
$EndLIBRARY
