PCBNEW-LibModule-V1  Čt 21. červen 2012, 21:19:48 CEST
# encoding utf-8
Units deci-mils
$INDEX
CONN_SMART_CARD_8POS_7112S0825X01LF
smart_card_16_2
smart_card_8_2
$EndINDEX
$MODULE CONN_SMART_CARD_8POS_7112S0825X01LF
Po 0 0 0 15 4FE37388 00000000 ~~
Li CONN_SMART_CARD_8POS_7112S0825X01LF
Sc 0
AR /4A857DFA
Op 0 0 0
T0 0 -7400 472 472 0 100 N V 21 N "CONN_SMART_CARD_8POS_7112S0825X01LF"
T1 0 0 472 472 0 100 N I 21 N "VAL**"
DS 2800 5900 3400 5300 100 25
DS -4094 -6299 -4094 6299 100 21
DS -4094 6299 4094 6299 100 21
DS 4094 6299 4094 -6299 100 21
DS 4094 -6299 -4094 -6299 100 21
DS -3425 5906 3425 5906 100 25
DS 3425 5906 3425 1181 100 25
DS 3425 1181 3937 1181 100 25
DS 3937 1181 3937 -787 100 25
DS 3937 -787 3425 -787 100 25
DS 3425 -787 3425 -2756 100 25
DS 3425 -2756 3937 -2756 100 25
DS 3937 -2756 3937 -5906 100 25
DS 3937 -5905 -3937 -5905 100 25
DS -3425 -787 -3937 -787 100 25
DS -3937 -787 -3937 1181 100 25
DS -3937 1181 -3425 1181 100 25
DS -3425 1181 -3425 5906 100 25
DS -3937 -5906 -3937 -2756 100 25
DS -3937 -2756 -3425 -2756 100 25
DS -3425 -2756 -3425 -787 100 25
DS -4331 6496 4331 6496 100 25
DS 4331 6496 4331 -6496 100 25
DS 4331 -6496 -4331 -6496 100 25
DS -4331 -6496 -4331 6496 100 25
$PAD
Sh "1" R 472 748 0 0 0
Dr 0 0 0
At SMD N 00888000
Ne 0 ""
Po -1500 -5768
$EndPAD
$PAD
Sh "2" R 472 748 0 0 0
Dr 0 0 0
At SMD N 00888000
Ne 0 ""
Po -500 -5768
$EndPAD
$PAD
Sh "3" R 472 748 0 0 0
Dr 0 0 0
At SMD N 00888000
Ne 0 ""
Po 500 -5768
$EndPAD
$PAD
Sh "4" R 472 748 0 0 0
Dr 0 0 0
At SMD N 00888000
Ne 0 ""
Po 1500 -5768
$EndPAD
$PAD
Sh "5" R 472 748 0 0 0
Dr 0 0 0
At SMD N 00888000
Ne 0 ""
Po -1500 5768
$EndPAD
$PAD
Sh "6" R 472 748 0 0 0
Dr 0 0 0
At SMD N 00888000
Ne 0 ""
Po -500 5768
$EndPAD
$PAD
Sh "7" R 472 748 0 0 0
Dr 0 0 0
At SMD N 00888000
Ne 0 ""
Po 500 5768
$EndPAD
$PAD
Sh "8" R 472 748 0 0 0
Dr 0 0 0
At SMD N 00888000
Ne 0 ""
Po 1500 5768
$EndPAD
$PAD
Sh "" C 865 865 0 0 0
Dr 865 0 0
At HOLE N 00E0FFFF
Ne 0 ""
Po -2437 4782
$EndPAD
$PAD
Sh "" C 865 865 0 0 0
Dr 865 0 0
At HOLE N 00E0FFFF
Ne 0 ""
Po 3075 -3290
$EndPAD
$EndMODULE CONN_SMART_CARD_8POS_7112S0825X01LF
$MODULE smart_card_16_2
Po 0 0 0 15 4655E4E4 00000000 ~~
Li smart_card_16_2
Cd AMPHENOL CONNECTOR
Kw AMPHENOL CONNECTOR
Sc 0
AR 
Op 0 0 0
At VIRTUAL
T0 0 -4500 500 500 0 35 N V 21 N "SMART CARD 16 Pi"
T1 0 2000 500 500 0 35 N V 21 N "SC*"
DS 10375 -7751 10375 -6276 150 21
DS 10375 -6276 -10025 -6276 150 21
DS -10025 -6276 -10025 -7801 150 21
DS 12340 7883 12340 5167 80 21
DS 12340 5167 11592 5167 80 21
DS 11592 5167 11592 4773 80 21
DS 11592 3198 11592 2017 80 21
DS 11592 2017 12379 2017 80 21
DS 12379 2017 12379 -1919 80 21
DS 12379 -1919 11592 -1919 80 21
DS 11592 -1919 11592 -3100 80 21
DS 11592 -4675 11592 -5069 80 21
DS 11592 -5069 12340 -5069 80 21
DS 12340 -5069 12340 -7785 80 21
DS 12340 -7785 -11990 -7785 80 21
DS -11990 7883 12340 7883 80 21
DS -11990 7883 -11990 5167 80 21
DS -11990 5167 -11242 5167 80 21
DS -11242 3198 -11242 2017 80 21
DS -11242 2017 -12029 2017 80 21
DS -12029 2017 -12029 -1919 80 21
DS -12029 -1919 -11242 -1919 80 21
DS -11242 -1919 -11242 -3100 80 21
DS -11242 -4675 -11242 -5069 80 21
DS -11242 -5069 -11990 -5069 80 21
DS -11990 -5069 -11990 -7785 80 21
DS -11242 5167 -11242 4773 80 21
DC 11592 3986 11906 4300 50 21
DS 11592 4615 11592 3356 50 21
DS 12222 3986 10962 3986 50 21
DC 11592 -3888 11906 -4202 50 21
DS 11592 -3258 11592 -4517 50 21
DS 12222 -3888 10962 -3888 50 21
DC -11242 -3888 -11556 -4202 50 21
DS -11242 -3258 -11242 -4517 50 21
DS -10612 -3888 -11872 -3888 50 21
DC -11242 3986 -11556 4300 50 21
DS -11242 4615 -11242 3356 50 21
DS -10612 3986 -11872 3986 50 21
DC 11592 5954 11700 6062 50 21
DS 11592 6171 11592 5737 50 21
DS 11808 5954 11375 5954 50 21
DC -11242 -5856 -11350 -5964 50 21
DS -11242 -5639 -11242 -6073 50 21
DS -11025 -5856 -11458 -5856 50 21
DA -11242 3986 -11242 4773 1800 80 21
DA -11242 -3888 -11242 -3100 1800 80 21
DA 11592 -3888 11592 -4675 1800 80 21
DA 11592 3986 11592 3198 1800 80 21
T2 0 2000 500 500 0 35 N V 21 N ""
$PAD
Sh "C1" O 984 649 0 0 900
Dr 433 0 0
At STD N 00A8FFFF
Ne 0 ""
Po 2883 7549
$EndPAD
$PAD
Sh "C2" O 984 649 0 0 900
Dr 433 0 0
At STD N 00A8FFFF
Ne 0 ""
Po 1883 7549
$EndPAD
$PAD
Sh "C3" O 984 649 0 0 900
Dr 433 0 0
At STD N 00A8FFFF
Ne 0 ""
Po 883 7549
$EndPAD
$PAD
Sh "C4" O 984 649 0 0 900
Dr 433 0 0
At STD N 00A8FFFF
Ne 0 ""
Po -116 7549
$EndPAD
$PAD
Sh "C5" O 984 649 0 0 900
Dr 433 0 0
At STD N 00A8FFFF
Ne 0 ""
Po 2883 -7451
$EndPAD
$PAD
Sh "C6" O 984 649 0 0 900
Dr 433 0 0
At STD N 00A8FFFF
Ne 0 ""
Po 1883 -7451
$EndPAD
$PAD
Sh "C7" O 984 649 0 0 900
Dr 433 0 0
At STD N 00A8FFFF
Ne 0 ""
Po 883 -7451
$EndPAD
$PAD
Sh "C8" O 984 649 0 0 900
Dr 433 0 0
At STD N 00A8FFFF
Ne 0 ""
Po -116 -7451
$EndPAD
$PAD
Sh "C_1" O 984 649 0 0 900
Dr 433 0 0
At STD N 00A8FFFF
Ne 0 ""
Po 3883 -7451
$EndPAD
$PAD
Sh "C_2" O 984 649 0 0 900
Dr 433 0 0
At STD N 00A8FFFF
Ne 0 ""
Po 4883 -7451
$EndPAD
$PAD
Sh "C_3" O 984 649 0 0 900
Dr 433 0 0
At STD N 00A8FFFF
Ne 0 ""
Po 5883 -7451
$EndPAD
$PAD
Sh "C_4" O 984 649 0 0 900
Dr 433 0 0
At STD N 00A8FFFF
Ne 0 ""
Po 6883 -7451
$EndPAD
$PAD
Sh "C_5" O 984 649 0 0 900
Dr 433 0 0
At STD N 00A8FFFF
Ne 0 ""
Po 3883 7549
$EndPAD
$PAD
Sh "C_6" O 984 649 0 0 900
Dr 433 0 0
At STD N 00A8FFFF
Ne 0 ""
Po 4883 7549
$EndPAD
$PAD
Sh "C_7" O 984 649 0 0 900
Dr 433 0 0
At STD N 00A8FFFF
Ne 0 ""
Po 5883 7549
$EndPAD
$PAD
Sh "C_8" O 984 649 0 0 900
Dr 433 0 0
At STD N 00A8FFFF
Ne 0 ""
Po 6883 7549
$EndPAD
$PAD
Sh "S1" O 649 984 0 0 900
Dr 433 0 0
At STD N 00A8FFFF
Ne 0 ""
Po -1616 7549
$EndPAD
$PAD
Sh "S2" O 649 984 0 0 900
Dr 433 0 0
At STD N 00A8FFFF
Ne 0 ""
Po -1616 6549
$EndPAD
$EndMODULE smart_card_16_2
$MODULE smart_card_8_2
Po 0 0 0 15 4655E50C 00000000 ~~
Li smart_card_8_2
Cd AMPHENOL CONNECTOR
Kw AMPHENOL CONNECTOR
Sc 0
AR 
Op 0 0 0
At VIRTUAL
T0 -550 -5100 500 500 0 35 N V 21 N "SMART CARD 8 Pin"
T1 0 2000 500 500 0 35 N V 21 N "SC*"
DS 10375 -7751 10375 -6276 150 21
DS 10375 -6276 -10025 -6276 150 21
DS -10025 -6276 -10025 -7801 150 21
DS 12340 7883 12340 5167 80 21
DS 12340 5167 11592 5167 80 21
DS 11592 5167 11592 4773 80 21
DS 11592 3198 11592 2017 80 21
DS 11592 2017 12379 2017 80 21
DS 12379 2017 12379 -1919 80 21
DS 12379 -1919 11592 -1919 80 21
DS 11592 -1919 11592 -3100 80 21
DS 11592 -4675 11592 -5069 80 21
DS 11592 -5069 12340 -5069 80 21
DS 12340 -5069 12340 -7785 80 21
DS 12340 -7785 -11990 -7785 80 21
DS -11990 7883 12340 7883 80 21
DS -11990 7883 -11990 5167 80 21
DS -11990 5167 -11242 5167 80 21
DS -11242 3198 -11242 2017 80 21
DS -11242 2017 -12029 2017 80 21
DS -12029 2017 -12029 -1919 80 21
DS -12029 -1919 -11242 -1919 80 21
DS -11242 -1919 -11242 -3100 80 21
DS -11242 -4675 -11242 -5069 80 21
DS -11242 -5069 -11990 -5069 80 21
DS -11990 -5069 -11990 -7785 80 21
DS -11242 5167 -11242 4773 80 21
DC 11592 3986 11906 4300 50 21
DS 11592 4615 11592 3356 50 21
DS 12222 3986 10962 3986 50 21
DC 11592 -3888 11906 -4202 50 21
DS 11592 -3258 11592 -4517 50 21
DS 12222 -3888 10962 -3888 50 21
DC -11242 -3888 -11556 -4202 50 21
DS -11242 -3258 -11242 -4517 50 21
DS -10612 -3888 -11872 -3888 50 21
DC -11242 3986 -11556 4300 50 21
DS -11242 4615 -11242 3356 50 21
DS -10612 3986 -11872 3986 50 21
DC 11592 5954 11700 6062 50 21
DS 11592 6171 11592 5737 50 21
DS 11808 5954 11375 5954 50 21
DC -11242 -5856 -11350 -5964 50 21
DS -11242 -5639 -11242 -6073 50 21
DS -11025 -5856 -11458 -5856 50 21
DA -11242 3986 -11242 4773 1800 80 21
DA -11242 -3888 -11242 -3100 1800 80 21
DA 11592 -3888 11592 -4675 1800 80 21
DA 11592 3986 11592 3198 1800 80 21
$PAD
Sh "C1" O 984 649 0 0 900
Dr 433 0 0
At STD N 00A8FFFF
Ne 0 ""
Po 2883 7549
$EndPAD
$PAD
Sh "C2" O 984 649 0 0 900
Dr 433 0 0
At STD N 00A8FFFF
Ne 0 ""
Po 1883 7549
$EndPAD
$PAD
Sh "C3" O 984 649 0 0 900
Dr 433 0 0
At STD N 00A8FFFF
Ne 0 ""
Po 883 7549
$EndPAD
$PAD
Sh "C4" O 984 649 0 0 900
Dr 433 0 0
At STD N 00A8FFFF
Ne 0 ""
Po -116 7549
$EndPAD
$PAD
Sh "C5" O 984 649 0 0 900
Dr 433 0 0
At STD N 00A8FFFF
Ne 0 ""
Po 2883 -7451
$EndPAD
$PAD
Sh "C6" O 984 649 0 0 900
Dr 433 0 0
At STD N 00A8FFFF
Ne 0 ""
Po 1883 -7451
$EndPAD
$PAD
Sh "C7" O 984 649 0 0 900
Dr 433 0 0
At STD N 00A8FFFF
Ne 0 ""
Po 883 -7451
$EndPAD
$PAD
Sh "C8" O 984 649 0 0 900
Dr 433 0 0
At STD N 00A8FFFF
Ne 0 ""
Po -116 -7451
$EndPAD
$PAD
Sh "S1" O 649 984 0 0 900
Dr 433 0 0
At STD N 00A8FFFF
Ne 0 ""
Po -1616 7549
$EndPAD
$PAD
Sh "S2" O 649 984 0 0 900
Dr 433 0 0
At STD N 00A8FFFF
Ne 0 ""
Po -1616 6549
$EndPAD
$EndMODULE smart_card_8_2
$EndLIBRARY
