PCBNEW-LibModule-V1  16.5.2012 18:28:24
# encoding utf-8
$INDEX
pot_desli1
pot_gr1
pot_pq
pot_pq_dual
$EndINDEX
$MODULE pot_gr1
Po 0 0 0 15 4FB3D4B6 00000000 ~~
Li pot_gr1
Sc 00000000
AR
Op 0 0 0
T0 0 -3900 394 394 0 79 N V 21 N "pot_gr1"
T1 0 -1550 394 394 0 79 N I 21 N "VAL**"
DS 1900 2600 1900 1900 150 21
DS -1900 2600 -1900 1900 150 21
DS -3500 1400 -3500 1900 150 21
DS -3500 1900 3400 1900 150 21
DS 3400 1900 3600 1900 150 21
DS 3600 1900 3600 1400 150 21
DS -4300 1400 -4300 -3300 150 21
DS -4300 -3300 4200 -3300 150 21
DS 4200 -3300 4400 -3300 150 21
DS 4400 -3300 4400 1400 150 21
DS 4400 1400 -4300 1400 150 21
DS -1900 3200 1900 3200 150 21
DS 1900 3200 1900 2600 150 21
DS -1900 2600 -1900 3200 150 21
DS -700 6400 -1100 6400 150 21
DS -1100 6400 -1100 3200 150 21
DS -800 6400 1200 6400 150 21
DS 1200 6400 1200 3200 150 21
$PAD
Sh "2" C 1181 1181 0 0 0
Dr 787 0 0
At STD N 00E0FFFF
Ne 0 ""
Po 0 500
$EndPAD
$PAD
Sh "1" C 1181 1181 0 0 0
Dr 787 0 0
At STD N 00E0FFFF
Ne 0 ""
Po -3400 500
$EndPAD
$PAD
Sh "3" C 1181 1181 0 0 0
Dr 787 0 0
At STD N 00E0FFFF
Ne 0 ""
Po 3400 500
$EndPAD
$EndMODULE  pot_gr1
$MODULE pot_desli1
Po 0 0 0 15 4FB3D47C 00000000 ~~
Li pot_desli1
Sc 00000000
AR
Op 0 0 0
T0 0 -2500 394 394 0 79 N V 21 N "pot_desli1"
T1 50 1450 394 394 0 79 N I 21 N "VAL**"
DS 6400 -300 6400 500 150 21
DS 5800 -400 5800 500 150 21
DS 4500 -900 4500 1100 150 21
DS 4500 1100 8000 1100 150 21
DS 8000 1100 8000 -900 150 21
DS 8000 -900 8000 -1000 150 21
DS 8000 -1000 4500 -1000 150 21
DS -10500 -300 -10500 500 150 21
DS -10500 500 10000 500 150 21
DS 10000 500 10000 -300 150 21
DS 10000 -300 10000 -400 150 21
DS 10000 -400 -10500 -400 150 21
DS -13400 -1900 13400 -1900 150 21
DS 13400 -1900 13400 2100 150 21
DS 13400 2100 -13400 2100 150 21
DS -13400 2100 -13400 -1900 150 21
$PAD
Sh "1" C 1181 1181 0 0 0
Dr 591 0 0
At STD N 00E0FFFF
Ne 0 ""
Po -8200 2100
$EndPAD
$PAD
Sh "2" C 1181 1181 0 0 0
Dr 591 0 0
At STD N 00E0FFFF
Ne 0 ""
Po 5800 2100
$EndPAD
$PAD
Sh "3" C 1181 1181 0 0 0
Dr 591 0 0
At STD N 00E0FFFF
Ne 0 ""
Po 7900 2100
$EndPAD
$PAD
Sh "A" C 1220 1220 0 0 0
Dr 1181 0 0
At HOLE N 00F0FFFF
Ne 0 ""
Po -11800 100
$EndPAD
$PAD
Sh "" C 1220 1220 0 0 0
Dr 1181 0 0
At HOLE N 00E0FFFF
Ne 0 ""
Po 11800 100
$EndPAD
$SHAPE3D
Na "Potenciometer\\poten_desliz.wrl"
Sc 2.700000 2.700000 2.700000
Of 0.000000 0.000000 0.000000
Ro 0.000000 0.000000 0.000000
$EndSHAPE3D
$EndMODULE  pot_desli1
$MODULE pot_pq
Po 0 0 0 15 4FB3D514 00000000 ~~
Li pot_pq
Sc 00000000
AR
Op 0 0 0
T0 0 -2350 394 394 0 79 N V 21 N "pot_pq"
T1 0 -850 394 394 0 79 N I 21 N "VAL**"
DS 3000 -1800 -3000 -1800 150 21
DS 3000 1300 -2900 1300 150 21
DS -2900 1300 -3000 1300 150 21
DS -3000 1300 -3000 -1800 150 21
DS 1600 3200 1600 1700 150 21
DS -1600 3200 -1600 1700 150 21
DS -2400 1300 -2400 1700 150 21
DS -2400 1700 2400 1700 150 21
DS 2400 1700 2400 1300 150 21
DS -1500 3200 -1600 3200 150 21
DS -1300 3200 -1300 5500 150 21
DS -1300 5500 1300 5500 150 21
DS 1300 5500 1300 3200 150 21
DS -1500 3200 1600 3200 150 21
DS 3000 1300 3000 -1800 150 21
$PAD
Sh "2" C 1181 1181 0 0 0
Dr 591 0 0
At STD N 00E0FFFF
Ne 0 ""
Po 0 700
$EndPAD
$PAD
Sh "3" C 1181 1181 0 0 0
Dr 591 0 0
At STD N 00E0FFFF
Ne 0 ""
Po 2000 700
$EndPAD
$PAD
Sh "1" C 1181 1181 0 0 0
Dr 591 0 0
At STD N 00E0FFFF
Ne 0 ""
Po -2000 700
$EndPAD
$SHAPE3D
Na "Potenciometer\\pontenc1.wrl"
Sc 1.600000 1.600000 1.600000
Of 0.000000 0.000000 0.000000
Ro 0.000000 0.000000 0.000000
$EndSHAPE3D
$EndMODULE  pot_pq
$MODULE pot_pq_dual
Po 0 0 0 15 4FB3D573 00000000 ~~
Li pot_pq_dual
Sc 00000000
AR
Op 0 0 0
T0 0 -3600 394 394 0 79 N V 21 N "pot_pq_dual"
T1 0 -500 394 394 0 79 N I 21 N "VAL**"
DS 1600 3200 1700 3200 150 21
DS 1700 3200 1700 1800 150 21
DS -1700 3200 -1700 1800 150 21
DS -1500 3200 -1700 3200 150 21
DS -2500 1300 -2500 1800 150 21
DS -2500 1800 2500 1800 150 21
DS 2500 1800 2500 1300 150 21
DS 2900 -3000 -3000 -3000 150 21
DS -2900 1300 -3000 1300 150 21
DS -3000 1300 -3000 -2900 150 21
DS -3000 -2900 -3000 -3000 150 21
DS 3000 1300 -2900 1300 150 21
DS 2900 -3000 3000 -3000 150 21
DS 3000 -3000 3000 -1700 150 21
DS -1300 3200 -1300 5500 150 21
DS -1300 5500 1300 5500 150 21
DS 1300 5500 1300 3200 150 21
DS -1500 3200 1600 3200 150 21
DS 3000 1300 3000 -1800 150 21
$PAD
Sh "2" C 1181 1181 0 0 0
Dr 591 0 0
At STD N 00E0FFFF
Ne 0 ""
Po 0 700
$EndPAD
$PAD
Sh "3" C 1181 1181 0 0 0
Dr 591 0 0
At STD N 00E0FFFF
Ne 0 ""
Po 2000 700
$EndPAD
$PAD
Sh "1" C 1181 1181 0 0 0
Dr 591 0 0
At STD N 00E0FFFF
Ne 0 ""
Po -2000 700
$EndPAD
$PAD
Sh "5" C 1181 1181 0 0 0
Dr 591 0 0
At STD N 00E0FFFF
Ne 0 ""
Po 0 -1700
$EndPAD
$PAD
Sh "4" C 1181 1181 0 0 0
Dr 591 0 0
At STD N 00E0FFFF
Ne 0 ""
Po -2000 -1700
$EndPAD
$PAD
Sh "6" C 1181 1181 0 0 0
Dr 591 0 0
At STD N 00E0FFFF
Ne 0 ""
Po 1900 -1700
$EndPAD
$SHAPE3D
Na "Potenciometer\\pontenc_dual.wrl"
Sc 1.600000 1.600000 1.600000
Of 0.000000 0.000000 0.000000
Ro 0.000000 0.000000 0.000000
$EndSHAPE3D
$EndMODULE  pot_pq_dual
$EndLIBRARY
