PCBNEW-LibModule-V1  16.5.2012 18:21:21
# encoding utf-8
$INDEX
LCD_16x2
LCD_16x2_2
LCD_16x2_3
LCD_16x2_4
LCD_16x4
$EndINDEX
$MODULE LCD_16x2_3
Po 0 0 0 15 4FB3D093 00000000 ~~
Li LCD_16x2_3
Cd Convertido por ToKicad
Kw ToKicad
Sc 00000000
AR
Op 0 0 0
.SolderPasteRatio 4.90315e+239
T0 0 -7480 394 394 0 79 N V 21 N "LCD_16x2_3"
T1 0 0 394 394 0 79 N I 21 N "Value"
DS -11900 4225 -11900 -4025 150 21
DS -11900 -4025 11650 -4025 150 21
DS 11650 -4025 11650 4100 150 21
DS 11650 4100 -11900 4025 150 21
DS -13250 5450 -13250 -5375 150 21
DS -13250 -5375 13125 -5450 150 21
DS 13125 -5450 13125 5450 150 21
DS 13125 5450 -13250 5500 150 21
DS 15575 -6900 15575 6775 150 21
DS 15575 6775 -16050 6775 150 21
DS -16050 6775 -16050 -6975 150 21
DS -15900 -6900 15500 -6950 150 21
$PAD
Sh "16" C 591 591 0 0 0
Dr 400 0 0
At STD N 00E0FFFF
Ne 0 ""
Po -15225 -3500
$EndPAD
$PAD
Sh "15" C 591 591 0 0 0
Dr 400 0 0
At STD N 00E0FFFF
Ne 0 ""
Po -14225 -3500
$EndPAD
$PAD
Sh "" C 1969 1969 0 0 0
Dr 1000 0 0
At STD N 00E0FFFF
Ne 0 ""
Po -14975 5750
$EndPAD
$PAD
Sh "" C 1969 1969 0 0 0
Dr 1000 0 0
At STD N 00E0FFFF
Ne 0 ""
Po 14600 5750
$EndPAD
$PAD
Sh "1" R 591 591 0 0 0
Dr 400 0 0
At STD N 00E0FFFF
Ne 0 ""
Po -14225 3450
$EndPAD
$PAD
Sh "" C 1969 1969 0 0 0
Dr 1000 0 0
At STD N 00E0FFFF
Ne 0 ""
Po 14675 -5900
$EndPAD
$PAD
Sh "" C 1969 1969 0 0 0
Dr 1000 0 0
At STD N 00E0FFFF
Ne 0 ""
Po -15025 -5900
$EndPAD
$PAD
Sh "2" C 591 591 0 0 0
Dr 400 0 0
At STD N 00E0FFFF
Ne 0 ""
Po -15225 3450
$EndPAD
$PAD
Sh "3" C 591 591 0 0 0
Dr 400 0 0
At STD N 00E0FFFF
Ne 0 ""
Po -14225 2475
$EndPAD
$PAD
Sh "4" C 591 591 0 0 0
Dr 400 0 0
At STD N 00E0FFFF
Ne 0 ""
Po -15225 2500
$EndPAD
$PAD
Sh "5" C 591 591 0 0 0
Dr 400 0 0
At STD N 00E0FFFF
Ne 0 ""
Po -14225 1475
$EndPAD
$PAD
Sh "6" C 591 591 0 0 0
Dr 400 0 0
At STD N 00E0FFFF
Ne 0 ""
Po -15225 1475
$EndPAD
$PAD
Sh "7" C 591 591 0 0 0
Dr 400 0 0
At STD N 00E0FFFF
Ne 0 ""
Po -14225 450
$EndPAD
$PAD
Sh "8" C 591 591 0 0 0
Dr 400 0 0
At STD N 00E0FFFF
Ne 0 ""
Po -15225 475
$EndPAD
$PAD
Sh "9" C 591 591 0 0 0
Dr 400 0 0
At STD N 00E0FFFF
Ne 0 ""
Po -14225 -500
$EndPAD
$PAD
Sh "10" C 591 591 0 0 0
Dr 400 0 0
At STD N 00E0FFFF
Ne 0 ""
Po -15225 -475
$EndPAD
$PAD
Sh "11" C 591 591 0 0 0
Dr 400 0 0
At STD N 00E0FFFF
Ne 0 ""
Po -14225 -1475
$EndPAD
$PAD
Sh "12" C 591 591 0 0 0
Dr 400 0 0
At STD N 00E0FFFF
Ne 0 ""
Po -15225 -1475
$EndPAD
$PAD
Sh "13" C 591 591 0 0 0
Dr 400 0 0
At STD N 00E0FFFF
Ne 0 ""
Po -14225 -2475
$EndPAD
$PAD
Sh "14" C 591 591 0 0 0
Dr 400 0 0
At STD N 00E0FFFF
Ne 0 ""
Po -15225 -2475
$EndPAD
$SHAPE3D
Na "LCD\\lcd_16x2_3_gray.wrl"
Sc 2.000000 2.000000 2.000000
Of 0.000000 0.000000 0.000000
Ro 0.000000 0.000000 0.000000
$EndSHAPE3D
$EndMODULE  LCD_16x2_3
$MODULE LCD_16x2
Po 0 0 0 15 4FB3CFB0 00000000 ~~
Li LCD_16x2
Cd Convertido por ToKicad
Kw ToKicad
Sc 00000000
AR LCD_16x2
Op 0 0 0
.SolderPasteRatio 4.90315e+239
T0 0 -8760 394 394 0 79 N V 21 N "LCD_16_x_2"
T1 0 0 394 394 0 79 N I 21 N "LCD_16_x_2"
DS -13880 -6250 14000 -6250 100 21
DS -13880 6130 -13880 -6250 100 21
DS 14000 6130 14000 -6250 100 21
DS -13880 6130 14000 6130 100 21
DS -16500 9250 -16500 -8120 100 21
DS -16500 -8120 16620 -8120 100 21
DS -16500 9250 16620 9250 100 21
DS 16620 9250 16620 -8120 100 21
DS -12000 3500 -12000 -3500 100 21
DS -12000 -3500 12000 -3500 100 21
DS -12000 3500 12000 3500 100 21
DS 12000 3500 12000 -3500 100 21
$PAD
Sh "15" O 591 800 0 0 0
Dr 400 0 0
At STD N 00E0FFFF
Ne 0 ""
Po 2500 8250
$EndPAD
$PAD
Sh "16" O 591 800 0 0 0
Dr 400 0 0
At STD N 00E0FFFF
Ne 0 ""
Po 1500 8250
$EndPAD
$PAD
Sh "" C 1969 1969 0 0 0
Dr 1000 0 0
At STD N 00E0FFFF
Ne 0 ""
Po -14880 7630
$EndPAD
$PAD
Sh "" C 1969 1969 0 0 0
Dr 1000 0 0
At STD N 00E0FFFF
Ne 0 ""
Po 15000 7630
$EndPAD
$PAD
Sh "14" O 591 787 0 0 0
Dr 400 0 0
At STD N 00E0FFFF
Ne 0 ""
Po -12500 8250
$EndPAD
$PAD
Sh "" C 1969 1969 0 0 0
Dr 1000 0 0
At STD N 00E0FFFF
Ne 0 ""
Po 15870 -6370
$EndPAD
$PAD
Sh "" C 1969 1969 0 0 0
Dr 1000 0 0
At STD N 00E0FFFF
Ne 0 ""
Po -15750 -6370
$EndPAD
$PAD
Sh "13" O 591 787 0 0 0
Dr 400 0 0
At STD N 00E0FFFF
Ne 0 ""
Po -11500 8250
$EndPAD
$PAD
Sh "12" O 591 800 0 0 0
Dr 400 0 0
At STD N 00E0FFFF
Ne 0 ""
Po -10500 8250
$EndPAD
$PAD
Sh "11" O 591 800 0 0 0
Dr 400 0 0
At STD N 00E0FFFF
Ne 0 ""
Po -9500 8250
$EndPAD
$PAD
Sh "10" O 591 800 0 0 0
Dr 400 0 0
At STD N 00E0FFFF
Ne 0 ""
Po -8500 8250
$EndPAD
$PAD
Sh "9" O 591 800 0 0 0
Dr 400 0 0
At STD N 00E0FFFF
Ne 0 ""
Po -7500 8250
$EndPAD
$PAD
Sh "8" O 591 800 0 0 0
Dr 400 0 0
At STD N 00E0FFFF
Ne 0 ""
Po -6500 8250
$EndPAD
$PAD
Sh "7" O 591 800 0 0 0
Dr 400 0 0
At STD N 00E0FFFF
Ne 0 ""
Po -5500 8250
$EndPAD
$PAD
Sh "6" O 591 800 0 0 0
Dr 400 0 0
At STD N 00E0FFFF
Ne 0 ""
Po -4500 8250
$EndPAD
$PAD
Sh "5" O 591 800 0 0 0
Dr 400 0 0
At STD N 00E0FFFF
Ne 0 ""
Po -3500 8250
$EndPAD
$PAD
Sh "4" O 591 800 0 0 0
Dr 400 0 0
At STD N 00E0FFFF
Ne 0 ""
Po -2500 8250
$EndPAD
$PAD
Sh "3" O 591 800 0 0 0
Dr 400 0 0
At STD N 00E0FFFF
Ne 0 ""
Po -1500 8250
$EndPAD
$PAD
Sh "2" O 591 800 0 0 0
Dr 400 0 0
At STD N 00E0FFFF
Ne 0 ""
Po -500 8250
$EndPAD
$PAD
Sh "1" R 591 800 0 0 0
Dr 400 0 0
At STD N 00E0FFFF
Ne 0 ""
Po 500 8250
$EndPAD
$SHAPE3D
Na "LCD\\lcd_16x2_h1_blue.wrl"
Sc 2.000000 2.000000 2.000000
Of 0.000000 0.000000 0.000000
Ro 0.000000 0.000000 0.000000
$EndSHAPE3D
$EndMODULE  LCD_16x2
$MODULE LCD_16x2_2
Po 0 0 0 15 4FB3D009 00000000 ~~
Li LCD_16x2_2
Cd Convertido por ToKicad
Kw ToKicad
Sc 00000000
AR
Op 0 0 0
.SolderPasteRatio 4.90315e+239
T0 0 -7579 394 394 0 79 N V 21 N "LCD_16_x_2_2"
T1 0 0 394 394 0 79 N I 21 N "Value"
DS -11300 4100 -11300 -3450 150 21
DS -11300 -3450 12450 -3500 150 21
DS 12450 -3500 12450 4050 150 21
DS 12450 4050 -11250 4100 150 21
DS 13550 5200 -12500 5200 150 21
DS -12500 5200 -12500 5050 150 21
DS -12500 4950 -12500 -4550 150 21
DS -12500 -4550 13550 -4550 150 21
DS 13550 -4550 13550 5200 150 21
DS -15500 6800 16000 6850 150 21
DS 16000 6850 16000 -7000 150 21
DS 16000 -7000 -15450 -6950 150 21
DS -15450 -6950 -15450 6900 150 21
$PAD
Sh "16" O 591 800 0 0 0
Dr 400 0 0
At STD N 00E0FFFF
Ne 0 ""
Po 2500 -5950
$EndPAD
$PAD
Sh "15" O 591 800 0 0 0
Dr 400 0 0
At STD N 00E0FFFF
Ne 0 ""
Po 1500 -5950
$EndPAD
$PAD
Sh "" C 1969 1969 0 0 0
Dr 1000 0 0
At STD N 00E0FFFF
Ne 0 ""
Po -14450 5900
$EndPAD
$PAD
Sh "" C 1969 1969 0 0 0
Dr 1000 0 0
At STD N 00E0FFFF
Ne 0 ""
Po 15000 5900
$EndPAD
$PAD
Sh "1" R 591 787 0 0 0
Dr 400 0 0
At STD N 00E0FFFF
Ne 0 ""
Po -12500 -5950
$EndPAD
$PAD
Sh "" C 1969 1969 0 0 0
Dr 1000 0 0
At STD N 00E0FFFF
Ne 0 ""
Po 15150 -6050
$EndPAD
$PAD
Sh "" C 1969 1969 0 0 0
Dr 1000 0 0
At STD N 00E0FFFF
Ne 0 ""
Po -14600 -6000
$EndPAD
$PAD
Sh "2" O 591 787 0 0 0
Dr 400 0 0
At STD N 00E0FFFF
Ne 0 ""
Po -11500 -5950
$EndPAD
$PAD
Sh "3" O 591 800 0 0 0
Dr 400 0 0
At STD N 00E0FFFF
Ne 0 ""
Po -10500 -5950
$EndPAD
$PAD
Sh "4" O 591 800 0 0 0
Dr 400 0 0
At STD N 00E0FFFF
Ne 0 ""
Po -9500 -5950
$EndPAD
$PAD
Sh "5" O 591 800 0 0 0
Dr 400 0 0
At STD N 00E0FFFF
Ne 0 ""
Po -8500 -5950
$EndPAD
$PAD
Sh "6" O 591 800 0 0 0
Dr 400 0 0
At STD N 00E0FFFF
Ne 0 ""
Po -7500 -5950
$EndPAD
$PAD
Sh "7" O 591 800 0 0 0
Dr 400 0 0
At STD N 00E0FFFF
Ne 0 ""
Po -6500 -5950
$EndPAD
$PAD
Sh "8" O 591 800 0 0 0
Dr 400 0 0
At STD N 00E0FFFF
Ne 0 ""
Po -5500 -5950
$EndPAD
$PAD
Sh "9" O 591 800 0 0 0
Dr 400 0 0
At STD N 00E0FFFF
Ne 0 ""
Po -4500 -5950
$EndPAD
$PAD
Sh "10" O 591 800 0 0 0
Dr 400 0 0
At STD N 00E0FFFF
Ne 0 ""
Po -3500 -5950
$EndPAD
$PAD
Sh "11" O 591 800 0 0 0
Dr 400 0 0
At STD N 00E0FFFF
Ne 0 ""
Po -2500 -5950
$EndPAD
$PAD
Sh "12" O 591 800 0 0 0
Dr 400 0 0
At STD N 00E0FFFF
Ne 0 ""
Po -1500 -5950
$EndPAD
$PAD
Sh "13" O 591 800 0 0 0
Dr 400 0 0
At STD N 00E0FFFF
Ne 0 ""
Po -500 -5950
$EndPAD
$PAD
Sh "14" O 591 800 0 0 0
Dr 400 0 0
At STD N 00E0FFFF
Ne 0 ""
Po 500 -5950
$EndPAD
$SHAPE3D
Na "LCD\\lcd_16x2_h2_blue.wrl"
Sc 2.000000 2.000000 2.000000
Of 0.000000 0.000000 0.000000
Ro 0.000000 0.000000 0.000000
$EndSHAPE3D
$EndMODULE  LCD_16x2_2
$MODULE LCD_16x2_4
Po 0 0 0 15 4FB3D2B0 00000000 ~~
Li LCD_16x2_4
Cd Convertido por ToKicad
Kw ToKicad
Sc 00000000
AR
Op 0 0 0
.SolderPasteRatio 6.93371e-310
T0 0 -7874 394 394 0 79 N V 21 N "LCD_16x2_4"
T1 0 0 394 394 0 79 N I 21 N "Value"
DS -14600 4025 -14600 -4150 150 21
DS -14600 -4150 15750 -4150 150 21
DS 15750 -4150 15750 3975 150 21
DS 15750 3975 -14600 3975 150 21
DS -15800 -5950 17025 -5950 150 21
DS 17025 -5950 17025 5950 150 21
DS 17025 5950 -15800 6025 150 21
DS -15800 6025 -15800 -5950 150 21
DS -22400 0 -22400 -7300 150 21
DS -22400 -7300 23300 -7225 150 21
DS 23300 -7225 23300 7300 150 21
DS 23300 7300 -22450 7225 150 21
DS -22450 7225 -22450 -75 150 21
$PAD
Sh "16" C 591 591 0 0 0
Dr 400 0 0
At STD N 00E0FFFF
Ne 0 ""
Po -20725 -3500
$EndPAD
$PAD
Sh "15" C 591 591 0 0 0
Dr 400 0 0
At STD N 00E0FFFF
Ne 0 ""
Po -19725 -3500
$EndPAD
$PAD
Sh "" C 1969 1969 0 0 0
Dr 1000 0 0
At STD N 00E0FFFF
Ne 0 ""
Po -20475 5750
$EndPAD
$PAD
Sh "" C 1969 1969 0 0 0
Dr 1000 0 0
At STD N 00E0FFFF
Ne 0 ""
Po 21825 5700
$EndPAD
$PAD
Sh "1" R 591 591 0 0 0
Dr 400 0 0
At STD N 00E0FFFF
Ne 0 ""
Po -19725 3450
$EndPAD
$PAD
Sh "" C 1969 1969 0 0 0
Dr 1000 0 0
At STD N 00E0FFFF
Ne 0 ""
Po 21825 -5750
$EndPAD
$PAD
Sh "" C 1969 1969 0 0 0
Dr 1000 0 0
At STD N 00E0FFFF
Ne 0 ""
Po -20475 -5750
$EndPAD
$PAD
Sh "2" C 591 591 0 0 0
Dr 400 0 0
At STD N 00E0FFFF
Ne 0 ""
Po -20725 3450
$EndPAD
$PAD
Sh "3" C 591 591 0 0 0
Dr 400 0 0
At STD N 00E0FFFF
Ne 0 ""
Po -19725 2475
$EndPAD
$PAD
Sh "4" C 591 591 0 0 0
Dr 400 0 0
At STD N 00E0FFFF
Ne 0 ""
Po -20725 2500
$EndPAD
$PAD
Sh "5" C 591 591 0 0 0
Dr 400 0 0
At STD N 00E0FFFF
Ne 0 ""
Po -19725 1475
$EndPAD
$PAD
Sh "6" C 591 591 0 0 0
Dr 400 0 0
At STD N 00E0FFFF
Ne 0 ""
Po -20725 1475
$EndPAD
$PAD
Sh "7" C 591 591 0 0 0
Dr 400 0 0
At STD N 00E0FFFF
Ne 0 ""
Po -19725 450
$EndPAD
$PAD
Sh "8" C 591 591 0 0 0
Dr 400 0 0
At STD N 00E0FFFF
Ne 0 ""
Po -20725 475
$EndPAD
$PAD
Sh "9" C 591 591 0 0 0
Dr 400 0 0
At STD N 00E0FFFF
Ne 0 ""
Po -19725 -500
$EndPAD
$PAD
Sh "10" C 591 591 0 0 0
Dr 400 0 0
At STD N 00E0FFFF
Ne 0 ""
Po -20725 -475
$EndPAD
$PAD
Sh "11" C 591 591 0 0 0
Dr 400 0 0
At STD N 00E0FFFF
Ne 0 ""
Po -19725 -1475
$EndPAD
$PAD
Sh "12" C 591 591 0 0 0
Dr 400 0 0
At STD N 00E0FFFF
Ne 0 ""
Po -20725 -1475
$EndPAD
$PAD
Sh "13" C 591 591 0 0 0
Dr 400 0 0
At STD N 00E0FFFF
Ne 0 ""
Po -19725 -2475
$EndPAD
$PAD
Sh "14" C 591 591 0 0 0
Dr 400 0 0
At STD N 00E0FFFF
Ne 0 ""
Po -20725 -2475
$EndPAD
$SHAPE3D
Na "LCD\\lcd_16x2_gray.wrl"
Sc 2.000000 2.000000 2.000000
Of 0.000000 0.000000 0.000000
Ro 0.000000 0.000000 0.000000
$EndSHAPE3D
$EndMODULE  LCD_16x2_4
$MODULE LCD_16x4
Po 0 0 0 15 4FB3D3E4 00000000 ~~
Li LCD_16x4
Cd Convertido por ToKicad
Kw ToKicad
Sc 00000000
AR 
Op 0 0 0
T0 0 -13650 394 394 0 79 N V 21 N "LCD_16_x_4"
T1 0 0 394 394 0 79 N I 21 N "Value"
DS -15050 5650 15150 5650 150 21
DS 15150 5650 15150 5600 150 21
DS 15150 -7100 -15050 -7100 150 21
DS -15050 -7100 -15050 -7050 150 21
DS 15150 5600 15150 5550 150 21
DS -18850 11900 19450 11900 150 21
DS 19450 11900 19450 11800 150 21
DS -18850 -12900 19450 -12900 150 21
DS 19450 -12900 19450 -12800 150 21
DS 18000 -9100 -17800 -9100 150 21
DS -15050 5650 -15050 -7050 150 21
DS 15150 -7100 15150 5550 150 21
DS 18050 -9100 18050 7600 150 21
DS 18050 7600 -17800 7600 150 21
DS -17800 7600 -17800 -9100 150 21
DS 19450 -12800 19450 11800 150 21
DS -18850 11900 -18850 -12900 150 21
$PAD
Sh "16" O 591 800 0 0 0
Dr 400 0 0
At STD N 00E0FFFF
Ne 0 ""
Po 250 -11950
$EndPAD
$PAD
Sh "15" O 591 800 0 0 0
Dr 400 0 0
At STD N 00E0FFFF
Ne 0 ""
Po -750 -11950
$EndPAD
$PAD
Sh "" C 1969 1969 0 0 0
Dr 1000 0 0
At STD N 00E0FFFF
Ne 0 ""
Po -17550 10600
$EndPAD
$PAD
Sh "" C 1969 1969 0 0 0
Dr 1000 0 0
At STD N 00E0FFFF
Ne 0 ""
Po 18350 10650
$EndPAD
$PAD
Sh "1" R 591 787 0 0 0
Dr 400 0 0
At STD N 00E0FFFF
Ne 0 ""
Po -14750 -11950
$EndPAD
$PAD
Sh "" C 1969 1969 0 0 0
Dr 1000 0 0
At STD N 00E0FFFF
Ne 0 ""
Po 18300 -11600
$EndPAD
$PAD
Sh "" C 1969 1969 0 0 0
Dr 1000 0 0
At STD N 00E0FFFF
Ne 0 ""
Po -17800 -11700
$EndPAD
$PAD
Sh "2" O 591 787 0 0 0
Dr 400 0 0
At STD N 00E0FFFF
Ne 0 ""
Po -13750 -11950
$EndPAD
$PAD
Sh "3" O 591 800 0 0 0
Dr 400 0 0
At STD N 00E0FFFF
Ne 0 ""
Po -12750 -11950
$EndPAD
$PAD
Sh "4" O 591 800 0 0 0
Dr 400 0 0
At STD N 00E0FFFF
Ne 0 ""
Po -11750 -11950
$EndPAD
$PAD
Sh "5" O 591 800 0 0 0
Dr 400 0 0
At STD N 00E0FFFF
Ne 0 ""
Po -10750 -11950
$EndPAD
$PAD
Sh "6" O 591 800 0 0 0
Dr 400 0 0
At STD N 00E0FFFF
Ne 0 ""
Po -9750 -11950
$EndPAD
$PAD
Sh "7" O 591 800 0 0 0
Dr 400 0 0
At STD N 00E0FFFF
Ne 0 ""
Po -8750 -11950
$EndPAD
$PAD
Sh "8" O 591 800 0 0 0
Dr 400 0 0
At STD N 00E0FFFF
Ne 0 ""
Po -7750 -11950
$EndPAD
$PAD
Sh "9" O 591 800 0 0 0
Dr 400 0 0
At STD N 00E0FFFF
Ne 0 ""
Po -6750 -11950
$EndPAD
$PAD
Sh "10" O 591 800 0 0 0
Dr 400 0 0
At STD N 00E0FFFF
Ne 0 ""
Po -5750 -11950
$EndPAD
$PAD
Sh "11" O 591 800 0 0 0
Dr 400 0 0
At STD N 00E0FFFF
Ne 0 ""
Po -4750 -11950
$EndPAD
$PAD
Sh "12" O 591 800 0 0 0
Dr 400 0 0
At STD N 00E0FFFF
Ne 0 ""
Po -3750 -11950
$EndPAD
$PAD
Sh "13" O 591 800 0 0 0
Dr 400 0 0
At STD N 00E0FFFF
Ne 0 ""
Po -2750 -11950
$EndPAD
$PAD
Sh "14" O 591 800 0 0 0
Dr 400 0 0
At STD N 00E0FFFF
Ne 0 ""
Po -1750 -11950
$EndPAD
$SHAPE3D
Na "LCD\\lcd_16x4_h1_blue.wrl"
Sc 2.000000 2.000000 2.000000
Of 0.000000 0.000000 0.000000
Ro 0.000000 0.000000 0.000000
$EndSHAPE3D
$EndMODULE  LCD_16x4
$EndLIBRARY
