PCBNEW-LibModule-V1  St 20. červen 2012, 17:59:41 CEST
# encoding utf-8
Units deci-mils
$INDEX
4003APG120
$EndINDEX
$MODULE 4003APG120
Po 0 0 0 15 4FE1F357 00000000 ~~
Li 4003APG120
Cd Support PGA 120 pins
Kw PGA
Sc 0
AR /322D32FA
Op 0 0 0
T0 0 -7000 393 393 0 78 N V 21 N "4003APG120"
T1 0 0 392 392 0 77 N I 21 N "Value"
DS 6500 6000 6000 6500 120 21
DS 6500 6000 6500 -6500 120 21
DS 6500 -6500 -6500 -6500 120 21
DS -6500 -6500 -6500 6500 120 21
DS -6500 6500 6000 6500 120 21
$PAD
Sh "N1" C 550 550 0 0 0
Dr 310 0 0
At STD N 00E0FFFF
Ne 0 ""
Po 6000 -6000
$EndPAD
$PAD
Sh "N2" C 550 550 0 0 0
Dr 310 0 0
At STD N 00E0FFFF
Ne 15 "/D0"
Po 5000 -6000
$EndPAD
$PAD
Sh "N3" C 550 550 0 0 0
Dr 310 0 0
At STD N 00E0FFFF
Ne 0 ""
Po 4000 -6000
$EndPAD
$PAD
Sh "M1" C 550 550 0 0 0
Dr 310 0 0
At STD N 00E0FFFF
Ne 0 ""
Po 6000 -5000
$EndPAD
$PAD
Sh "M2" C 550 550 0 0 0
Dr 310 0 0
At STD N 00E0FFFF
Ne 0 ""
Po 5000 -5000
$EndPAD
$PAD
Sh "M3" C 550 550 0 0 0
Dr 310 0 0
At STD N 00E0FFFF
Ne 26 "/LED1"
Po 4000 -5000
$EndPAD
$PAD
Sh "L1" C 550 550 0 0 0
Dr 310 0 0
At STD N 00E0FFFF
Ne 76 "N-000145"
Po 6000 -4000
$EndPAD
$PAD
Sh "L2" C 550 550 0 0 0
Dr 310 0 0
At STD N 00E0FFFF
Ne 70 "/SEL_LPT"
Po 5000 -4000
$EndPAD
$PAD
Sh "L3" C 550 550 0 0 0
Dr 310 0 0
At STD N 00E0FFFF
Ne 77 "VCC"
Po 4000 -4000
$EndPAD
$PAD
Sh "K1" C 550 550 0 0 0
Dr 310 0 0
At STD N 00E0FFFF
Ne 1 "/8MH-OUT"
Po 6000 -3000
$EndPAD
$PAD
Sh "K2" C 550 550 0 0 0
Dr 310 0 0
At STD N 00E0FFFF
Ne 58 "/PC-A3"
Po 5000 -3000
$EndPAD
$PAD
Sh "K3" C 550 550 0 0 0
Dr 310 0 0
At STD N 00E0FFFF
Ne 75 "GND"
Po 4000 -3000
$EndPAD
$PAD
Sh "J1" C 550 550 0 0 0
Dr 310 0 0
At STD N 00E0FFFF
Ne 61 "/PC-A6"
Po 6000 -2000
$EndPAD
$PAD
Sh "J2" C 550 550 0 0 0
Dr 310 0 0
At STD N 00E0FFFF
Ne 60 "/PC-A5"
Po 5000 -2000
$EndPAD
$PAD
Sh "J3" C 550 550 0 0 0
Dr 310 0 0
At STD N 00E0FFFF
Ne 0 ""
Po 4000 -2000
$EndPAD
$PAD
Sh "H1" C 550 550 0 0 0
Dr 310 0 0
At STD N 00E0FFFF
Ne 63 "/PC-A8"
Po 6000 -1000
$EndPAD
$PAD
Sh "H2" C 550 550 0 0 0
Dr 310 0 0
At STD N 00E0FFFF
Ne 62 "/PC-A7"
Po 5000 -1000
$EndPAD
$PAD
Sh "H3" C 550 550 0 0 0
Dr 310 0 0
At STD N 00E0FFFF
Ne 59 "/PC-A4"
Po 4000 -1000
$EndPAD
$PAD
Sh "G1" C 550 550 0 0 0
Dr 310 0 0
At STD N 00E0FFFF
Ne 43 "/MA8"
Po 6000 0
$EndPAD
$PAD
Sh "G2" C 550 550 0 0 0
Dr 310 0 0
At STD N 00E0FFFF
Ne 75 "GND"
Po 5000 0
$EndPAD
$PAD
Sh "G3" C 550 550 0 0 0
Dr 310 0 0
At STD N 00E0FFFF
Ne 0 ""
Po 4000 0
$EndPAD
$PAD
Sh "F1" C 550 550 0 0 0
Dr 310 0 0
At STD N 00E0FFFF
Ne 35 "/MA15"
Po 6000 1000
$EndPAD
$PAD
Sh "F2" C 550 550 0 0 0
Dr 310 0 0
At STD N 00E0FFFF
Ne 41 "/MA6"
Po 5000 1000
$EndPAD
$PAD
Sh "F3" C 550 550 0 0 0
Dr 310 0 0
At STD N 00E0FFFF
Ne 32 "/MA12"
Po 4000 1000
$EndPAD
$PAD
Sh "E1" C 550 550 0 0 0
Dr 310 0 0
At STD N 00E0FFFF
Ne 39 "/MA4"
Po 6000 2000
$EndPAD
$PAD
Sh "E2" C 550 550 0 0 0
Dr 310 0 0
At STD N 00E0FFFF
Ne 0 ""
Po 5000 2000
$EndPAD
$PAD
Sh "E3" C 550 550 0 0 0
Dr 310 0 0
At STD N 00E0FFFF
Ne 0 ""
Po 4000 2000
$EndPAD
$PAD
Sh "D1" C 550 550 0 0 0
Dr 310 0 0
At STD N 00E0FFFF
Ne 34 "/MA14"
Po 6000 3000
$EndPAD
$PAD
Sh "D2" C 550 550 0 0 0
Dr 310 0 0
At STD N 00E0FFFF
Ne 31 "/MA11"
Po 5000 3000
$EndPAD
$PAD
Sh "D3" C 550 550 0 0 0
Dr 310 0 0
At STD N 00E0FFFF
Ne 37 "/MA2"
Po 4000 3000
$EndPAD
$PAD
Sh "C1" C 550 550 0 0 0
Dr 310 0 0
At STD N 00E0FFFF
Ne 33 "/MA13"
Po 6000 4000
$EndPAD
$PAD
Sh "C2" C 550 550 0 0 0
Dr 310 0 0
At STD N 00E0FFFF
Ne 38 "/MA3"
Po 5000 4000
$EndPAD
$PAD
Sh "C3" C 550 550 0 0 0
Dr 310 0 0
At STD N 00E0FFFF
Ne 77 "VCC"
Po 4000 4000
$EndPAD
$PAD
Sh "C4" C 550 550 0 0 0
Dr 310 0 0
At STD N 00E0FFFF
Ne 75 "GND"
Po 3000 4000
$EndPAD
$PAD
Sh "C5" C 550 550 0 0 0
Dr 310 0 0
At STD N 00E0FFFF
Ne 0 ""
Po 2000 4000
$EndPAD
$PAD
Sh "C6" C 550 550 0 0 0
Dr 310 0 0
At STD N 00E0FFFF
Ne 45 "/MD0"
Po 1000 4000
$EndPAD
$PAD
Sh "C7" C 550 550 0 0 0
Dr 310 0 0
At STD N 00E0FFFF
Ne 0 ""
Po 0 4000
$EndPAD
$PAD
Sh "C8" C 550 550 0 0 0
Dr 310 0 0
At STD N 00E0FFFF
Ne 36 "/MA16"
Po -1000 4000
$EndPAD
$PAD
Sh "C9" C 550 550 0 0 0
Dr 310 0 0
At STD N 00E0FFFF
Ne 30 "/MA10"
Po -2000 4000
$EndPAD
$PAD
Sh "C10" C 550 550 0 0 0
Dr 310 0 0
At STD N 00E0FFFF
Ne 75 "GND"
Po -3000 4000
$EndPAD
$PAD
Sh "C11" C 550 550 0 0 0
Dr 310 0 0
At STD N 00E0FFFF
Ne 77 "VCC"
Po -4000 4000
$EndPAD
$PAD
Sh "C12" C 550 550 0 0 0
Dr 310 0 0
At STD N 00E0FFFF
Ne 3 "/AUTOFD-"
Po -5000 4000
$EndPAD
$PAD
Sh "C13" C 550 550 0 0 0
Dr 310 0 0
At STD N 00E0FFFF
Ne 40 "/MA5"
Po -6000 4000
$EndPAD
$PAD
Sh "B1" C 550 550 0 0 0
Dr 310 0 0
At STD N 00E0FFFF
Ne 0 ""
Po 6000 5000
$EndPAD
$PAD
Sh "B2" C 550 550 0 0 0
Dr 310 0 0
At STD N 00E0FFFF
Ne 29 "/MA1"
Po 5000 5000
$EndPAD
$PAD
Sh "B3" C 550 550 0 0 0
Dr 310 0 0
At STD N 00E0FFFF
Ne 42 "/MA7"
Po 4000 5000
$EndPAD
$PAD
Sh "B4" C 550 550 0 0 0
Dr 310 0 0
At STD N 00E0FFFF
Ne 0 ""
Po 3000 5000
$EndPAD
$PAD
Sh "B5" C 550 550 0 0 0
Dr 310 0 0
At STD N 00E0FFFF
Ne 0 ""
Po 2000 5000
$EndPAD
$PAD
Sh "B6" C 550 550 0 0 0
Dr 310 0 0
At STD N 00E0FFFF
Ne 47 "/MD2"
Po 1000 5000
$EndPAD
$PAD
Sh "B7" C 550 550 0 0 0
Dr 310 0 0
At STD N 00E0FFFF
Ne 75 "GND"
Po 0 5000
$EndPAD
$PAD
Sh "B8" C 550 550 0 0 0
Dr 310 0 0
At STD N 00E0FFFF
Ne 52 "/MD7"
Po -1000 5000
$EndPAD
$PAD
Sh "B9" C 550 550 0 0 0
Dr 310 0 0
At STD N 00E0FFFF
Ne 53 "/OE-"
Po -2000 5000
$EndPAD
$PAD
Sh "B10" C 550 550 0 0 0
Dr 310 0 0
At STD N 00E0FFFF
Ne 0 ""
Po -3000 5000
$EndPAD
$PAD
Sh "B11" C 550 550 0 0 0
Dr 310 0 0
At STD N 00E0FFFF
Ne 77 "VCC"
Po -4000 5000
$EndPAD
$PAD
Sh "B12" C 550 550 0 0 0
Dr 310 0 0
At STD N 00E0FFFF
Ne 77 "VCC"
Po -5000 5000
$EndPAD
$PAD
Sh "B13" C 550 550 0 0 0
Dr 310 0 0
At STD N 00E0FFFF
Ne 0 ""
Po -6000 5000
$EndPAD
$PAD
Sh "A1" R 550 550 0 0 0
Dr 310 0 0
At STD N 00E0FFFF
Ne 0 ""
Po 6000 6000
$EndPAD
$PAD
Sh "A2" C 550 550 0 0 0
Dr 310 0 0
At STD N 00E0FFFF
Ne 0 ""
Po 5000 6000
$EndPAD
$PAD
Sh "A3" C 550 550 0 0 0
Dr 310 0 0
At STD N 00E0FFFF
Ne 0 ""
Po 4000 6000
$EndPAD
$PAD
Sh "A4" C 550 550 0 0 0
Dr 310 0 0
At STD N 00E0FFFF
Ne 44 "/MA9"
Po 3000 6000
$EndPAD
$PAD
Sh "A5" C 550 550 0 0 0
Dr 310 0 0
At STD N 00E0FFFF
Ne 46 "/MD1"
Po 2000 6000
$EndPAD
$PAD
Sh "A6" C 550 550 0 0 0
Dr 310 0 0
At STD N 00E0FFFF
Ne 48 "/MD3"
Po 1000 6000
$EndPAD
$PAD
Sh "A7" C 550 550 0 0 0
Dr 310 0 0
At STD N 00E0FFFF
Ne 49 "/MD4"
Po 0 6000
$EndPAD
$PAD
Sh "A8" C 550 550 0 0 0
Dr 310 0 0
At STD N 00E0FFFF
Ne 50 "/MD5"
Po -1000 6000
$EndPAD
$PAD
Sh "A9" C 550 550 0 0 0
Dr 310 0 0
At STD N 00E0FFFF
Ne 51 "/MD6"
Po -2000 6000
$EndPAD
$PAD
Sh "A10" C 550 550 0 0 0
Dr 310 0 0
At STD N 00E0FFFF
Ne 14 "/CS1-"
Po -3000 6000
$EndPAD
$PAD
Sh "A11" C 550 550 0 0 0
Dr 310 0 0
At STD N 00E0FFFF
Ne 28 "/MA0"
Po -4000 6000
$EndPAD
$PAD
Sh "A12" C 550 550 0 0 0
Dr 310 0 0
At STD N 00E0FFFF
Ne 73 "/STROBE"
Po -5000 6000
$EndPAD
$PAD
Sh "A13" C 550 550 0 0 0
Dr 310 0 0
At STD N 00E0FFFF
Ne 74 "/WR-"
Po -6000 6000
$EndPAD
$PAD
Sh "N4" C 550 550 0 0 0
Dr 310 0 0
At STD N 00E0FFFF
Ne 55 "/PC-A1"
Po 3000 -6000
$EndPAD
$PAD
Sh "N5" C 550 550 0 0 0
Dr 310 0 0
At STD N 00E0FFFF
Ne 0 ""
Po 2000 -6000
$EndPAD
$PAD
Sh "N6" C 550 550 0 0 0
Dr 310 0 0
At STD N 00E0FFFF
Ne 67 "/PC-WR"
Po 1000 -6000
$EndPAD
$PAD
Sh "N7" C 550 550 0 0 0
Dr 310 0 0
At STD N 00E0FFFF
Ne 64 "/PC-A9"
Po 0 -6000
$EndPAD
$PAD
Sh "N8" C 550 550 0 0 0
Dr 310 0 0
At STD N 00E0FFFF
Ne 16 "/D1"
Po -1000 -6000
$EndPAD
$PAD
Sh "N9" C 550 550 0 0 0
Dr 310 0 0
At STD N 00E0FFFF
Ne 17 "/D2"
Po -2000 -6000
$EndPAD
$PAD
Sh "N10" C 550 550 0 0 0
Dr 310 0 0
At STD N 00E0FFFF
Ne 65 "/PC-AEN"
Po -3000 -6000
$EndPAD
$PAD
Sh "N11" C 550 550 0 0 0
Dr 310 0 0
At STD N 00E0FFFF
Ne 20 "/D5"
Po -4000 -6000
$EndPAD
$PAD
Sh "N12" C 550 550 0 0 0
Dr 310 0 0
At STD N 00E0FFFF
Ne 0 ""
Po -5000 -6000
$EndPAD
$PAD
Sh "N13" C 550 550 0 0 0
Dr 310 0 0
At STD N 00E0FFFF
Ne 71 "/SLCT+"
Po -6000 -6000
$EndPAD
$PAD
Sh "M4" C 550 550 0 0 0
Dr 310 0 0
At STD N 00E0FFFF
Ne 13 "/CLKLCA"
Po 3000 -5000
$EndPAD
$PAD
Sh "M5" C 550 550 0 0 0
Dr 310 0 0
At STD N 00E0FFFF
Ne 57 "/PC-A2"
Po 2000 -5000
$EndPAD
$PAD
Sh "M6" C 550 550 0 0 0
Dr 310 0 0
At STD N 00E0FFFF
Ne 54 "/PC-A0"
Po 1000 -5000
$EndPAD
$PAD
Sh "M7" C 550 550 0 0 0
Dr 310 0 0
At STD N 00E0FFFF
Ne 77 "VCC"
Po 0 -5000
$EndPAD
$PAD
Sh "M8" C 550 550 0 0 0
Dr 310 0 0
At STD N 00E0FFFF
Ne 66 "/PC-RD"
Po -1000 -5000
$EndPAD
$PAD
Sh "M9" C 550 550 0 0 0
Dr 310 0 0
At STD N 00E0FFFF
Ne 18 "/D3"
Po -2000 -5000
$EndPAD
$PAD
Sh "M10" C 550 550 0 0 0
Dr 310 0 0
At STD N 00E0FFFF
Ne 19 "/D4"
Po -3000 -5000
$EndPAD
$PAD
Sh "M11" C 550 550 0 0 0
Dr 310 0 0
At STD N 00E0FFFF
Ne 21 "/D6"
Po -4000 -5000
$EndPAD
$PAD
Sh "M12" C 550 550 0 0 0
Dr 310 0 0
At STD N 00E0FFFF
Ne 69 "/PROG-"
Po -5000 -5000
$EndPAD
$PAD
Sh "M13" C 550 550 0 0 0
Dr 310 0 0
At STD N 00E0FFFF
Ne 0 ""
Po -6000 -5000
$EndPAD
$PAD
Sh "L4" C 550 550 0 0 0
Dr 310 0 0
At STD N 00E0FFFF
Ne 13 "/CLKLCA"
Po 3000 -4000
$EndPAD
$PAD
Sh "L5" C 550 550 0 0 0
Dr 310 0 0
At STD N 00E0FFFF
Ne 0 ""
Po 2000 -4000
$EndPAD
$PAD
Sh "L6" C 550 550 0 0 0
Dr 310 0 0
At STD N 00E0FFFF
Ne 0 ""
Po 1000 -4000
$EndPAD
$PAD
Sh "L7" C 550 550 0 0 0
Dr 310 0 0
At STD N 00E0FFFF
Ne 75 "GND"
Po 0 -4000
$EndPAD
$PAD
Sh "L8" C 550 550 0 0 0
Dr 310 0 0
At STD N 00E0FFFF
Ne 56 "/PC-A10"
Po -1000 -4000
$EndPAD
$PAD
Sh "L9" C 550 550 0 0 0
Dr 310 0 0
At STD N 00E0FFFF
Ne 0 ""
Po -2000 -4000
$EndPAD
$PAD
Sh "L10" C 550 550 0 0 0
Dr 310 0 0
At STD N 00E0FFFF
Ne 77 "VCC"
Po -3000 -4000
$EndPAD
$PAD
Sh "L11" C 550 550 0 0 0
Dr 310 0 0
At STD N 00E0FFFF
Ne 23 "/DONE"
Po -4000 -4000
$EndPAD
$PAD
Sh "L12" C 550 550 0 0 0
Dr 310 0 0
At STD N 00E0FFFF
Ne 22 "/D7"
Po -5000 -4000
$EndPAD
$PAD
Sh "L13" C 550 550 0 0 0
Dr 310 0 0
At STD N 00E0FFFF
Ne 68 "/PE+"
Po -6000 -4000
$EndPAD
$PAD
Sh "K11" C 550 550 0 0 0
Dr 310 0 0
At STD N 00E0FFFF
Ne 75 "GND"
Po -4000 -3000
$EndPAD
$PAD
Sh "K12" C 550 550 0 0 0
Dr 310 0 0
At STD N 00E0FFFF
Ne 0 ""
Po -5000 -3000
$EndPAD
$PAD
Sh "K13" C 550 550 0 0 0
Dr 310 0 0
At STD N 00E0FFFF
Ne 2 "/ACK"
Po -6000 -3000
$EndPAD
$PAD
Sh "J11" C 550 550 0 0 0
Dr 310 0 0
At STD N 00E0FFFF
Ne 0 ""
Po -4000 -2000
$EndPAD
$PAD
Sh "J12" C 550 550 0 0 0
Dr 310 0 0
At STD N 00E0FFFF
Ne 12 "/BUST+"
Po -5000 -2000
$EndPAD
$PAD
Sh "J13" C 550 550 0 0 0
Dr 310 0 0
At STD N 00E0FFFF
Ne 10 "/BIT6"
Po -6000 -2000
$EndPAD
$PAD
Sh "H11" C 550 550 0 0 0
Dr 310 0 0
At STD N 00E0FFFF
Ne 11 "/BIT7"
Po -4000 -1000
$EndPAD
$PAD
Sh "H12" C 550 550 0 0 0
Dr 310 0 0
At STD N 00E0FFFF
Ne 9 "/BIT5"
Po -5000 -1000
$EndPAD
$PAD
Sh "H13" C 550 550 0 0 0
Dr 310 0 0
At STD N 00E0FFFF
Ne 8 "/BIT4"
Po -6000 -1000
$EndPAD
$PAD
Sh "G11" C 550 550 0 0 0
Dr 310 0 0
At STD N 00E0FFFF
Ne 75 "GND"
Po -4000 0
$EndPAD
$PAD
Sh "G12" C 550 550 0 0 0
Dr 310 0 0
At STD N 00E0FFFF
Ne 77 "VCC"
Po -5000 0
$EndPAD
$PAD
Sh "G13" C 550 550 0 0 0
Dr 310 0 0
At STD N 00E0FFFF
Ne 7 "/BIT3"
Po -6000 0
$EndPAD
$PAD
Sh "F11" C 550 550 0 0 0
Dr 310 0 0
At STD N 00E0FFFF
Ne 72 "/SLCTIN-"
Po -4000 1000
$EndPAD
$PAD
Sh "F12" C 550 550 0 0 0
Dr 310 0 0
At STD N 00E0FFFF
Ne 6 "/BIT2"
Po -5000 1000
$EndPAD
$PAD
Sh "F13" C 550 550 0 0 0
Dr 310 0 0
At STD N 00E0FFFF
Ne 27 "/LED2"
Po -6000 1000
$EndPAD
$PAD
Sh "E11" C 550 550 0 0 0
Dr 310 0 0
At STD N 00E0FFFF
Ne 0 ""
Po -4000 2000
$EndPAD
$PAD
Sh "E12" C 550 550 0 0 0
Dr 310 0 0
At STD N 00E0FFFF
Ne 25 "/INIT-"
Po -5000 2000
$EndPAD
$PAD
Sh "E13" C 550 550 0 0 0
Dr 310 0 0
At STD N 00E0FFFF
Ne 5 "/BIT1"
Po -6000 2000
$EndPAD
$PAD
Sh "D11" C 550 550 0 0 0
Dr 310 0 0
At STD N 00E0FFFF
Ne 77 "VCC"
Po -4000 3000
$EndPAD
$PAD
Sh "D12" C 550 550 0 0 0
Dr 310 0 0
At STD N 00E0FFFF
Ne 4 "/BIT0"
Po -5000 3000
$EndPAD
$PAD
Sh "D13" C 550 550 0 0 0
Dr 310 0 0
At STD N 00E0FFFF
Ne 24 "/ERROR-"
Po -6000 3000
$EndPAD
$SHAPE3D
Na "support/supp_pga120.wrl"
Sc 1 1 1
Of 0 0 0
Ro 0 0 0
$EndSHAPE3D
$EndMODULE 4003APG120
$EndLIBRARY
