PCBNEW-LibModule-V1  Út 12. červen 2012, 22:11:30 CEST
# encoding utf-8
Units deci-mils
$INDEX
RV1x1
RVGRHOR
RVGRVERT
RVPQVERT
$EndINDEX
$MODULE RV1x1
Po 0 0 0 15 4FD7A203 00000000 ~~
Li RV1x1
Sc 0
AR 
Op 0 0 0
T0 0 -2500 392 392 0 77 N V 21 N "RV1x1"
T1 0 2500 393 393 0 78 N I 21 N "Value"
DC 0 0 1000 0 150 21
DS -2000 2000 2000 2000 150 21
DS 2000 2000 2000 -2000 150 21
DS 2000 -2000 -2000 -2000 150 21
DS -2000 -2000 -2000 2000 150 21
$PAD
Sh "4" C 787 787 0 0 0
Dr 315 0 0
At STD N 00E0FFFF
Ne 0 ""
Po -1000 1000
$EndPAD
$PAD
Sh "5" C 787 787 0 0 0
Dr 315 0 0
At STD N 00E0FFFF
Ne 0 ""
Po 1000 1000
$EndPAD
$PAD
Sh "6" C 787 787 0 0 0
Dr 315 0 0
At STD N 00E0FFFF
Ne 0 ""
Po 0 -1000
$EndPAD
$SHAPE3D
Na "Potenciometer/trimpot_q.wrl"
Sc 1 1 1
Of 0 0 0
Ro 0 0 0
$EndSHAPE3D
$EndMODULE RV1x1
$MODULE RVGRHOR
Po 0 0 0 15 4FD7A22D 00000000 ~~
Li RVGRHOR
Sc 0
AR 
Op 0 0 0
T0 -500 -3500 393 393 0 78 N V 21 N "RVGRHOR"
T1 -800 3600 393 393 0 78 N I 21 N "Value"
DS 800 200 800 300 150 21
DS 800 300 300 300 150 21
DS 300 300 300 750 150 21
DS 200 -900 300 -900 150 21
DS 300 -900 300 -300 150 21
DS 300 -300 800 -300 150 21
DS 800 -300 800 200 150 21
DS 300 800 -300 800 150 21
DS -300 800 -300 250 150 21
DS -300 250 -800 250 150 21
DS -800 250 -800 -300 150 21
DS -250 -300 -250 -900 150 21
DS -250 -900 200 -900 150 21
DS -3450 -3050 -4200 -3050 150 21
DS -4200 -3050 -4200 2950 150 21
DS -4200 2950 -3450 2950 150 21
DS -800 -300 -250 -300 150 21
DC 0 -50 -1000 1950 150 21
DS -2950 -3050 -3450 -3050 150 21
DS -3450 2950 1550 2950 150 21
DS 1550 2950 4050 950 150 21
DS 4050 950 4050 -1050 150 21
DS 4050 -1050 1550 -3050 150 21
DS 1550 -3050 -2950 -3050 150 21
$PAD
Sh "1" C 984 984 0 0 2700
Dr 591 0 0
At STD N 00E0FFFF
Ne 0 ""
Po -3400 -2100
$EndPAD
$PAD
Sh "3" C 984 984 0 0 2700
Dr 591 0 0
At STD N 00E0FFFF
Ne 0 ""
Po -3400 1900
$EndPAD
$PAD
Sh "2" C 984 984 0 0 2700
Dr 591 0 0
At STD N 00E0FFFF
Ne 0 ""
Po 3050 -50
$EndPAD
$SHAPE3D
Na "novos/Trimpot_h.wrl"
Sc 1.6 1.6 1.6
Of 0 0 0
Ro 0 0 0
$EndSHAPE3D
$EndMODULE RVGRHOR
$MODULE RVGRVERT
Po 0 0 0 15 4FD7A252 00000000 ~~
Li RVGRVERT
Sc 0
AR 
Op 0 0 0
T0 0 -2700 393 393 0 78 N V 21 N "RVGRVERT"
T1 0 2000 393 393 0 78 N I 21 N "Value"
DS 2900 -150 800 -2200 150 21
DS -2850 -150 -700 -2200 150 21
DS -2850 -150 -2850 1450 150 21
DS -2850 1450 2900 1450 150 21
DS 2900 1450 2900 -150 150 21
DS 800 -2200 -700 -2200 150 21
$PAD
Sh "1" C 984 984 0 0 0
Dr 591 0 0
At STD N 00E0FFFF
Ne 0 ""
Po -2000 600
$EndPAD
$PAD
Sh "3" C 984 984 0 0 0
Dr 591 0 0
At STD N 00E0FFFF
Ne 0 ""
Po 2000 650
$EndPAD
$PAD
Sh "2" C 984 984 0 0 0
Dr 591 0 0
At STD N 00E0FFFF
Ne 0 ""
Po 0 -1400
$EndPAD
$SHAPE3D
Na "novos/Trimpot.wrl"
Sc 1.6 1.6 1.6
Of 0 0 0
Ro 0 0 0
$EndSHAPE3D
$EndMODULE RVGRVERT
$MODULE RVPQVERT
Po 0 0 0 15 4FD7A270 00000000 ~~
Li RVPQVERT
Sc 0
AR 
Op 0 0 0
T0 0 -2500 393 393 0 78 N V 21 N "RVPQVERT"
T1 0 1750 393 393 0 78 N I 21 N "Value"
DS -2050 100 -2050 1100 150 21
DS -2050 1100 2000 1100 150 21
DS 2000 1100 2000 100 150 21
DS 2000 100 700 -1850 150 21
DS 700 -1850 -600 -1850 150 21
DS -600 -1850 -2050 100 150 21
$PAD
Sh "1" C 827 827 0 0 0
Dr 500 0 0
At STD N 00E0FFFF
Ne 0 ""
Po -1200 450
$EndPAD
$PAD
Sh "3" C 827 827 0 0 0
Dr 500 0 0
At STD N 00E0FFFF
Ne 0 ""
Po 1200 450
$EndPAD
$PAD
Sh "2" C 827 827 0 0 0
Dr 500 0 0
At STD N 00E0FFFF
Ne 0 ""
Po 0 -900
$EndPAD
$SHAPE3D
Na "novos/Trimpot_v2.wrl"
Sc 1 1 1
Of 0 0 0
Ro 0 0 0
$EndSHAPE3D
$EndMODULE RVPQVERT
$EndLIBRARY
