PCBNEW-LibModule-V1  Čt 21. červen 2012, 21:33:49 CEST
# encoding utf-8
Units deci-mils
$INDEX
Finder40.52
RELAY-1RG
RELAY-1RM
RELAY-V23092
RELAY_G6RL_1_5DC
VMA001
relay_2rt
relay_sh
rl-tq2
$EndINDEX
$MODULE Finder40.52
Po 0 0 0 15 4FB67FA0 00000000 ~~
Li Finder40.52
Cd RelayFinder4052
Kw RELAY
Sc 0
AR /49A82813
Op 0 0 0
At VIRTUAL
T0 2950 -2900 394 394 0 79 N V 21 N "Finder40.52"
T1 3000 0 394 394 0 79 N I 21 N "Value"
DS 9000 -2500 -2500 -2500 50 21
DS -2500 -2500 -2500 2500 50 21
DS -2500 2500 9000 2500 50 21
DS 9040 2480 9040 -2440 60 21
DS -1500 -810 -1500 -470 60 21
DS -709 -470 -709 520 100 21
DS -2290 520 -2290 -470 100 21
DS -2290 -470 -1500 -470 100 21
DS -1500 -470 -910 -470 100 21
DS -2090 520 -2290 520 100 21
DS -910 -470 -2090 520 60 21
DS -910 -470 -709 -470 100 21
DS -709 520 -1500 520 100 21
DS -1500 520 -1500 810 60 21
DS -1500 520 -2090 520 100 21
DS 6500 -850 6500 -750 60 21
DS 6000 -250 6130 -380 100 21
DS 6500 850 6500 750 60 21
DS 6500 750 6130 370 60 21
DS 6130 370 4500 370 60 21
DS 6130 370 6000 250 100 21
DS 4500 370 4500 800 60 21
DS 6879 370 8500 370 60 21
DS 8500 370 8500 800 60 21
DS 6130 -380 4500 -380 60 21
DS 6130 -380 6500 -750 100 21
DS 4500 -380 4500 -780 60 21
DS 6879 -380 8500 -380 60 21
DS 8500 -380 8500 -780 60 21
DS 6500 -1100 6500 -850 60 21
DS 6500 850 6500 1100 60 21
$PAD
Sh "A1" O 780 1560 0 0 0
Dr 433 0 0
At STD N 00A8FFFF
Ne 0 ""
Po -1500 -1500
$EndPAD
$PAD
Sh "A2" O 780 1560 0 0 0
Dr 520 0 0
At STD N 00A8FFFF
Ne 0 ""
Po -1500 1500
$EndPAD
$PAD
Sh "22" O 780 1560 0 0 0
Dr 520 0 0
At STD N 00A8FFFF
Ne 0 ""
Po 4500 1500
$EndPAD
$PAD
Sh "12" O 780 1560 0 0 0
Dr 520 0 0
At STD N 00A8FFFF
Ne 0 ""
Po 4500 -1500
$EndPAD
$PAD
Sh "21" O 780 1560 0 0 0
Dr 520 0 0
At STD N 00A8FFFF
Ne 0 ""
Po 6500 1500
$EndPAD
$PAD
Sh "11" O 780 1560 0 0 0
Dr 520 0 0
At STD N 00A8FFFF
Ne 0 ""
Po 6500 -1500
$EndPAD
$PAD
Sh "24" O 780 1560 0 0 0
Dr 520 0 0
At STD N 00A8FFFF
Ne 0 ""
Po 8500 1500
$EndPAD
$PAD
Sh "14" O 780 1560 0 0 0
Dr 520 0 0
At STD N 00A8FFFF
Ne 0 ""
Po 8500 -1500
$EndPAD
$SHAPE3D
Na "Relay\\relais2rtfinder40.52.wrl"
Sc 1 1 1
Of 0 0 0
Ro 0 0 0
$EndSHAPE3D
$EndMODULE Finder40.52
$MODULE RELAY-1RG
Po 0 0 0 15 4FB67DE9 00000000 ~~
Li RELAY-1RG
Sc 0
AR 
Op 0 0 0
T0 0 -4750 394 394 0 79 N V 21 N "RELAY-1RG"
T1 0 0 394 394 0 79 N I 21 N "VAL**"
DS 3200 -4300 3500 -4300 150 21
DS 3500 -4300 3500 4400 150 21
DS -3550 4400 -3550 -4300 150 21
DS -3550 -4300 3200 -4300 150 21
DS -3550 4400 3500 4400 150 21
$PAD
Sh "C" C 984 984 0 0 0
Dr 591 0 0
At STD N 00E0FFFF
Ne 0 ""
Po 0 2850
$EndPAD
$PAD
Sh "B1" C 984 984 0 0 0
Dr 591 0 0
At STD N 00E0FFFF
Ne 0 ""
Po -2450 2050
$EndPAD
$PAD
Sh "B2" C 984 984 0 0 0
Dr 591 0 0
At STD N 00E0FFFF
Ne 0 ""
Po 2350 2050
$EndPAD
$PAD
Sh "NA" C 984 984 0 0 0
Dr 591 0 0
At STD N 00E0FFFF
Ne 0 ""
Po 2350 -2650
$EndPAD
$PAD
Sh "NF" C 984 984 0 0 0
Dr 591 0 0
At STD N 00E0FFFF
Ne 0 ""
Po -2450 -2700
$EndPAD
$SHAPE3D
Na "Relay\\relay_1g.wrl"
Sc 1.5 1.5 1.5
Of 0 0 0
Ro 0 0 0
$EndSHAPE3D
$EndMODULE RELAY-1RG
$MODULE RELAY-1RM
Po 0 0 0 15 4FB67E71 00000000 ~~
Li RELAY-1RM
Sc 0
AR 
Op 0 0 0
T0 -2000 0 394 394 900 79 N V 21 N "RELAY-1RM"
T1 0 0 394 394 900 79 N I 21 N "VAL**"
DS -1550 -2450 -1550 2500 150 21
DS -1550 2500 1500 2500 150 21
DS 1500 2500 1500 -2450 150 21
DS 1500 -2450 -1550 -2450 150 21
$PAD
Sh "C" C 591 591 0 0 0
Dr 315 0 0
At STD N 00E0FFFF
Ne 0 ""
Po -1000 -1950
$EndPAD
$PAD
Sh "C1" C 591 591 0 0 0
Dr 315 0 0
At STD N 00E0FFFF
Ne 0 ""
Po 1000 -1950
$EndPAD
$PAD
Sh "B1" C 591 591 0 0 0
Dr 315 0 0
At STD N 00E0FFFF
Ne 0 ""
Po -1000 1000
$EndPAD
$PAD
Sh "B2" C 591 591 0 0 0
Dr 315 0 0
At STD N 00E0FFFF
Ne 0 ""
Po 1000 1000
$EndPAD
$PAD
Sh "NA" C 591 591 0 0 0
Dr 315 0 0
At STD N 00E0FFFF
Ne 0 ""
Po -1000 2000
$EndPAD
$PAD
Sh "NF" C 591 591 0 0 0
Dr 315 0 0
At STD N 00E0FFFF
Ne 0 ""
Po 1000 2000
$EndPAD
$SHAPE3D
Na "Relay\\relay+1rm.wrl"
Sc 1 1 1
Of 0 0 0
Ro 0 0 0
$EndSHAPE3D
$EndMODULE RELAY-1RM
$MODULE RELAY-V23092
Po 0 0 0 15 4FB6813D 00000000 ~~
Li RELAY-V23092
Cd Bornier d'alimentation 4 pins
Kw DEV
Sc 0
AR 
Op 0 0 0
T0 0 -1950 394 394 0 79 N V 21 N "RELAY-V23092"
T1 0 2100 394 394 0 79 N I 21 N "Value"
DS -6000 -1500 -6000 1500 120 21
DS 6000 1500 6000 -1500 120 21
DS -6000 1000 6000 1000 120 21
DS -6000 -1500 6000 -1500 120 21
DS -6000 1500 6000 1500 120 21
$PAD
Sh "2" C 1500 1500 0 0 0
Dr 600 0 0
At STD N 00E0FFFF
Ne 3 "N-000010"
Po -3000 0
$EndPAD
$PAD
Sh "3" C 1500 1500 0 0 0
Dr 600 0 0
At STD N 00E0FFFF
Ne 0 ""
Po -1000 0
$EndPAD
$PAD
Sh "1" R 1500 1500 0 0 0
Dr 600 0 0
At STD N 00E0FFFF
Ne 2 "N-000008"
Po -5000 0
$EndPAD
$PAD
Sh "4" C 1200 1200 0 0 0
Dr 600 0 0
At STD N 00E0FFFF
Ne 4 "PWR_1"
Po 3500 0
$EndPAD
$PAD
Sh "5" C 1200 1200 0 0 0
Dr 600 0 0
At STD N 00E0FFFF
Ne 1 "N-000004"
Po 5000 0
$EndPAD
$EndMODULE RELAY-V23092
$MODULE RELAY_G6RL_1_5DC
Po 0 0 0 15 4FE3770E 00000000 ~~
Li RELAY_G6RL_1_5DC
Sc 0
AR 
Op 0 0 0
T0 0 -2500 393 393 0 78 N V 21 N "RELAY_G6RL_1_5DC"
T1 0 0 393 393 0 78 N I 21 N "Value"
DS -5369 2011 5859 2011 100 21
DS 5859 2011 5859 -1965 100 21
DS 5859 -1965 -5365 -1965 100 21
DS -5365 -1965 -5365 2011 100 21
$PAD
Sh "1" R 787 787 0 0 0
Dr 512 0 0
At STD N 00E0FFFF
Ne 0 ""
Po -4772 -1497
$EndPAD
$PAD
Sh "2" C 787 787 0 0 0
Dr 512 0 0
At STD N 00E0FFFF
Ne 0 ""
Po -4773 1503
$EndPAD
$PAD
Sh "4" C 787 787 0 0 0
Dr 512 0 0
At STD N 00E0FFFF
Ne 0 ""
Po 5188 -1497
$EndPAD
$PAD
Sh "5" C 787 787 0 0 0
Dr 512 0 0
At STD N 00E0FFFF
Ne 0 ""
Po 2668 -1497
$EndPAD
$PAD
Sh "3" C 787 787 0 0 0
Dr 512 0 0
At STD N 00E0FFFF
Ne 0 ""
Po 3928 1503
$EndPAD
$EndMODULE RELAY_G6RL_1_5DC
$MODULE VMA001
Po 0 0 0 15 4FB6805F 00000000 ~~
Li VMA001
Sc 0
AR 
Op 0 0 0
T0 0 -2850 394 394 0 79 N V 21 N "VMA001"
T1 -1600 0 394 394 0 79 N I 21 N "VAL**"
DS 4500 2500 4500 -2500 50 21
DS 4500 -2500 -4500 -2500 50 21
DS -4500 -2500 -4500 2500 50 21
DS -4500 2500 4500 2500 50 21
$PAD
Sh "1" C 984 984 0 0 0
Dr 433 0 0
At STD N 00E0FFFF
Ne 0 ""
Po 3500 1500
$EndPAD
$PAD
Sh "2" C 984 984 0 0 0
Dr 433 0 0
At STD N 00E0FFFF
Ne 0 ""
Po 1500 500
$EndPAD
$PAD
Sh "3" C 984 984 0 0 0
Dr 433 0 0
At STD N 00E0FFFF
Ne 0 ""
Po 2500 -1500
$EndPAD
$PAD
Sh "4" C 984 984 0 0 0
Dr 433 0 0
At STD N 00E0FFFF
Ne 0 ""
Po -3500 1500
$EndPAD
$PAD
Sh "5" C 984 984 0 0 0
Dr 433 0 0
At STD N 00E0FFFF
Ne 0 ""
Po -3500 -1500
$EndPAD
$SHAPE3D
Na "Relay\\VMA001.wrl"
Sc 1 1 1
Of 0 0 0
Ro 0 0 0
$EndSHAPE3D
$EndMODULE VMA001
$MODULE relay_2rt
Po 0 0 0 15 4FB67EE1 00000000 ~~
Li relay_2rt
Cd Module Dil 16 pins, pads ronds
Kw DIL
Sc 0
AR 
Op 0 0 0
T0 0 -2700 394 394 0 79 N V 21 N "RELAY_2RT"
T1 0 0 394 394 0 79 N I 21 N "Value"
DS 4500 -1000 4500 -2200 150 21
DS 4500 -2200 -4500 -2200 150 21
DS -4500 -2200 -4500 -1000 150 21
DS -4500 1000 -4500 2200 150 21
DS -4500 2200 4500 2200 150 21
DS 4500 2200 4500 1000 150 21
DS -4500 -500 -4500 -500 150 21
DS 4500 -1000 4500 1000 150 21
DS -4500 1000 -4500 -1000 150 21
$PAD
Sh "1" R 787 787 0 0 0
Dr 320 0 0
At STD N 00E0FFFF
Ne 0 ""
Po -3500 1500
$EndPAD
$PAD
Sh "3" C 787 787 0 0 0
Dr 320 0 0
At STD N 00E0FFFF
Ne 0 ""
Po -1500 1500
$EndPAD
$PAD
Sh "5" C 787 787 0 0 0
Dr 320 0 0
At STD N 00E0FFFF
Ne 0 ""
Po 500 1500
$EndPAD
$PAD
Sh "8" C 787 787 0 0 0
Dr 320 0 0
At STD N 00E0FFFF
Ne 0 ""
Po 3500 1500
$EndPAD
$PAD
Sh "9" C 787 787 0 0 0
Dr 320 0 0
At STD N 00E0FFFF
Ne 0 ""
Po 3500 -1500
$EndPAD
$PAD
Sh "12" C 787 787 0 0 0
Dr 320 0 0
At STD N 00E0FFFF
Ne 0 ""
Po 500 -1500
$EndPAD
$PAD
Sh "14" C 787 787 0 0 0
Dr 320 0 0
At STD N 00E0FFFF
Ne 0 ""
Po -1500 -1500
$EndPAD
$PAD
Sh "16" C 787 787 0 0 0
Dr 320 0 0
At STD N 00E0FFFF
Ne 0 ""
Po -3500 -1500
$EndPAD
$SHAPE3D
Na "Relay\\relaydil_16.wrl"
Sc 1 1 1
Of 0 0 0
Ro 0 0 0
$EndSHAPE3D
$EndMODULE relay_2rt
$MODULE relay_sh
Po 0 0 0 15 4FB67F56 00000000 ~~
Li relay_sh
Sc 0
AR relay_sh
Op 0 0 0
T0 0 -1500 394 394 0 79 N V 21 N "relay_sh"
T1 0 1550 394 394 0 79 N I 21 N "VAL**"
DS -3700 1000 -4100 700 150 21
DS -4100 700 -4100 0 150 21
DS -4100 0 -4100 -1000 150 21
DS -4100 -1000 4350 -1000 150 21
DS 4350 -1000 4350 1000 150 21
DS 4350 1000 -3650 1000 150 21
$PAD
Sh "5" C 866 866 0 0 0
Dr 472 0 0
At STD N 00E0FFFF
Ne 0 ""
Po 1000 0
$EndPAD
$PAD
Sh "3" C 866 866 0 0 0
Dr 472 0 0
At STD N 00E0FFFF
Ne 0 ""
Po -1000 0
$EndPAD
$PAD
Sh "7" C 866 866 0 0 0
Dr 472 0 0
At STD N 00E0FFFF
Ne 0 ""
Po 3000 0
$EndPAD
$PAD
Sh "1" C 866 866 0 0 0
Dr 472 0 0
At STD N 00E0FFFF
Ne 0 ""
Po -3000 0
$EndPAD
$SHAPE3D
Na "Relay\\relay_sh.wrl"
Sc 1 1 1
Of 0 0 0
Ro 0 0 0
$EndSHAPE3D
$EndMODULE relay_sh
$MODULE rl-tq2
Po 0 0 0 15 4FD65036 00000000 ~~
Li rl-tq2
Sc 0
AR 
Op 0 0 0
T0 0 -3500 393 393 0 78 N V 21 N "rl-tq2"
T1 0 3500 393 393 0 78 N I 21 N "Value"
DS -2000 -2750 -2000 2750 150 21
DS -2000 2750 2000 2750 150 21
DS 2000 2750 2000 -2750 150 21
DS 2000 -2750 -2000 -2750 150 21
DS 500 -1000 250 -1000 50 21
DS 250 -1000 250 1000 50 21
DS 250 1000 1000 1000 50 21
DS 750 -1250 500 -500 50 21
DS 500 -500 500 0 50 21
DS 500 0 1000 0 50 21
DS 1000 -1000 750 -1000 50 21
DS -500 -1000 -250 -1000 50 21
DS -250 -1000 -250 1000 50 21
DS -250 1000 -1000 1000 50 21
DS -750 -1250 -500 -500 50 21
DS -500 -500 -500 0 50 21
DS -500 0 -1000 0 50 21
DS -1000 -1000 -750 -1000 50 21
DS 750 -2000 1250 -2000 50 21
DS -1250 -2000 -750 -2000 50 21
DS -750 -2000 -750 -2250 50 21
DS -750 -2250 750 -2250 50 21
DS 750 -2250 750 -1750 50 21
DS 750 -1750 -750 -1750 50 21
DS -750 -1750 -750 -2000 50 21
$PAD
Sh "1" R 750 750 0 0 0
Dr 320 0 0
At STD N 00E0FFFF
Ne 0 ""
Po -1500 -2000
$EndPAD
$PAD
Sh "2" C 750 750 0 0 0
Dr 320 0 0
At STD N 00E0FFFF
Ne 0 ""
Po -1500 -1000
$EndPAD
$PAD
Sh "3" C 750 750 0 0 0
Dr 320 0 0
At STD N 00E0FFFF
Ne 0 ""
Po -1500 0
$EndPAD
$PAD
Sh "4" C 750 750 0 0 0
Dr 320 0 0
At STD N 00E0FFFF
Ne 0 ""
Po -1500 1000
$EndPAD
$PAD
Sh "5" C 750 750 0 0 0
Dr 320 0 0
At STD N 00E0FFFF
Ne 0 ""
Po -1500 2000
$EndPAD
$PAD
Sh "6" C 750 750 0 0 0
Dr 320 0 0
At STD N 00E0FFFF
Ne 0 ""
Po 1500 2000
$EndPAD
$PAD
Sh "7" C 750 750 0 0 0
Dr 320 0 0
At STD N 00E0FFFF
Ne 0 ""
Po 1500 1000
$EndPAD
$PAD
Sh "8" C 750 750 0 0 0
Dr 320 0 0
At STD N 00E0FFFF
Ne 0 ""
Po 1500 0
$EndPAD
$PAD
Sh "9" C 750 750 0 0 0
Dr 320 0 0
At STD N 00E0FFFF
Ne 0 ""
Po 1500 -1000
$EndPAD
$PAD
Sh "10" C 750 750 0 0 0
Dr 320 0 0
At STD N 00E0FFFF
Ne 0 ""
Po 1500 -2000
$EndPAD
$EndMODULE rl-tq2
$EndLIBRARY
