PCBNEW-LibModule-V1  Ne 14. říjen 2012, 09:34:07 CEST
# encoding utf-8
Units deci-mils
$INDEX
78LXX
HEPTAWATT5
MULTIWATT-15
MULTIWATT-15B
TO92
$EndINDEX
$MODULE 78LXX
Po 0 0 0 15 47B1796C 00000000 ~~
Li 78LXX
Cd Regulateur TO92 serie LM78Lxx
Kw TR TO92
Sc 0
AR 
Op 0 0 0
T0 0 1000 400 400 0 80 N V 21 N "LM78LXX"
T1 0 -2000 400 400 0 80 N V 21 N "VAL**"
DS 1500 250 1250 500 100 21
DS 1250 500 -1250 500 100 21
DS -1250 500 -1500 250 100 21
DS -1500 250 -1500 -500 100 21
DS -1500 -500 -500 -1500 100 21
DS -500 -1500 500 -1500 100 21
DS 500 -1500 1500 -500 100 21
DS 1500 -500 1500 250 100 21
$PAD
Sh "2" C 750 750 0 0 1800
Dr 230 0 0
At STD N 00E0FFFF
Ne 0 ""
Po 1000 0
$EndPAD
$PAD
Sh "3" R 750 750 0 0 1800
Dr 230 0 0
At STD N 00E0FFFF
Ne 0 ""
Po 0 -1000
$EndPAD
$PAD
Sh "1" C 750 750 0 0 1800
Dr 230 0 0
At STD N 00E0FFFF
Ne 0 ""
Po -1000 0
$EndPAD
$SHAPE3D
Na "discret/to98.wrl"
Sc 1.5 1.5 1.5
Of 0 0 0
Ro 0 0 45
$EndSHAPE3D
$EndMODULE 78LXX
$MODULE HEPTAWATT5
Po 0 0 0 15 507A69C4 00000000 ~~
Li HEPTAWATT5
Sc 0
AR 
Op 0 0 0
T0 0 -1500 394 394 0 79 N V 21 N "HEPTAWATT5"
T1 0 3000 394 394 0 79 N I 21 N "Value"
DS -500 880 -500 1380 300 21
DS -1500 880 -1500 1380 300 21
DS -2000 -1000 2000 -1000 80 21
DS 2000 -1000 2000 0 80 21
DS 2000 0 1750 750 80 21
DS 1750 750 -1750 750 80 21
DS -1750 750 -2000 0 80 21
DS -2000 0 -2000 -1000 80 21
DS 2000 -500 -2000 -500 80 21
DS 1500 880 1500 1380 300 21
DS 500 880 500 1380 300 21
$PAD
Sh "1" R 630 787 0 0 0
Dr 394 0 0
At STD N 00E0FFFF
Ne 0 ""
Po -1500 2000
$EndPAD
$PAD
Sh "2" O 630 787 0 0 0
Dr 394 0 0
At STD N 00E0FFFF
Ne 0 ""
Po -1000 0
$EndPAD
$PAD
Sh "3" O 630 787 0 0 0
Dr 394 0 0
At STD N 00E0FFFF
Ne 0 ""
Po -500 2000
$EndPAD
$PAD
Sh "4" O 630 787 0 0 0
Dr 394 0 0
At STD N 00E0FFFF
Ne 0 ""
Po 0 0
$EndPAD
$PAD
Sh "5" O 630 787 0 0 0
Dr 394 0 0
At STD N 00E0FFFF
Ne 0 ""
Po 500 2000
$EndPAD
$PAD
Sh "6" O 630 787 0 0 0
Dr 394 0 0
At STD N 00E0FFFF
Ne 0 ""
Po 1000 0
$EndPAD
$PAD
Sh "7" O 630 787 0 0 0
Dr 394 0 0
At STD N 00E0FFFF
Ne 0 ""
Po 1500 2000
$EndPAD
$EndMODULE HEPTAWATT5
$MODULE MULTIWATT-15
Po 0 0 0 15 507A6A31 00000000 ~~
Li MULTIWATT-15
Sc 0
AR 
Op 0 0 0
T0 0 -2200 394 394 0 79 N V 21 N "MULTIWATT 15"
T1 0 -1000 394 394 0 79 N I 21 N "Value"
DS 3500 0 4000 0 80 21
DS 4000 0 4000 -1750 80 21
DS 4000 -1750 -4000 -1750 80 21
DS -4000 -1750 -4000 0 80 21
DS -4000 0 -3500 0 80 21
$PAD
Sh "1" R 640 640 0 0 0
Dr 440 0 0
At STD N 0CC08001
Ne 0 ""
Po -3500 2000
$EndPAD
$PAD
Sh "2" C 680 680 0 0 0
Dr 440 0 0
At STD N 0CC08001
Ne 0 ""
Po -3000 0
$EndPAD
$PAD
Sh "3" C 680 680 0 0 0
Dr 440 0 0
At STD N 0CC08001
Ne 0 ""
Po -2500 2000
$EndPAD
$PAD
Sh "4" C 680 680 0 0 0
Dr 440 0 0
At STD N 0CC08001
Ne 0 ""
Po -2000 0
$EndPAD
$PAD
Sh "5" C 680 680 0 0 0
Dr 440 0 0
At STD N 0CC08001
Ne 0 ""
Po -1500 2000
$EndPAD
$PAD
Sh "6" C 680 680 0 0 0
Dr 440 0 0
At STD N 0CC08001
Ne 0 ""
Po -1000 0
$EndPAD
$PAD
Sh "7" C 680 680 0 0 0
Dr 440 0 0
At STD N 0CC08001
Ne 0 ""
Po -500 2000
$EndPAD
$PAD
Sh "8" C 680 680 0 0 0
Dr 440 0 0
At STD N 0CC08001
Ne 0 ""
Po 0 0
$EndPAD
$PAD
Sh "9" C 680 680 0 0 0
Dr 440 0 0
At STD N 0CC08001
Ne 0 ""
Po 500 2000
$EndPAD
$PAD
Sh "10" C 680 680 0 0 0
Dr 440 0 0
At STD N 0CC08001
Ne 0 ""
Po 1000 0
$EndPAD
$PAD
Sh "11" C 680 680 0 0 0
Dr 440 0 0
At STD N 0CC08001
Ne 0 ""
Po 1500 2000
$EndPAD
$PAD
Sh "12" C 680 680 0 0 0
Dr 440 0 0
At STD N 0CC08001
Ne 0 ""
Po 2000 0
$EndPAD
$PAD
Sh "13" C 680 680 0 0 0
Dr 440 0 0
At STD N 0CC08001
Ne 0 ""
Po 2500 2000
$EndPAD
$PAD
Sh "14" C 680 680 0 0 0
Dr 440 0 0
At STD N 0CC08001
Ne 0 ""
Po 3000 0
$EndPAD
$PAD
Sh "15" C 680 680 0 0 0
Dr 440 0 0
At STD N 0CC08001
Ne 0 ""
Po 3500 2000
$EndPAD
$EndMODULE MULTIWATT-15
$MODULE MULTIWATT-15B
Po 0 0 0 15 507A6ADF 00000000 ~~
Li MULTIWATT-15B
Sc 0
AR 
Op 0 0 0
T0 0 -2200 394 394 0 79 N V 21 N "MULTIWATT 15B"
T1 0 -1200 394 394 0 79 N I 21 N "Value"
DS 3500 0 4000 0 80 21
DS 4000 0 4000 -1750 80 21
DS 4000 -1750 -4000 -1750 80 21
DS -4000 -1750 -4000 0 80 21
DS -4000 0 -3500 0 80 21
$PAD
Sh "1" R 591 1181 0 0 0
Dr 460 0 0
At STD N 00E0FFFF
Ne 0 ""
Po -3500 2000
$EndPAD
$PAD
Sh "2" O 591 1181 0 0 0
Dr 460 0 0
At STD N 00E0FFFF
Ne 0 ""
Po -3000 0
$EndPAD
$PAD
Sh "3" O 591 1181 0 0 0
Dr 460 0 0
At STD N 00E0FFFF
Ne 0 ""
Po -2500 2000
$EndPAD
$PAD
Sh "4" O 591 1181 0 0 0
Dr 460 0 0
At STD N 00E0FFFF
Ne 0 ""
Po -2000 0
$EndPAD
$PAD
Sh "5" O 591 1181 0 0 0
Dr 460 0 0
At STD N 00E0FFFF
Ne 0 ""
Po -1500 2000
$EndPAD
$PAD
Sh "6" O 591 1181 0 0 0
Dr 460 0 0
At STD N 00E0FFFF
Ne 0 ""
Po -1000 0
$EndPAD
$PAD
Sh "7" O 591 1181 0 0 0
Dr 460 0 0
At STD N 00E0FFFF
Ne 0 ""
Po -500 2000
$EndPAD
$PAD
Sh "8" O 591 1181 0 0 0
Dr 460 0 0
At STD N 00E0FFFF
Ne 0 ""
Po 0 0
$EndPAD
$PAD
Sh "9" O 591 1181 0 0 0
Dr 460 0 0
At STD N 00E0FFFF
Ne 0 ""
Po 500 2000
$EndPAD
$PAD
Sh "10" O 591 1181 0 0 0
Dr 460 0 0
At STD N 00E0FFFF
Ne 0 ""
Po 1000 0
$EndPAD
$PAD
Sh "11" O 591 1181 0 0 0
Dr 460 0 0
At STD N 00E0FFFF
Ne 0 ""
Po 1500 2000
$EndPAD
$PAD
Sh "12" O 591 1181 0 0 0
Dr 460 0 0
At STD N 00E0FFFF
Ne 0 ""
Po 2000 0
$EndPAD
$PAD
Sh "13" O 591 1181 0 0 0
Dr 460 0 0
At STD N 00E0FFFF
Ne 0 ""
Po 2500 2000
$EndPAD
$PAD
Sh "14" O 591 1181 0 0 0
Dr 460 0 0
At STD N 00E0FFFF
Ne 0 ""
Po 3000 0
$EndPAD
$PAD
Sh "15" O 591 1181 0 0 0
Dr 460 0 0
At STD N 00E0FFFF
Ne 0 ""
Po 3500 2000
$EndPAD
$EndMODULE MULTIWATT-15B
$MODULE TO92
Po 0 0 0 15 47B1796C 00000000 ~~
Li TO92
Cd Regulateur TO92 serie LM78Lxx
Kw TR TO92
Sc 0
AR 
Op 0 0 0
T0 0 1000 400 400 0 80 N V 21 N "TO92"
T1 0 -2000 400 400 0 80 N V 21 N "VAL**"
DS 1500 250 1250 500 100 21
DS 1250 500 -1250 500 100 21
DS -1250 500 -1500 250 100 21
DS -1500 250 -1500 -500 100 21
DS -1500 -500 -500 -1500 100 21
DS -500 -1500 500 -1500 100 21
DS 500 -1500 1500 -500 100 21
DS 1500 -500 1500 250 100 21
$PAD
Sh "2" C 750 750 0 0 1800
Dr 230 0 0
At STD N 00E0FFFF
Ne 0 ""
Po 1000 0
$EndPAD
$PAD
Sh "3" R 750 750 0 0 1800
Dr 230 0 0
At STD N 00E0FFFF
Ne 0 ""
Po 0 -1000
$EndPAD
$PAD
Sh "1" C 750 750 0 0 1800
Dr 230 0 0
At STD N 00E0FFFF
Ne 0 ""
Po -1000 0
$EndPAD
$SHAPE3D
Na "discret/to98.wrl"
Sc 1.5 1.5 1.5
Of 0 0 0
Ro 0 0 45
$EndSHAPE3D
$EndMODULE TO92
$EndLIBRARY
