#VRML V2.0 utf8
#Exported from Wings 3D 1.4.1
DEF cube2_copy3 Transform {
  children [
    Shape {
      appearance Appearance {
        material DEF Metal Material {
          diffuseColor 0.95338 0.95338 0.95338
          emissiveColor 0.50716 0.50716 0.50716
          specularColor 0.8668 0.8668 0.8668
          ambientIntensity 0.87346
          transparency 0.0
          shininess 1.0
        }
      }
      geometry IndexedFaceSet {
        normalPerVertex TRUE
        coord Coordinate { point [
          1.082675 -0.23621999999999999 1.37795,
          0.885825 -0.23621999999999999 1.37795,
          0.885825 0.23621999999999999 1.37795,
          1.082675 0.23621999999999999 1.37795,
          1.082675 -0.23621999999999999 0.688975,
          1.082675 -0.15748 0.0,
          0.885825 -0.23621999999999999 0.688975,
          0.885825 -0.15748 0.0,
          0.885825 0.23621999999999999 0.688975,
          0.885825 0.15748 0.0,
          1.082675 0.23621999999999999 0.688975,
          1.082675 0.15748 0.0,
          1.082675 -0.15748 -0.9435789391008469,
          0.885825 -0.15748 -0.9435789391008469,
          0.885825 0.15748 -0.9435789391008469,
          1.082675 0.15748 -0.9435789391008469,
          1.0420039391009372 -0.11680893910093725 -0.98425,
          0.9264960608990628 -0.11680893910093725 -0.98425,
          0.9264960608990628 0.11680893910093725 -0.98425,
          1.0420039391009372 0.11680893910093725 -0.98425 ] }
        coordIndex [
          0, 1, 6, 4, -1,
          0, 3, 2, 1, -1,
          0, 4, 10, 3, -1,
          1, 2, 8, 6, -1,
          2, 3, 10, 8, -1,
          4, 5, 11, 10, -1,
          4, 6, 7, 5, -1,
          5, 7, 13, 12, -1,
          5, 12, 15, 11, -1,
          6, 8, 9, 7, -1,
          7, 9, 14, 13, -1,
          8, 10, 11, 9, -1,
          9, 11, 15, 14, -1,
          12, 13, 17, 16, -1,
          12, 16, 19, 15, -1,
          13, 14, 18, 17, -1,
          14, 15, 19, 18, -1,
          16, 17, 18, 19, -1 ]
        normal Normal { vector [
          0.5773502691896258 -0.5773502691896258 0.5773502691896258,
          -0.5773502691896258 -0.5773502691896258 0.5773502691896258,
          -0.5773502691896258 0.5773502691896258 0.5773502691896258,
          0.5773502691896258 0.5773502691896258 0.5773502691896258,
          0.7076791116793552 -0.7053907154446274 -0.04017727538342283,
          0.7076791116793552 -0.7053907154446274 -0.04017727538342283,
          -0.7076791116793552 -0.7053907154446274 -0.04017727538342283,
          -0.7076791116793552 -0.7053907154446274 -0.04017727538342283,
          -0.7076791116793552 0.7053907154446274 -0.04017727538342283,
          -0.7076791116793552 0.7053907154446274 -0.04017727538342283,
          0.7076791116793552 0.7053907154446274 -0.04017727538342283,
          0.7076791116793552 0.7053907154446274 -0.04017727538342283,
          0.6101314768990497 -0.6101314768990498 -0.5054494651238329,
          -0.6101314768990497 -0.6101314768990498 -0.5054494651238329,
          -0.6101314768990497 0.6101314768990498 -0.5054494651238329,
          0.6101314768990497 0.6101314768990498 -0.5054494651238329,
          0.27059805007350496 -0.27059805007350507 -0.9238795325110486,
          -0.27059805007350496 -0.27059805007350507 -0.9238795325110486,
          -0.27059805007350496 0.27059805007350507 -0.9238795325110486,
          0.27059805007350496 0.27059805007350507 -0.9238795325110486 ] }
        normalIndex [
          0, 1, 6, 4, -1,
          0, 3, 2, 1, -1,
          0, 4, 10, 3, -1,
          1, 2, 8, 6, -1,
          2, 3, 10, 8, -1,
          4, 5, 11, 10, -1,
          4, 6, 7, 5, -1,
          5, 7, 13, 12, -1,
          5, 12, 15, 11, -1,
          6, 8, 9, 7, -1,
          7, 9, 14, 13, -1,
          8, 10, 11, 9, -1,
          9, 11, 15, 14, -1,
          12, 13, 17, 16, -1,
          12, 16, 19, 15, -1,
          13, 14, 18, 17, -1,
          14, 15, 19, 18, -1,
          16, 17, 18, 19, -1 ]
      }
    }
  ]
}

DEF cube2 Transform {
  children [
    Shape {
      appearance Appearance {
        material USE Metal
      }
      geometry IndexedFaceSet {
        normalPerVertex TRUE
        coord Coordinate { point [
          -0.885825 -0.23621999999999999 1.37795,
          -1.082675 -0.23621999999999999 1.37795,
          -1.082675 0.23621999999999999 1.37795,
          -0.885825 0.23621999999999999 1.37795,
          -0.885825 -0.23621999999999999 0.688975,
          -0.885825 -0.15748 0.0,
          -1.082675 -0.23621999999999999 0.688975,
          -1.082675 -0.15748 0.0,
          -1.082675 0.23621999999999999 0.688975,
          -1.082675 0.15748 0.0,
          -0.885825 0.23621999999999999 0.688975,
          -0.885825 0.15748 0.0,
          -0.885825 -0.15748 -0.9435789391008469,
          -1.082675 -0.15748 -0.9435789391008469,
          -1.082675 0.15748 -0.9435789391008469,
          -0.885825 0.15748 -0.9435789391008469,
          -0.9264960608990628 -0.11680893910093725 -0.98425,
          -1.0420039391009372 -0.11680893910093725 -0.98425,
          -1.0420039391009372 0.11680893910093725 -0.98425,
          -0.9264960608990628 0.11680893910093725 -0.98425 ] }
        coordIndex [
          0, 1, 6, 4, -1,
          0, 3, 2, 1, -1,
          0, 4, 10, 3, -1,
          1, 2, 8, 6, -1,
          2, 3, 10, 8, -1,
          4, 5, 11, 10, -1,
          4, 6, 7, 5, -1,
          5, 7, 13, 12, -1,
          5, 12, 15, 11, -1,
          6, 8, 9, 7, -1,
          7, 9, 14, 13, -1,
          8, 10, 11, 9, -1,
          9, 11, 15, 14, -1,
          12, 13, 17, 16, -1,
          12, 16, 19, 15, -1,
          13, 14, 18, 17, -1,
          14, 15, 19, 18, -1,
          16, 17, 18, 19, -1 ]
        normal Normal { vector [
          0.5773502691896258 -0.5773502691896258 0.5773502691896258,
          -0.5773502691896258 -0.5773502691896258 0.5773502691896258,
          -0.5773502691896258 0.5773502691896258 0.5773502691896258,
          0.5773502691896258 0.5773502691896258 0.5773502691896258,
          0.7076791116793552 -0.7053907154446274 -0.04017727538342283,
          0.7076791116793552 -0.7053907154446274 -0.04017727538342283,
          -0.7076791116793552 -0.7053907154446274 -0.04017727538342283,
          -0.7076791116793552 -0.7053907154446274 -0.04017727538342283,
          -0.7076791116793552 0.7053907154446274 -0.04017727538342283,
          -0.7076791116793552 0.7053907154446274 -0.04017727538342283,
          0.7076791116793552 0.7053907154446274 -0.04017727538342283,
          0.7076791116793552 0.7053907154446274 -0.04017727538342283,
          0.6101314768990497 -0.6101314768990498 -0.5054494651238329,
          -0.6101314768990497 -0.6101314768990498 -0.5054494651238329,
          -0.6101314768990497 0.6101314768990498 -0.5054494651238329,
          0.6101314768990497 0.6101314768990498 -0.5054494651238329,
          0.27059805007350496 -0.27059805007350507 -0.9238795325110486,
          -0.27059805007350496 -0.27059805007350507 -0.9238795325110486,
          -0.27059805007350496 0.27059805007350507 -0.9238795325110486,
          0.27059805007350496 0.27059805007350507 -0.9238795325110486 ] }
        normalIndex [
          0, 1, 6, 4, -1,
          0, 3, 2, 1, -1,
          0, 4, 10, 3, -1,
          1, 2, 8, 6, -1,
          2, 3, 10, 8, -1,
          4, 5, 11, 10, -1,
          4, 6, 7, 5, -1,
          5, 7, 13, 12, -1,
          5, 12, 15, 11, -1,
          6, 8, 9, 7, -1,
          7, 9, 14, 13, -1,
          8, 10, 11, 9, -1,
          9, 11, 15, 14, -1,
          12, 13, 17, 16, -1,
          12, 16, 19, 15, -1,
          13, 14, 18, 17, -1,
          14, 15, 19, 18, -1,
          16, 17, 18, 19, -1 ]
      }
    }
  ]
}

DEF cylinder1 Transform {
  children [
    Shape {
      appearance Appearance {
        material DEF Coating Material {
          diffuseColor 0.2466666666666667 0.6635111111111107 1.0
          emissiveColor 0.0 0.0 1.0
          specularColor 0.7402599999999999 0.7402599999999999 0.7402599999999999
          ambientIntensity 0.7402599999999998
          transparency 0.0
          shininess 1.0
        }
      }
      geometry IndexedFaceSet {
        normalPerVertex TRUE
        coord Coordinate { point [
          -2.510350979418252 -2.5717298975332226e-16 3.872543620234939,
          -2.4651786546541867 -2.6995172178894727e-16 3.9812208707921637,
          -2.319261889304186 0.9606697292448414 3.872543620234939,
          -2.277528103019149 0.9433830289562298 3.9812208707921637,
          -1.7750862007049373 1.775086200704937 3.872543620234939,
          -1.7431445435427428 1.7431445435427426 3.9812208707921637,
          -0.9606697292448417 2.3192618893041854 3.872543620234939,
          -0.9433830289562302 2.2775281030191485 3.9812208707921637,
          -2.622568828769545e-16 2.5103509794182517 3.872543620234939,
          -2.6194189049220437e-16 2.4651786546541863 3.9812208707921637,
          0.9606697292448412 2.3192618893041854 3.872543620234939,
          0.9433830289562296 2.2775281030191485 3.9812208707921637,
          1.7750862007049373 1.7750862007049373 3.872543620234939,
          1.7431445435427428 1.7431445435427428 3.9812208707921637,
          2.319261889304186 0.9606697292448416 3.872543620234939,
          2.277528103019149 0.9433830289562299 3.9812208707921637,
          2.319261889304186 -0.9606697292448416 3.872543620234939,
          2.2775281030191494 -0.9433830289562299 3.9812208707921637,
          1.7750862007049377 -1.7750862007049373 3.872543620234939,
          1.7431445435427433 -1.7431445435427428 3.9812208707921637,
          0.9606697292448426 -2.3192618893041854 3.872543620234939,
          0.943383028956231 -2.2775281030191485 3.9812208707921637,
          3.496758438359393e-16 -2.510350979418252 3.872543620234939,
          3.493608514511892e-16 -2.4651786546541867 3.9812208707921637,
          -0.9606697292448421 -2.319261889304186 3.872543620234939,
          -0.9433830289562305 -2.277528103019149 3.9812208707921637,
          -1.775086200704937 -1.775086200704938 3.872543620234939,
          -1.7431445435427426 -1.7431445435427435 3.9812208707921637,
          -2.319261889304185 -0.960669729244843 3.872543620234939,
          -2.277528103019148 -0.9433830289562314 3.9812208707921637,
          -2.510350979418252 -2.6938633363318167e-17 1.6392563797656634,
          -2.465178654654753 -1.7939809944376387e-17 1.5305791292084385,
          -2.319261889304186 0.9606697292448417 1.6392563797656634,
          -2.277528103019149 0.9433830289562302 1.5305791292083677,
          -1.7750862007049373 1.7750862007049373 1.6392563797656634,
          -1.7431445435427428 1.7431445435427428 1.5305791292084385,
          -0.9606697292448417 2.319261889304186 1.6392563797656634,
          -0.9433830289562302 2.2775281030191494 1.530579129208368,
          -2.622568828769545e-16 2.510350979418252 1.6392563797656634,
          -2.6194189049220437e-16 2.465178654654753 1.5305791292084385,
          0.9606697292448412 2.319261889304186 1.6392563797656634,
          0.9433830289562296 2.2775281030191494 1.530579129208368,
          1.7750862007049373 1.7750862007049373 1.6392563797656634,
          1.7431445435427428 1.7431445435427428 1.5305791292084385,
          2.319261889304186 0.960669729244842 1.6392563797656634,
          2.277528103019149 0.9433830289562303 1.5305791292083677,
          2.319261889304186 -0.9606697292448411 1.6392563797656634,
          2.2775281030191494 -0.9433830289562294 1.5305791292083677,
          1.7750862007049373 -1.775086200704937 1.6392563797656634,
          1.7431445435427428 -1.7431445435427426 1.5305791292084385,
          0.9606697292448426 -2.3192618893041845 1.6392563797656634,
          0.943383028956231 -2.2775281030191477 1.5305791292083677,
          3.496758438359393e-16 -2.5103509794182517 1.6392563797656634,
          3.3329623983037863e-16 -2.4651786546547525 1.5305791292084385,
          -0.9606697292448421 -2.319261889304185 1.6392563797656634,
          -0.9433830289562305 -2.277528103019148 1.5305791292083677,
          -1.775086200704937 -1.7750862007049377 1.6392563797656634,
          -1.7431445435427426 -1.7431445435427433 1.5305791292084385,
          -2.319261889304185 -0.9606697292448428 1.6392563797656634,
          -2.277528103019148 -0.9433830289562312 1.5305791292083677,
          -2.461651958836504 0.4896530187969416 1.6392563797656634,
          -2.417351756381898 0.48084116065125404 1.5305748787051852,
          -2.461651958836504 -0.4896530187969422 1.6392563797656634,
          -2.417351756381898 -0.4808411606512546 1.5305748787051852,
          -2.0868877630342215 1.394413822994659 1.6392563797656634,
          -2.0493318648208607 1.369319774080571 1.5305748787051852,
          -1.394413822994659 2.0868877630342215 1.6392563797656634,
          -1.369319774080571 2.0493318648208607 1.5305748787051852,
          -0.48965301879694173 2.4616519588365042 1.6392563797656634,
          -0.48084116065125415 2.4173517563818985 1.5305748787051852,
          0.4896530187969413 2.4616519588365042 1.6392563797656634,
          0.4808411606512537 2.4173517563818985 1.5305748787051852,
          1.3944138229946585 2.0868877630342215 1.6392563797656634,
          1.3693197740805707 2.0493318648208607 1.5305748787051852,
          2.0868877630342215 1.394413822994659 1.6392563797656634,
          2.0493318648208607 1.369319774080571 1.5305748787051852,
          2.461651958836504 0.489653018796942 1.6392563797656634,
          2.417351756381898 0.48084116065125443 1.5305748787051852,
          2.0868877630342215 -1.3944138229946583 1.6392563797656634,
          2.0493318648208607 -1.3693197740805703 1.5305748787051852,
          1.3944138229946594 -2.0868877630342206 1.6392563797656634,
          1.3693197740805716 -2.0493318648208603 1.5305748787051852,
          0.48965301879694234 -2.4616519588365033 1.6392563797656634,
          0.48084116065125476 -2.417351756381897 1.5305748787051852,
          -0.48965301879694173 -2.461651958836504 1.6392563797656634,
          -0.48084116065125415 -2.4173517563818976 1.5305748787051852,
          -1.394413822994659 -2.086887763034221 1.6392563797656634,
          -1.369319774080571 -2.0493318648208603 1.5305748787051852,
          -2.0868877630342206 -1.3944138229946597 1.6392563797656634,
          -2.0493318648208603 -1.3693197740805716 1.5305748787051852,
          -2.461651958836504 0.48965301879694145 3.872543620234939,
          -2.4173517563813323 0.4808411606512539 3.9812251212950627,
          -2.461651958836504 -0.48965301879694234 3.872543620234939,
          -2.4173517563813323 -0.48084116065125476 3.9812251212950627,
          -2.0868877630342215 1.3944138229946585 3.872543620234939,
          -2.0493318648208607 1.3693197740805705 3.9812251212950627,
          -1.394413822994659 2.0868877630342206 3.872543620234939,
          -1.369319774080571 2.0493318648208603 3.9812251212950627,
          -0.48965301879694173 2.461651958836504 3.872543620234939,
          -0.48084116065125415 2.4173517563813323 3.9812251212950627,
          0.4896530187969413 2.461651958836504 3.872543620234939,
          0.4808411606512537 2.4173517563813323 3.9812251212950627,
          1.3944138229946585 2.086887763034221 3.872543620234939,
          1.3693197740805707 2.0493318648208603 3.9812251212950627,
          2.0868877630342215 1.3944138229946585 3.872543620234939,
          2.0493318648208607 1.3693197740805707 3.9812251212950627,
          2.461651958836504 0.4896530187969416 3.872543620234939,
          2.4173517563813323 0.48084116065125404 3.9812251212950627,
          2.0868877630342215 -1.3944138229946588 3.872543620234939,
          2.0493318648208607 -1.369319774080571 3.9812251212950627,
          1.3944138229946594 -2.0868877630342215 3.872543620234939,
          1.3693197740805716 -2.0493318648208607 3.9812251212950627,
          0.48965301879694234 -2.461651958836504 3.872543620234939,
          0.48084116065125476 -2.4173517563813323 3.9812251212950627,
          -0.48965301879694173 -2.461651958836504 3.872543620234939,
          -0.48084116065125415 -2.4173517563813323 3.9812251212950627,
          -1.394413822994659 -2.0868877630342215 3.872543620234939,
          -1.369319774080571 -2.0493318648208607 3.9812251212950627,
          -2.0868877630342206 -1.3944138229946599 3.872543620234939,
          -2.0493318648208603 -1.3693197740805718 3.9812251212950627,
          -0.4597361120380883 2.3112495120058 1.4229048073769996,
          -2.611873296448338e-16 2.3569688397399817 1.4229005568737714,
          0.45973611203808784 2.3112495120058 1.4229048073769996,
          0.9019729255694392 2.177555269803607 1.4229005568738622,
          1.3092176805753972 1.9593827253317007 1.4229048073769928,
          1.666628649625577 1.666628649625577 1.4229005568737845,
          1.9593827253317007 1.3092176805753977 1.4229048073769925,
          2.1775552698036065 0.9019729255694399 1.422900556873862,
          2.3112495120057996 0.4597361120380885 1.4229048073769994,
          2.177555269803607 -0.9019729255694391 1.422900556873862,
          1.9593827253317007 -1.309217680575397 1.4229048073769925,
          1.666628649625577 -1.6666286496255767 1.4229005568737845,
          1.3092176805753981 -1.9593827253317 1.4229048073769925,
          0.9019729255694406 -2.177555269803605 1.422900556873862,
          0.4597361120380889 -2.311249512005799 1.4229048073769994,
          2.9405907576850574e-16 -2.3569688397399813 1.4229005568737711,
          -0.4597361120380883 -2.3112495120057996 1.4229048073769994,
          -0.9019729255694401 -2.1775552698036056 1.422900556873862,
          -1.3092176805753977 -1.9593827253317002 1.4229048073769925,
          -1.6666286496255767 -1.6666286496255773 1.4229005568737845,
          -1.9593827253317 -1.3092176805753983 1.4229048073769925,
          -2.1775552698036056 -0.9019729255694408 1.422900556873862,
          -2.3112495120057996 -0.4597361120380887 1.4229048073769994,
          -2.3569688397399817 -1.2120921636919103e-17 1.4229005568737711,
          -2.3112495120057996 0.4597361120380882 1.4229048073769994,
          -2.1775552698036065 0.9019729255694398 1.422900556873862,
          -1.9593827253317007 1.3092176805753977 1.4229048073769925,
          -1.666628649625577 1.666628649625577 1.4229005568737845,
          -1.3092176805753977 1.9593827253317007 1.4229048073769928,
          -0.9019729255694398 2.177555269803607 1.4229005568738622,
          -1.3092176805753977 -1.9593827253317007 4.088895192623195,
          -0.9019729255694401 -2.1775552698036065 4.0888994431260945,
          -0.4597361120380883 -2.3112495120063654 4.088895192623195,
          3.4860629060381863e-16 -2.356968839740548 4.0888994431260945,
          0.4597361120380889 -2.3112495120063654 4.088895192623195,
          0.9019729255694406 -2.177555269803606 4.0888994431260945,
          1.3092176805753981 -1.9593827253317007 4.088895192623195,
          1.6666286496255773 -1.666628649625577 4.0888994431260945,
          1.9593827253317007 -1.3092176805753974 4.088895192623195,
          2.177555269803607 -0.9019729255694395 4.0888994431260945,
          2.3112495120063654 0.4597361120380882 4.088895192623195,
          2.1775552698036065 0.9019729255694395 4.0888994431260945,
          1.9593827253317007 1.3092176805753972 4.088895192623195,
          1.666628649625577 1.666628649625577 4.0888994431260945,
          1.3092176805753972 1.9593827253317002 4.088895192623195,
          0.9019729255694392 2.177555269803606 4.0888994431260945,
          0.45973611203808784 2.3112495120063654 4.088895192623195,
          -2.611873296448338e-16 2.3569688397405475 4.0888994431260945,
          -0.4597361120380883 2.3112495120063654 4.088895192623195,
          -0.9019729255694398 2.177555269803606 4.0888994431260945,
          -1.3092176805753977 1.9593827253317 4.088895192623195,
          -1.666628649625577 1.6666286496255767 4.0888994431260945,
          -1.9593827253317007 1.3092176805753972 4.088895192623195,
          -2.1775552698036065 0.9019729255694394 4.0888994431260945,
          -2.3112495120063654 0.459736112038088 4.088895192623195,
          -2.356968839740548 -2.848253402645642e-16 4.0888994431260945,
          -2.3112495120063654 -0.4597361120380889 4.088895192623195,
          -2.1775552698036056 -0.901972925569441 4.0888994431260945,
          -1.9593827253317 -1.3092176805753986 4.088895192623195,
          -1.6666286496255767 -1.6666286496255778 4.0888994431260945,
          -0.37705221409804457 1.8955694865285988 1.3779500000000002,
          -1.887800308694934e-16 1.933069660794541 1.3779500000000002,
          0.37705221409804424 1.8955694865285988 1.3779500000000002,
          0.7397537327936461 1.7859234945276075 1.3779500000000002,
          1.0737538606849713 1.606986215584408 1.37795,
          1.3668866656538943 1.3668866656538943 1.37795,
          1.6069862155844081 1.0737538606849715 1.37795,
          1.785923494527607 0.7397537327936465 1.37795,
          1.8955694865285986 0.37705221409804485 1.37795,
          1.933069660794541 3.783285604798208e-16 1.37795,
          1.8955694865285988 -0.377052214098044 1.37795,
          1.7859234945276075 -0.7397537327936458 1.37795,
          1.6069862155844081 -1.073753860684971 1.37795,
          1.3668866656538943 -1.3668866656538943 1.37795,
          1.073753860684972 -1.6069862155844075 1.37795,
          0.7397537327936472 -1.7859234945276063 1.37795,
          0.3770522140980452 -1.8955694865285981 1.37795,
          2.5363596592939155e-16 -1.9330696607945406 1.37795,
          -0.37705221409804457 -1.8955694865285981 1.37795,
          -0.7397537327936465 -1.7859234945276063 1.37795,
          -1.0737538606849715 -1.606986215584408 1.37795,
          -1.3668866656538943 -1.3668866656538947 1.37795,
          -1.6069862155844075 -1.0737538606849721 1.37795,
          -1.7859234945276063 -0.7397537327936472 1.37795,
          -1.8955694865285986 -0.37705221409804496 1.37795,
          -1.933069660794541 -3.1447361275445387e-19 1.37795,
          -1.8955694865285986 0.3770522140980445 1.37795,
          -1.785923494527607 0.7397537327936464 1.37795,
          -1.606986215584408 1.0737538606849715 1.37795,
          -1.3668866656538945 1.3668866656538943 1.37795,
          -1.0737538606849715 1.606986215584408 1.37795,
          -0.7397537327936462 1.7859234945276075 1.3779500000000002,
          -1.1137074927104589 -1.6667810515131303 4.13385,
          -0.7672794530836429 -1.852376461765844 4.13385,
          -0.3910820639249486 -1.9661023046319883 4.13385,
          3.2581126859911697e-16 -2.004997834219454 4.13385,
          0.3910820639249491 -1.9661023046319883 4.13385,
          0.7672794530836434 -1.8523764617658434 4.13385,
          1.1137074927104595 -1.6667810515131303 4.13385,
          1.4177475648410165 -1.4177475648410163 4.13385,
          1.6667810515131303 -1.1137074927104587 4.13385,
          1.852376461765844 -0.7672794530836424 4.13385,
          1.9661023046319888 -0.3910820639249483 4.13385,
          2.0049978342194543 6.999969175065024e-17 4.13385,
          1.9661023046319883 0.3910820639249485 4.13385,
          1.8523764617658438 0.7672794530836423 4.13385,
          1.6667810515131303 1.1137074927104587 4.13385,
          1.4177475648410163 1.417747564841016 4.13385,
          1.1137074927104587 1.6667810515131303 4.13385,
          0.7672794530836421 1.8523764617658434 4.13385,
          0.39108206392494815 1.9661023046319883 4.13385,
          -2.1636768167765802e-16 2.004997834219454 4.13385,
          -0.3910820639249486 1.9661023046319883 4.13385,
          -0.7672794530836425 1.8523764617658434 4.13385,
          -1.1137074927104589 1.6667810515131294 4.13385,
          -1.417747564841016 1.417747564841016 4.13385,
          -1.6667810515131303 1.1137074927104584 4.13385,
          -1.8523764617658438 0.7672794530836422 4.13385,
          -1.9661023046319883 0.3910820639249484 4.13385,
          -2.0049978342194543 -2.8047682445582975e-16 4.13385,
          -1.9661023046319883 -0.39108206392494915 4.13385,
          -1.8523764617658431 -0.7672794530836436 4.13385,
          -1.6667810515131294 -1.1137074927104595 4.13385,
          -1.4177475648410156 -1.417747564841017 4.13385,
          -0.37705221409804457 1.8955694865285988 1.541036335802242,
          -1.887800308694934e-16 1.933069660794541 1.541036335802242,
          0.37705221409804424 1.8955694865285988 1.541036335802242,
          0.7397537327936461 1.7859234945276075 1.541036335802242,
          1.0737538606849713 1.606986215584408 1.5410363358022419,
          1.3668866656538943 1.3668866656538943 1.5410363358022419,
          1.6069862155844081 1.0737538606849715 1.5410363358022419,
          1.785923494527607 0.7397537327936465 1.5410363358022419,
          1.8955694865285986 0.37705221409804485 1.5410363358022419,
          1.933069660794541 3.783285604798208e-16 1.5410363358022419,
          1.8955694865285988 -0.377052214098044 1.5410363358022419,
          1.7859234945276075 -0.7397537327936458 1.5410363358022419,
          1.6069862155844081 -1.073753860684971 1.5410363358022419,
          1.3668866656538943 -1.3668866656538943 1.5410363358022419,
          1.073753860684972 -1.6069862155844075 1.5410363358022419,
          0.7397537327936472 -1.7859234945276063 1.5410363358022419,
          0.3770522140980452 -1.8955694865285981 1.5410363358022419,
          2.5363596592939155e-16 -1.9330696607945406 1.5410363358022419,
          -0.37705221409804457 -1.8955694865285981 1.5410363358022419,
          -0.7397537327936465 -1.7859234945276063 1.5410363358022419,
          -1.0737538606849715 -1.606986215584408 1.5410363358022419,
          -1.3668866656538943 -1.3668866656538947 1.5410363358022419,
          -1.6069862155844075 -1.0737538606849721 1.5410363358022419,
          -1.7859234945276063 -0.7397537327936472 1.5410363358022419,
          -1.8955694865285986 -0.37705221409804496 1.5410363358022419,
          -1.933069660794541 -3.1447361275445387e-19 1.5410363358022419,
          -1.8955694865285986 0.3770522140980445 1.5410363358022419,
          -1.785923494527607 0.7397537327936464 1.5410363358022419,
          -1.606986215584408 1.0737538606849715 1.5410363358022419,
          -1.3668866656538945 1.3668866656538943 1.5410363358022419,
          -1.0737538606849715 1.606986215584408 1.5410363358022419,
          -0.7397537327936462 1.7859234945276075 1.541036335802242,
          -1.1137074927104589 -1.6667810515131303 3.965007675875326,
          -0.7672794530836429 -1.852376461765844 3.965007675875326,
          -0.3910820639249486 -1.9661023046319883 3.965007675875326,
          3.2581126859911697e-16 -2.004997834219454 3.965007675875326,
          0.3910820639249491 -1.9661023046319883 3.965007675875326,
          0.7672794530836434 -1.8523764617658434 3.965007675875326,
          1.1137074927104595 -1.6667810515131303 3.965007675875326,
          1.4177475648410165 -1.4177475648410163 3.965007675875326,
          1.6667810515131303 -1.1137074927104587 3.965007675875326,
          1.852376461765844 -0.7672794530836424 3.965007675875326,
          1.9661023046319888 -0.3910820639249483 3.965007675875326,
          2.0049978342194543 6.999969175065024e-17 3.965007675875326,
          1.9661023046319883 0.3910820639249485 3.965007675875326,
          1.8523764617658438 0.7672794530836423 3.965007675875326,
          1.6667810515131303 1.1137074927104587 3.965007675875326,
          1.4177475648410163 1.417747564841016 3.965007675875326,
          1.1137074927104587 1.6667810515131303 3.965007675875326,
          0.7672794530836421 1.8523764617658434 3.965007675875326,
          0.39108206392494815 1.9661023046319883 3.965007675875326,
          -2.1636768167765802e-16 2.004997834219454 3.965007675875326,
          -0.3910820639249486 1.9661023046319883 3.965007675875326,
          -0.7672794530836425 1.8523764617658434 3.965007675875326,
          -1.1137074927104589 1.6667810515131294 3.965007675875326,
          -1.417747564841016 1.417747564841016 3.965007675875326,
          -1.6667810515131303 1.1137074927104584 3.965007675875326,
          -1.8523764617658438 0.7672794530836422 3.965007675875326,
          -1.9661023046319883 0.3910820639249484 3.965007675875326,
          -2.0049978342194543 -2.8047682445582975e-16 3.965007675875326,
          -1.9661023046319883 -0.39108206392494915 3.965007675875326,
          -1.8523764617658431 -0.7672794530836436 3.965007675875326,
          -1.6667810515131294 -1.1137074927104595 3.965007675875326,
          -1.4177475648410156 -1.417747564841017 3.965007675875326 ] }
        coordIndex [
          0, 1, 91, 90, -1,
          0, 30, 62, 92, -1,
          0, 90, 60, 30, -1,
          0, 92, 93, 1, -1,
          1, 93, 176, 175, -1,
          1, 175, 174, 91, -1,
          2, 3, 95, 94, -1,
          2, 32, 60, 90, -1,
          2, 90, 91, 3, -1,
          2, 94, 64, 32, -1,
          3, 91, 174, 173, -1,
          3, 173, 172, 95, -1,
          4, 5, 97, 96, -1,
          4, 34, 64, 94, -1,
          4, 94, 95, 5, -1,
          4, 96, 66, 34, -1,
          5, 95, 172, 171, -1,
          5, 171, 170, 97, -1,
          6, 7, 99, 98, -1,
          6, 36, 66, 96, -1,
          6, 96, 97, 7, -1,
          6, 98, 68, 36, -1,
          7, 97, 170, 169, -1,
          7, 169, 168, 99, -1,
          8, 9, 101, 100, -1,
          8, 38, 68, 98, -1,
          8, 98, 99, 9, -1,
          8, 100, 70, 38, -1,
          9, 99, 168, 167, -1,
          9, 167, 166, 101, -1,
          10, 11, 103, 102, -1,
          10, 40, 70, 100, -1,
          10, 100, 101, 11, -1,
          10, 102, 72, 40, -1,
          11, 101, 166, 165, -1,
          11, 165, 164, 103, -1,
          12, 13, 105, 104, -1,
          12, 42, 72, 102, -1,
          12, 102, 103, 13, -1,
          12, 104, 74, 42, -1,
          13, 103, 164, 163, -1,
          13, 163, 162, 105, -1,
          14, 15, 107, 106, -1,
          14, 44, 74, 104, -1,
          14, 104, 105, 15, -1,
          14, 106, 76, 44, -1,
          15, 105, 162, 161, -1,
          15, 161, 160, 107, -1,
          16, 17, 109, 108, -1,
          16, 108, 78, 46, -1,
          17, 159, 158, 109, -1,
          18, 19, 111, 110, -1,
          18, 48, 78, 108, -1,
          18, 108, 109, 19, -1,
          18, 110, 80, 48, -1,
          19, 109, 158, 157, -1,
          19, 157, 156, 111, -1,
          20, 21, 113, 112, -1,
          20, 50, 80, 110, -1,
          20, 110, 111, 21, -1,
          20, 112, 82, 50, -1,
          21, 111, 156, 155, -1,
          21, 155, 154, 113, -1,
          22, 23, 115, 114, -1,
          22, 52, 82, 112, -1,
          22, 112, 113, 23, -1,
          22, 114, 84, 52, -1,
          23, 113, 154, 153, -1,
          23, 153, 152, 115, -1,
          24, 25, 117, 116, -1,
          24, 54, 84, 114, -1,
          24, 114, 115, 25, -1,
          24, 116, 86, 54, -1,
          25, 115, 152, 151, -1,
          25, 151, 150, 117, -1,
          26, 27, 119, 118, -1,
          26, 56, 86, 116, -1,
          26, 116, 117, 27, -1,
          26, 118, 88, 56, -1,
          27, 117, 150, 179, -1,
          27, 179, 178, 119, -1,
          28, 29, 93, 92, -1,
          28, 58, 88, 118, -1,
          28, 92, 62, 58, -1,
          28, 118, 119, 29, -1,
          29, 119, 178, 177, -1,
          29, 177, 176, 93, -1,
          30, 31, 63, 62, -1,
          30, 60, 61, 31, -1,
          31, 61, 144, 143, -1,
          31, 143, 142, 63, -1,
          32, 33, 61, 60, -1,
          32, 64, 65, 33, -1,
          33, 65, 146, 145, -1,
          33, 145, 144, 61, -1,
          34, 35, 65, 64, -1,
          34, 66, 67, 35, -1,
          35, 67, 148, 147, -1,
          35, 147, 146, 65, -1,
          36, 37, 67, 66, -1,
          36, 68, 69, 37, -1,
          37, 69, 120, 149, -1,
          37, 149, 148, 67, -1,
          38, 39, 69, 68, -1,
          38, 70, 71, 39, -1,
          39, 71, 122, 121, -1,
          39, 121, 120, 69, -1,
          40, 41, 71, 70, -1,
          40, 72, 73, 41, -1,
          41, 73, 124, 123, -1,
          41, 123, 122, 71, -1,
          42, 43, 73, 72, -1,
          42, 74, 75, 43, -1,
          43, 75, 126, 125, -1,
          43, 125, 124, 73, -1,
          44, 45, 75, 74, -1,
          44, 76, 77, 45, -1,
          45, 77, 128, 127, -1,
          45, 127, 126, 75, -1,
          46, 78, 79, 47, -1,
          47, 79, 130, 129, -1,
          48, 49, 79, 78, -1,
          48, 80, 81, 49, -1,
          49, 81, 132, 131, -1,
          49, 131, 130, 79, -1,
          50, 51, 81, 80, -1,
          50, 82, 83, 51, -1,
          51, 83, 134, 133, -1,
          51, 133, 132, 81, -1,
          52, 53, 83, 82, -1,
          52, 84, 85, 53, -1,
          53, 85, 136, 135, -1,
          53, 135, 134, 83, -1,
          54, 55, 85, 84, -1,
          54, 86, 87, 55, -1,
          55, 87, 138, 137, -1,
          55, 137, 136, 85, -1,
          56, 57, 87, 86, -1,
          56, 88, 89, 57, -1,
          57, 89, 140, 139, -1,
          57, 139, 138, 87, -1,
          58, 59, 89, 88, -1,
          58, 62, 63, 59, -1,
          59, 63, 142, 141, -1,
          59, 141, 140, 89, -1,
          120, 121, 181, 180, -1,
          120, 180, 211, 149, -1,
          121, 122, 182, 181, -1,
          122, 123, 183, 182, -1,
          123, 124, 184, 183, -1,
          124, 125, 185, 184, -1,
          125, 126, 186, 185, -1,
          126, 127, 187, 186, -1,
          127, 128, 188, 187, -1,
          129, 130, 192, 191, -1,
          130, 131, 193, 192, -1,
          131, 132, 194, 193, -1,
          132, 133, 195, 194, -1,
          133, 134, 196, 195, -1,
          134, 135, 197, 196, -1,
          135, 136, 198, 197, -1,
          136, 137, 199, 198, -1,
          137, 138, 200, 199, -1,
          138, 139, 201, 200, -1,
          139, 140, 202, 201, -1,
          140, 141, 203, 202, -1,
          141, 142, 204, 203, -1,
          142, 143, 205, 204, -1,
          143, 144, 206, 205, -1,
          144, 145, 207, 206, -1,
          145, 146, 208, 207, -1,
          146, 147, 209, 208, -1,
          147, 148, 210, 209, -1,
          148, 149, 211, 210, -1,
          150, 151, 213, 212, -1,
          150, 212, 243, 179, -1,
          151, 152, 214, 213, -1,
          152, 153, 215, 214, -1,
          153, 154, 216, 215, -1,
          154, 155, 217, 216, -1,
          155, 156, 218, 217, -1,
          156, 157, 219, 218, -1,
          157, 158, 220, 219, -1,
          158, 159, 221, 220, -1,
          160, 161, 225, 224, -1,
          161, 162, 226, 225, -1,
          162, 163, 227, 226, -1,
          163, 164, 228, 227, -1,
          164, 165, 229, 228, -1,
          165, 166, 230, 229, -1,
          166, 167, 231, 230, -1,
          167, 168, 232, 231, -1,
          168, 169, 233, 232, -1,
          169, 170, 234, 233, -1,
          170, 171, 235, 234, -1,
          171, 172, 236, 235, -1,
          172, 173, 237, 236, -1,
          173, 174, 238, 237, -1,
          174, 175, 239, 238, -1,
          175, 176, 240, 239, -1,
          176, 177, 241, 240, -1,
          177, 178, 242, 241, -1,
          178, 179, 243, 242, -1,
          180, 181, 245, 244, -1,
          180, 244, 275, 211, -1,
          181, 182, 246, 245, -1,
          182, 183, 247, 246, -1,
          183, 184, 248, 247, -1,
          184, 185, 249, 248, -1,
          185, 186, 250, 249, -1,
          186, 187, 251, 250, -1,
          187, 188, 252, 251, -1,
          188, 189, 253, 252, -1,
          189, 190, 254, 253, -1,
          190, 191, 255, 254, -1,
          191, 192, 256, 255, -1,
          192, 193, 257, 256, -1,
          193, 194, 258, 257, -1,
          194, 195, 259, 258, -1,
          195, 196, 260, 259, -1,
          196, 197, 261, 260, -1,
          197, 198, 262, 261, -1,
          198, 199, 263, 262, -1,
          199, 200, 264, 263, -1,
          200, 201, 265, 264, -1,
          201, 202, 266, 265, -1,
          202, 203, 267, 266, -1,
          203, 204, 268, 267, -1,
          204, 205, 269, 268, -1,
          205, 206, 270, 269, -1,
          206, 207, 271, 270, -1,
          207, 208, 272, 271, -1,
          208, 209, 273, 272, -1,
          209, 210, 274, 273, -1,
          210, 211, 275, 274, -1,
          212, 213, 277, 276, -1,
          212, 276, 307, 243, -1,
          213, 214, 278, 277, -1,
          214, 215, 279, 278, -1,
          215, 216, 280, 279, -1,
          216, 217, 281, 280, -1,
          217, 218, 282, 281, -1,
          218, 219, 283, 282, -1,
          219, 220, 284, 283, -1,
          220, 221, 285, 284, -1,
          221, 222, 286, 285, -1,
          222, 223, 287, 286, -1,
          223, 224, 288, 287, -1,
          224, 225, 289, 288, -1,
          225, 226, 290, 289, -1,
          226, 227, 291, 290, -1,
          227, 228, 292, 291, -1,
          228, 229, 293, 292, -1,
          229, 230, 294, 293, -1,
          230, 231, 295, 294, -1,
          231, 232, 296, 295, -1,
          232, 233, 297, 296, -1,
          233, 234, 298, 297, -1,
          234, 235, 299, 298, -1,
          235, 236, 300, 299, -1,
          236, 237, 301, 300, -1,
          237, 238, 302, 301, -1,
          238, 239, 303, 302, -1,
          239, 240, 304, 303, -1,
          240, 241, 305, 304, -1,
          241, 242, 306, 305, -1,
          242, 243, 307, 306, -1 ]
        normal Normal { vector [
          -0.9806500120500515 3.9094283198732083e-17 0.19576913409992353,
          -0.830343099810262 2.1297820474236888e-17 0.5572524890904349,
          -0.9060024746902369 0.37527851256019124 0.19576913409875688,
          -0.7671369948770317 0.3177585474760821 0.5572524890899344,
          -0.6934242734915315 0.6934242734915317 0.19576913409800611,
          -0.5871412365871951 0.5871412365871952 0.5572524890906444,
          -0.37527851256019185 0.9060024746902368 0.19576913409875657,
          -0.3177585474760826 0.7671369948770316 0.5572524890899342,
          -1.066207723601784e-17 0.9806500120500515 0.19576913409992364,
          -1.0648910237118444e-17 0.830343099810262 0.557252489090435,
          0.37527851256019157 0.9060024746902368 0.19576913409875685,
          0.31775854747608234 0.7671369948770316 0.5572524890899344,
          0.6934242734915314 0.6934242734915318 0.19576913409800614,
          0.5871412365871951 0.5871412365871954 0.5572524890906442,
          0.9060024746902369 0.37527851256019135 0.19576913409875685,
          0.7671369948770316 0.3177585474760821 0.5572524890899345,
          0.906002474690237 -0.3752785125601916 0.19576913409875601,
          0.7671369948770319 -0.31775854747608245 0.557252489089934,
          0.6934242734915319 -0.6934242734915314 0.19576913409800595,
          0.5871412365871954 -0.5871412365871949 0.5572524890906444,
          0.3752785125601915 -0.9060024746902369 0.19576913409875657,
          0.3177585474760821 -0.7671369948770317 0.5572524890899344,
          1.1728284959619624e-16 -0.9806500120500515 0.19576913409992347,
          3.549636745706148e-18 -0.830343099810262 0.5572524890904349,
          -0.3752785125601914 -0.9060024746902369 0.1957691340987567,
          -0.3177585474760821 -0.7671369948770317 0.5572524890899344,
          -0.6934242734915315 -0.6934242734915318 0.19576913409800592,
          -0.587141236587195 -0.5871412365871953 0.5572524890906443,
          -0.9060024746902366 -0.375278512560192 0.1957691340987565,
          -0.7671369948770316 -0.3177585474760826 0.5572524890899343,
          -0.9806500120505435 4.97563604347251e-17 -0.19576913409745886,
          -0.8303430998107125 4.259564094850927e-17 -0.5572524890897637,
          -0.9060024746903548 0.37527851256035927 -0.19576913409788899,
          -0.7671369948774854 0.31775854747643667 -0.5572524890891078,
          -0.6934242734915718 0.6934242734915719 -0.19576913409772131,
          -0.5871412365876698 0.5871412365876699 -0.557252489089644,
          -0.3752785125603598 0.9060024746903547 -0.1957691340978883,
          -0.31775854747643717 0.7671369948774853 -0.5572524890891075,
          -7.108051490675014e-18 0.9806500120505436 -0.19576913409745877,
          -1.0648910237127316e-17 0.8303430998107122 -0.557252489089764,
          0.3752785125603597 0.9060024746903548 -0.19576913409788824,
          0.317758547476437 0.7671369948774854 -0.5572524890891074,
          0.6934242734915717 0.6934242734915719 -0.19576913409772123,
          0.5871412365876698 0.5871412365876701 -0.5572524890896439,
          0.9060024746903547 0.37527851256035943 -0.19576913409788904,
          0.7671369948774853 0.3177585474764368 -0.557252489089108,
          0.9060024746903548 -0.3752785125603597 -0.19576913409788838,
          0.7671369948774855 -0.31775854747643717 -0.5572524890891071,
          0.6934242734915721 -0.6934242734915717 -0.19576913409772104,
          0.5871412365876701 -0.5871412365876698 -0.5572524890896435,
          0.37527851256035955 -0.9060024746903547 -0.1957691340978891,
          0.3177585474764368 -0.7671369948774854 -0.5572524890891076,
          3.269703685710507e-16 -0.9806500120505434 -0.19576913409745983,
          3.8691040528229243e-16 -0.8303430998107123 -0.557252489089764,
          -0.3752785125603595 -0.9060024746903546 -0.1957691340978895,
          -0.3177585474764369 -0.7671369948774852 -0.557252489089108,
          -0.6934242734915717 -0.6934242734915721 -0.1957691340977211,
          -0.5871412365876697 -0.5871412365876701 -0.5572524890896438,
          -0.9060024746903546 -0.37527851256036004 -0.19576913409788874,
          -0.7671369948774853 -0.3177585474764373 -0.5572524890891076,
          -0.9618140421723642 0.1913167081075242 -0.19573365954520444,
          -0.8144359520272938 0.16200138329675381 -0.557180071301311,
          -0.9618140421723641 -0.19131670810752482 -0.19573365954520452,
          -0.8144359520272936 -0.16200138329675434 -0.557180071301311,
          -0.8153865731175987 0.5448238898033514 -0.1957336595455274,
          -0.6904454612113876 0.4613409078298637 -0.5571800713012909,
          -0.5448238898033515 0.8153865731175988 -0.19573365954552704,
          -0.46134090782986387 0.6904454612113875 -0.5571800713012908,
          -0.1913167081075242 0.9618140421723643 -0.19573365954520405,
          -0.16200138329675365 0.8144359520272937 -0.5571800713013111,
          0.19131670810752424 0.9618140421723643 -0.19573365954520405,
          0.16200138329675365 0.8144359520272937 -0.5571800713013111,
          0.5448238898033512 0.815386573117599 -0.19573365954552688,
          0.4613409078298637 0.6904454612113877 -0.5571800713012908,
          0.8153865731175987 0.5448238898033514 -0.1957336595455274,
          0.6904454612113874 0.46134090782986376 -0.5571800713012909,
          0.9618140421723642 0.19131670810752427 -0.1957336595452045,
          0.8144359520272937 0.16200138329675384 -0.557180071301311,
          0.8153865731175989 -0.5448238898033513 -0.19573365954552716,
          0.6904454612113877 -0.46134090782986376 -0.5571800713012905,
          0.5448238898033513 -0.815386573117599 -0.19573365954552663,
          0.46134090782986364 -0.6904454612113881 -0.5571800713012903,
          0.1913167081075248 -0.9618140421723639 -0.19573365954520544,
          0.16200138329675445 -0.8144359520272934 -0.5571800713013113,
          -0.19131670810752435 -0.961814042172364 -0.19573365954520539,
          -0.162001383296754 -0.8144359520272935 -0.5571800713013113,
          -0.544823889803351 -0.815386573117599 -0.19573365954552754,
          -0.46134090782986314 -0.6904454612113878 -0.557180071301291,
          -0.8153865731175989 -0.5448238898033514 -0.1957336595455268,
          -0.6904454612113877 -0.4613409078298637 -0.5571800713012905,
          -0.961814042172008 0.1913167081073483 0.19573365954712627,
          -0.8144359520268678 0.16200138329651836 0.5571800713020021,
          -0.9618140421720079 -0.19131670810734894 0.19573365954712624,
          -0.8144359520268677 -0.16200138329651886 0.557180071302002,
          -0.8153865731175505 0.544823889803312 0.1957336595458382,
          -0.6904454612108663 0.4613409078295024 0.557180071302236,
          -0.544823889803312 0.8153865731175506 0.19573365954583755,
          -0.46134090782950254 0.6904454612108665 0.5571800713022356,
          -0.1913167081073483 0.961814042172008 0.19573365954712635,
          -0.16200138329651836 0.8144359520268678 0.5571800713020021,
          0.19131670810734838 0.961814042172008 0.19573365954712635,
          0.16200138329651836 0.8144359520268678 0.5571800713020021,
          0.5448238898033116 0.8153865731175509 0.195733659545838,
          0.4613409078295021 0.6904454612108667 0.5571800713022358,
          0.8153865731175506 0.544823889803312 0.19573365954583802,
          0.6904454612108663 0.46134090782950243 0.5571800713022358,
          0.961814042172008 0.1913167081073483 0.19573365954712627,
          0.8144359520268678 0.16200138329651836 0.5571800713020021,
          0.8153865731175507 -0.5448238898033119 0.1957336595458375,
          0.6904454612108665 -0.46134090782950243 0.5571800713022356,
          0.5448238898033119 -0.8153865731175507 0.1957336595458378,
          0.46134090782950243 -0.6904454612108664 0.5571800713022359,
          0.19131670810734874 -0.961814042172008 0.1957336595471261,
          0.1620013832965186 -0.8144359520268678 0.5571800713020021,
          -0.19131670810734824 -0.961814042172008 0.19573365954712615,
          -0.16200138329651823 -0.8144359520268678 0.5571800713020021,
          -0.5448238898033118 -0.8153865731175507 0.19573365954583802,
          -0.4613409078295024 -0.6904454612108664 0.5571800713022359,
          -0.8153865731175507 -0.5448238898033121 0.1957336595458374,
          -0.6904454612108665 -0.4613409078295025 0.5571800713022356,
          -0.08379225269244622 0.4212521010957301 -0.9030645191298118,
          -7.365941815145648e-18 0.4294386175986056 -0.9030960489975575,
          0.08379225269244622 0.42125210109573014 -0.9030645191298118,
          0.16433904417319267 0.3967495492703277 -0.9030960489970229,
          0.23862014718430374 0.3571202873638571 -0.9030645191296675,
          0.3036589586076113 0.30365895860761155 -0.9030960489973822,
          0.3571202873638571 0.23862014718430408 -0.9030645191296672,
          0.3967495492703279 0.1643390441731927 -0.9030960489970229,
          0.4212521010957304 0.08379225269244647 -0.9030645191298116,
          0.3967495492703279 -0.16433904417319284 -0.9030960489970227,
          0.35712028736385715 -0.23862014718430408 -0.9030645191296672,
          0.3036589586076114 -0.30365895860761116 -0.9030960489973822,
          0.23862014718430372 -0.35712028736385687 -0.9030645191296675,
          0.16433904417319276 -0.396749549270328 -0.9030960489970227,
          0.08379225269244683 -0.42125210109573075 -0.9030645191298112,
          1.9703894355514614e-16 -0.4294386175986065 -0.9030960489975569,
          -0.08379225269244661 -0.42125210109573075 -0.9030645191298112,
          -0.16433904417319287 -0.3967495492703281 -0.9030960489970227,
          -0.23862014718430366 -0.35712028736385715 -0.9030645191296672,
          -0.30365895860761105 -0.30365895860761133 -0.9030960489973823,
          -0.35712028736385687 -0.2386201471843038 -0.9030645191296675,
          -0.3967495492703277 -0.1643390441731929 -0.9030960489970229,
          -0.4212521010957304 -0.08379225269244671 -0.9030645191298116,
          -0.42943861759860613 2.1637454081990348e-17 -0.9030960489975571,
          -0.42125210109573047 0.08379225269244645 -0.9030645191298116,
          -0.3967495492703279 0.16433904417319267 -0.9030960489970229,
          -0.35712028736385715 0.23862014718430397 -0.9030645191296672,
          -0.3036589586076114 0.3036589586076115 -0.9030960489973822,
          -0.23862014718430388 0.35712028736385704 -0.9030645191296673,
          -0.16433904417319276 0.39674954927032774 -0.903096048997023,
          -0.24397916995639052 -0.36514063172675765 0.8984133145104067,
          -0.16803010986202743 -0.405660570115975 0.8984460941163566,
          -0.08567409123652324 -0.4307127423265097 0.8984133145097382,
          1.3760291449772974e-18 -0.4390838370601733 0.8984460941161219,
          0.08567409123652343 -0.43071274232650963 0.8984133145097382,
          0.16803010986202746 -0.40566057011597495 0.8984460941163566,
          0.24397916995639038 -0.3651406317267575 0.8984133145104068,
          0.31047915869332354 -0.3104791586933232 0.898446094117044,
          0.3651406317267576 -0.24397916995639043 0.8984133145104068,
          0.40566057011597484 -0.16803010986202754 0.8984460941163567,
          0.4307127423265098 0.08567409123652335 0.898413314509738,
          0.40566057011597495 0.16803010986202746 0.8984460941163566,
          0.3651406317267576 0.24397916995639043 0.8984133145104068,
          0.3104791586933233 0.31047915869332354 0.8984460941170439,
          0.2439791699563903 0.36514063172675787 0.8984133145104067,
          0.16803010986202763 0.40566057011597506 0.8984460941163566,
          0.08567409123652331 0.4307127423265097 0.898413314509738,
          -3.669411053272793e-18 0.43908383706017334 0.8984460941161218,
          -0.08567409123652331 0.4307127423265097 0.898413314509738,
          -0.16803010986202765 0.40566057011597484 0.8984460941163567,
          -0.24397916995639038 0.3651406317267575 0.8984133145104068,
          -0.3104791586933233 0.3104791586933234 0.898446094117044,
          -0.36514063172675754 0.2439791699563905 0.8984133145104067,
          -0.40566057011597495 0.16803010986202746 0.8984460941163566,
          -0.4307127423265097 0.08567409123652331 0.8984133145097382,
          -0.43908383706017334 9.173527633181981e-18 0.8984460941161218,
          -0.43071274232650963 -0.0856740912365236 0.8984133145097382,
          -0.40566057011597484 -0.16803010986202765 0.8984460941163567,
          -0.3651406317267575 -0.24397916995639035 0.8984133145104068,
          -0.31047915869332326 -0.31047915869332343 0.8984460941170439,
          0.130094198451124 -0.6540277015743186 -0.7452001510351254,
          0.0 -0.6667715326136467 -0.7452621842654091,
          -0.13009419845112394 -0.6540277015743187 -0.7452001510351254,
          -0.2551624187039378 -0.6160165718427801 -0.7452621842655275,
          -0.37047693294916106 -0.5544579127849463 -0.7452001510351054,
          -0.47147867221324563 -0.47147867221324596 -0.7452621842654231,
          -0.5544579127849465 -0.3704769329491608 -0.7452001510351053,
          -0.6160165718427805 -0.2551624187039376 -0.7452621842655275,
          -0.6540277015743186 -0.13009419845112435 -0.7452001510351254,
          -0.6667715326136467 -1.8722077344888306e-16 -0.7452621842654091,
          -0.6540277015743186 0.13009419845112397 -0.7452001510351254,
          -0.6160165718427804 0.2551624187039376 -0.7452621842655275,
          -0.5544579127849465 0.3704769329491608 -0.7452001510351054,
          -0.4714786722132458 0.4714786722132459 -0.7452621842654231,
          -0.37047693294916073 0.5544579127849465 -0.7452001510351054,
          -0.25516241870393774 0.6160165718427804 -0.7452621842655275,
          -0.13009419845112435 0.6540277015743186 -0.7452001510351254,
          3.1203462241480506e-17 0.6667715326136467 -0.7452621842654091,
          0.1300941984511244 0.6540277015743186 -0.7452001510351254,
          0.25516241870393735 0.6160165718427805 -0.7452621842655275,
          0.37047693294916006 0.5544579127849469 -0.7452001510351053,
          0.47147867221324574 0.4714786722132459 -0.7452621842654231,
          0.5544579127849466 0.37047693294916045 -0.7452001510351053,
          0.6160165718427802 0.2551624187039379 -0.7452621842655275,
          0.6540277015743184 0.1300941984511247 -0.7452001510351253,
          0.6667715326136467 -4.160461632197401e-17 -0.745262184265409,
          0.6540277015743186 -0.13009419845112427 -0.7452001510351254,
          0.6160165718427804 -0.2551624187039377 -0.7452621842655275,
          0.5544579127849465 -0.3704769329491607 -0.7452001510351053,
          0.4714786722132459 -0.47147867221324563 -0.7452621842654231,
          0.370476932949161 -0.5544579127849463 -0.7452001510351054,
          0.2551624187039378 -0.6160165718427801 -0.7452621842655275,
          0.36601152971801876 0.5477749645766771 0.7523151921212918,
          0.2520864096616909 0.6085904290950996 0.752376323177252,
          0.12852615736019357 0.6461446266725187 0.7523151921212639,
          -1.579044971033565e-17 0.6587335336253013 0.7523763231771212,
          -0.1285261573601941 0.6461446266725185 0.752315192121264,
          -0.2520864096616909 0.6085904290950997 0.752376323177252,
          -0.36601152971801837 0.5477749645766771 0.7523151921212918,
          -0.46579494862136656 0.4657949486213659 0.7523763231771966,
          -0.5477749645766772 0.3660115297180185 0.7523151921212918,
          -0.6085904290950994 0.25208640966169116 0.752376323177252,
          -0.6461446266725187 0.12852615736019407 0.7523151921212639,
          -0.6587335336253014 -3.789707930480556e-16 0.7523763231771212,
          -0.6461446266725187 -0.1285261573601943 0.7523151921212639,
          -0.6085904290950996 -0.2520864096616908 0.752376323177252,
          -0.5477749645766771 -0.3660115297180185 0.7523151921212918,
          -0.46579494862136633 -0.46579494862136617 0.7523763231771966,
          -0.3660115297180181 -0.5477749645766774 0.7523151921212918,
          -0.25208640966169077 -0.6085904290950997 0.7523763231772519,
          -0.12852615736019427 -0.6461446266725186 0.752315192121264,
          0.0 -0.6587335336253014 0.7523763231771212,
          0.12852615736019427 -0.6461446266725186 0.752315192121264,
          0.2520864096616915 -0.6085904290950994 0.752376323177252,
          0.3660115297180185 -0.5477749645766771 0.7523151921212918,
          0.465794948621366 -0.4657949486213665 0.7523763231771966,
          0.5477749645766771 -0.3660115297180185 0.7523151921212918,
          0.6085904290950996 -0.2520864096616909 0.752376323177252,
          0.6461446266725185 -0.12852615736019427 0.752315192121264,
          0.6587335336253013 -3.15808994206713e-17 0.7523763231771212,
          0.6461446266725183 0.12852615736019457 0.752315192121264,
          0.6085904290950994 0.25208640966169155 0.752376323177252,
          0.5477749645766771 0.3660115297180187 0.7523151921212917,
          0.4657949486213664 0.4657949486213662 0.7523763231771965,
          0.17432835546700762 -0.87640782604235 -0.44890861757365547,
          4.9846358153206783e-17 -0.8935437759727541 -0.4489760800091167,
          -0.17432835546700745 -0.87640782604235 -0.44890861757365547,
          -0.3419443991577711 -0.8255268060240051 -0.44897608000920863,
          -0.49644515457558785 -0.742982679183398 -0.44890861757364464,
          -0.6318308632773617 -0.6318308632773622 -0.44897608000913264,
          -0.742982679183398 -0.49644515457558763 -0.44890861757364464,
          -0.8255268060240053 -0.3419443991577709 -0.44897608000920863,
          -0.87640782604235 -0.17432835546700803 -0.4489086175736555,
          -0.8935437759727541 -2.4300099599688306e-16 -0.4489760800091167,
          -0.8764078260423501 0.1743283554670076 -0.4489086175736555,
          -0.8255268060240052 0.341944399157771 -0.4489760800092087,
          -0.742982679183398 0.49644515457558774 -0.44890861757364464,
          -0.6318308632773619 0.6318308632773619 -0.44897608000913264,
          -0.4964451545755876 0.7429826791833981 -0.44890861757364464,
          -0.3419443991577711 0.8255268060240052 -0.44897608000920863,
          -0.17432835546700806 0.87640782604235 -0.44890861757365547,
          5.607715292235763e-17 0.8935437759727541 -0.4489760800091167,
          0.17432835546700817 0.8764078260423499 -0.44890861757365547,
          0.34194439915777064 0.8255268060240053 -0.4489760800092085,
          0.49644515457558686 0.7429826791833987 -0.44890861757364464,
          0.6318308632773618 0.631830863277362 -0.44897608000913264,
          0.7429826791833983 0.49644515457558724 -0.44890861757364453,
          0.8255268060240052 0.3419443991577715 -0.44897608000920863,
          0.8764078260423499 0.17432835546700853 -0.44890861757365547,
          0.8935437759727541 -4.3615563384055935e-17 -0.4489760800091167,
          0.87640782604235 -0.17432835546700795 -0.44890861757365547,
          0.8255268060240053 -0.34194439915777103 -0.44897608000920863,
          0.7429826791833982 -0.4964451545755876 -0.44890861757364464,
          0.6318308632773619 -0.6318308632773619 -0.44897608000913264,
          0.49644515457558785 -0.742982679183398 -0.44890861757364464,
          0.3419443991577712 -0.8255268060240051 -0.44897608000920863,
          0.49644515457558774 0.742982679183398 0.44890861757364453,
          0.3419443991577709 0.8255268060240053 0.44897608000920863,
          0.1743283554670071 0.8764078260423502 0.44890861757365547,
          1.8692384307452544e-17 0.8935437759727541 0.4489760800091167,
          -0.1743283554670077 0.87640782604235 0.44890861757365547,
          -0.3419443991577708 0.8255268060240054 0.44897608000920863,
          -0.49644515457558736 0.7429826791833982 0.44890861757364464,
          -0.6318308632773624 0.6318308632773615 0.44897608000913264,
          -0.7429826791833982 0.49644515457558747 0.44890861757364464,
          -0.8255268060240051 0.3419443991577712 0.44897608000920863,
          -0.87640782604235 0.17432835546700762 0.44890861757365547,
          -0.8935437759727541 -5.109251710703696e-16 0.4489760800091167,
          -0.87640782604235 -0.17432835546700795 0.44890861757365547,
          -0.8255268060240053 -0.34194439915777086 0.4489760800092087,
          -0.7429826791833982 -0.49644515457558747 0.44890861757364464,
          -0.6318308632773619 -0.6318308632773619 0.44897608000913264,
          -0.49644515457558697 -0.7429826791833986 0.44890861757364464,
          -0.34194439915777064 -0.8255268060240053 0.4489760800092085,
          -0.1743283554670079 -0.87640782604235 0.4489086175736555,
          3.738476861490509e-17 -0.8935437759727541 0.4489760800091167,
          0.17432835546700798 -0.87640782604235 0.4489086175736555,
          0.34194439915777164 -0.8255268060240049 0.44897608000920863,
          0.49644515457558747 -0.7429826791833982 0.44890861757364464,
          0.6318308632773617 -0.6318308632773623 0.4489760800091327,
          0.7429826791833982 -0.4964451545755876 0.44890861757364464,
          0.8255268060240053 -0.3419443991577708 0.44897608000920863,
          0.87640782604235 -0.17432835546700792 0.44890861757365547,
          0.8935437759727541 -3.738476861490509e-17 0.4489760800091167,
          0.8764078260423499 0.1743283554670084 0.44890861757365547,
          0.8255268060240049 0.3419443991577717 0.44897608000920863,
          0.7429826791833981 0.49644515457558763 0.44890861757364453,
          0.631830863277362 0.6318308632773618 0.4489760800091325 ] }
        normalIndex [
          0, 1, 91, 90, -1,
          0, 30, 62, 92, -1,
          0, 90, 60, 30, -1,
          0, 92, 93, 1, -1,
          1, 93, 176, 175, -1,
          1, 175, 174, 91, -1,
          2, 3, 95, 94, -1,
          2, 32, 60, 90, -1,
          2, 90, 91, 3, -1,
          2, 94, 64, 32, -1,
          3, 91, 174, 173, -1,
          3, 173, 172, 95, -1,
          4, 5, 97, 96, -1,
          4, 34, 64, 94, -1,
          4, 94, 95, 5, -1,
          4, 96, 66, 34, -1,
          5, 95, 172, 171, -1,
          5, 171, 170, 97, -1,
          6, 7, 99, 98, -1,
          6, 36, 66, 96, -1,
          6, 96, 97, 7, -1,
          6, 98, 68, 36, -1,
          7, 97, 170, 169, -1,
          7, 169, 168, 99, -1,
          8, 9, 101, 100, -1,
          8, 38, 68, 98, -1,
          8, 98, 99, 9, -1,
          8, 100, 70, 38, -1,
          9, 99, 168, 167, -1,
          9, 167, 166, 101, -1,
          10, 11, 103, 102, -1,
          10, 40, 70, 100, -1,
          10, 100, 101, 11, -1,
          10, 102, 72, 40, -1,
          11, 101, 166, 165, -1,
          11, 165, 164, 103, -1,
          12, 13, 105, 104, -1,
          12, 42, 72, 102, -1,
          12, 102, 103, 13, -1,
          12, 104, 74, 42, -1,
          13, 103, 164, 163, -1,
          13, 163, 162, 105, -1,
          14, 15, 107, 106, -1,
          14, 44, 74, 104, -1,
          14, 104, 105, 15, -1,
          14, 106, 76, 44, -1,
          15, 105, 162, 161, -1,
          15, 161, 160, 107, -1,
          16, 17, 109, 108, -1,
          16, 108, 78, 46, -1,
          17, 159, 158, 109, -1,
          18, 19, 111, 110, -1,
          18, 48, 78, 108, -1,
          18, 108, 109, 19, -1,
          18, 110, 80, 48, -1,
          19, 109, 158, 157, -1,
          19, 157, 156, 111, -1,
          20, 21, 113, 112, -1,
          20, 50, 80, 110, -1,
          20, 110, 111, 21, -1,
          20, 112, 82, 50, -1,
          21, 111, 156, 155, -1,
          21, 155, 154, 113, -1,
          22, 23, 115, 114, -1,
          22, 52, 82, 112, -1,
          22, 112, 113, 23, -1,
          22, 114, 84, 52, -1,
          23, 113, 154, 153, -1,
          23, 153, 152, 115, -1,
          24, 25, 117, 116, -1,
          24, 54, 84, 114, -1,
          24, 114, 115, 25, -1,
          24, 116, 86, 54, -1,
          25, 115, 152, 151, -1,
          25, 151, 150, 117, -1,
          26, 27, 119, 118, -1,
          26, 56, 86, 116, -1,
          26, 116, 117, 27, -1,
          26, 118, 88, 56, -1,
          27, 117, 150, 179, -1,
          27, 179, 178, 119, -1,
          28, 29, 93, 92, -1,
          28, 58, 88, 118, -1,
          28, 92, 62, 58, -1,
          28, 118, 119, 29, -1,
          29, 119, 178, 177, -1,
          29, 177, 176, 93, -1,
          30, 31, 63, 62, -1,
          30, 60, 61, 31, -1,
          31, 61, 144, 143, -1,
          31, 143, 142, 63, -1,
          32, 33, 61, 60, -1,
          32, 64, 65, 33, -1,
          33, 65, 146, 145, -1,
          33, 145, 144, 61, -1,
          34, 35, 65, 64, -1,
          34, 66, 67, 35, -1,
          35, 67, 148, 147, -1,
          35, 147, 146, 65, -1,
          36, 37, 67, 66, -1,
          36, 68, 69, 37, -1,
          37, 69, 120, 149, -1,
          37, 149, 148, 67, -1,
          38, 39, 69, 68, -1,
          38, 70, 71, 39, -1,
          39, 71, 122, 121, -1,
          39, 121, 120, 69, -1,
          40, 41, 71, 70, -1,
          40, 72, 73, 41, -1,
          41, 73, 124, 123, -1,
          41, 123, 122, 71, -1,
          42, 43, 73, 72, -1,
          42, 74, 75, 43, -1,
          43, 75, 126, 125, -1,
          43, 125, 124, 73, -1,
          44, 45, 75, 74, -1,
          44, 76, 77, 45, -1,
          45, 77, 128, 127, -1,
          45, 127, 126, 75, -1,
          46, 78, 79, 47, -1,
          47, 79, 130, 129, -1,
          48, 49, 79, 78, -1,
          48, 80, 81, 49, -1,
          49, 81, 132, 131, -1,
          49, 131, 130, 79, -1,
          50, 51, 81, 80, -1,
          50, 82, 83, 51, -1,
          51, 83, 134, 133, -1,
          51, 133, 132, 81, -1,
          52, 53, 83, 82, -1,
          52, 84, 85, 53, -1,
          53, 85, 136, 135, -1,
          53, 135, 134, 83, -1,
          54, 55, 85, 84, -1,
          54, 86, 87, 55, -1,
          55, 87, 138, 137, -1,
          55, 137, 136, 85, -1,
          56, 57, 87, 86, -1,
          56, 88, 89, 57, -1,
          57, 89, 140, 139, -1,
          57, 139, 138, 87, -1,
          58, 59, 89, 88, -1,
          58, 62, 63, 59, -1,
          59, 63, 142, 141, -1,
          59, 141, 140, 89, -1,
          120, 121, 181, 180, -1,
          120, 180, 211, 149, -1,
          121, 122, 182, 181, -1,
          122, 123, 183, 182, -1,
          123, 124, 184, 183, -1,
          124, 125, 185, 184, -1,
          125, 126, 186, 185, -1,
          126, 127, 187, 186, -1,
          127, 128, 188, 187, -1,
          129, 130, 192, 191, -1,
          130, 131, 193, 192, -1,
          131, 132, 194, 193, -1,
          132, 133, 195, 194, -1,
          133, 134, 196, 195, -1,
          134, 135, 197, 196, -1,
          135, 136, 198, 197, -1,
          136, 137, 199, 198, -1,
          137, 138, 200, 199, -1,
          138, 139, 201, 200, -1,
          139, 140, 202, 201, -1,
          140, 141, 203, 202, -1,
          141, 142, 204, 203, -1,
          142, 143, 205, 204, -1,
          143, 144, 206, 205, -1,
          144, 145, 207, 206, -1,
          145, 146, 208, 207, -1,
          146, 147, 209, 208, -1,
          147, 148, 210, 209, -1,
          148, 149, 211, 210, -1,
          150, 151, 213, 212, -1,
          150, 212, 243, 179, -1,
          151, 152, 214, 213, -1,
          152, 153, 215, 214, -1,
          153, 154, 216, 215, -1,
          154, 155, 217, 216, -1,
          155, 156, 218, 217, -1,
          156, 157, 219, 218, -1,
          157, 158, 220, 219, -1,
          158, 159, 221, 220, -1,
          160, 161, 225, 224, -1,
          161, 162, 226, 225, -1,
          162, 163, 227, 226, -1,
          163, 164, 228, 227, -1,
          164, 165, 229, 228, -1,
          165, 166, 230, 229, -1,
          166, 167, 231, 230, -1,
          167, 168, 232, 231, -1,
          168, 169, 233, 232, -1,
          169, 170, 234, 233, -1,
          170, 171, 235, 234, -1,
          171, 172, 236, 235, -1,
          172, 173, 237, 236, -1,
          173, 174, 238, 237, -1,
          174, 175, 239, 238, -1,
          175, 176, 240, 239, -1,
          176, 177, 241, 240, -1,
          177, 178, 242, 241, -1,
          178, 179, 243, 242, -1,
          180, 181, 245, 244, -1,
          180, 244, 275, 211, -1,
          181, 182, 246, 245, -1,
          182, 183, 247, 246, -1,
          183, 184, 248, 247, -1,
          184, 185, 249, 248, -1,
          185, 186, 250, 249, -1,
          186, 187, 251, 250, -1,
          187, 188, 252, 251, -1,
          188, 189, 253, 252, -1,
          189, 190, 254, 253, -1,
          190, 191, 255, 254, -1,
          191, 192, 256, 255, -1,
          192, 193, 257, 256, -1,
          193, 194, 258, 257, -1,
          194, 195, 259, 258, -1,
          195, 196, 260, 259, -1,
          196, 197, 261, 260, -1,
          197, 198, 262, 261, -1,
          198, 199, 263, 262, -1,
          199, 200, 264, 263, -1,
          200, 201, 265, 264, -1,
          201, 202, 266, 265, -1,
          202, 203, 267, 266, -1,
          203, 204, 268, 267, -1,
          204, 205, 269, 268, -1,
          205, 206, 270, 269, -1,
          206, 207, 271, 270, -1,
          207, 208, 272, 271, -1,
          208, 209, 273, 272, -1,
          209, 210, 274, 273, -1,
          210, 211, 275, 274, -1,
          212, 213, 277, 276, -1,
          212, 276, 307, 243, -1,
          213, 214, 278, 277, -1,
          214, 215, 279, 278, -1,
          215, 216, 280, 279, -1,
          216, 217, 281, 280, -1,
          217, 218, 282, 281, -1,
          218, 219, 283, 282, -1,
          219, 220, 284, 283, -1,
          220, 221, 285, 284, -1,
          221, 222, 286, 285, -1,
          222, 223, 287, 286, -1,
          223, 224, 288, 287, -1,
          224, 225, 289, 288, -1,
          225, 226, 290, 289, -1,
          226, 227, 291, 290, -1,
          227, 228, 292, 291, -1,
          228, 229, 293, 292, -1,
          229, 230, 294, 293, -1,
          230, 231, 295, 294, -1,
          231, 232, 296, 295, -1,
          232, 233, 297, 296, -1,
          233, 234, 298, 297, -1,
          234, 235, 299, 298, -1,
          235, 236, 300, 299, -1,
          236, 237, 301, 300, -1,
          237, 238, 302, 301, -1,
          238, 239, 303, 302, -1,
          239, 240, 304, 303, -1,
          240, 241, 305, 304, -1,
          241, 242, 306, 305, -1,
          242, 243, 307, 306, -1 ]
      }
    },
    Shape {
      appearance Appearance {
        material DEF Marking Material {
          diffuseColor 0.17416 0.17416 0.17416
          emissiveColor 0.001 0.001 0.001
          specularColor 0.70696 0.70696 0.70696
          ambientIntensity 0.46054
          transparency 0.0
          shininess 1.0
        }
      }
      geometry IndexedFaceSet {
        normalPerVertex TRUE
        coord Coordinate { point [
          2.510350979418252 2.277757006538555e-16 3.872543620234939,
          2.4651786546541867 1.981536772112272e-16 3.9812208707921637,
          2.319261889304186 -0.9606697292448416 3.872543620234939,
          2.2775281030191494 -0.9433830289562299 3.9812208707921637,
          2.510350979418252 4.934307272577693e-16 1.6392563797656634,
          2.465178654654753 4.896635579197761e-16 1.5305791292084385,
          2.319261889304186 -0.9606697292448411 1.6392563797656634,
          2.2775281030191494 -0.9433830289562294 1.5305791292083677,
          2.461651958836504 0.489653018796942 1.6392563797656634,
          2.417351756381898 0.48084116065125443 1.5305748787051852,
          2.4616519588365042 -0.489653018796941 1.6392563797656634,
          2.4173517563818985 -0.48084116065125343 1.5305748787051852,
          2.461651958836504 0.4896530187969416 3.872543620234939,
          2.4173517563813323 0.48084116065125404 3.9812251212950627,
          2.4616519588365042 -0.4896530187969414 3.872543620234939,
          2.4173517563813327 -0.4808411606512538 3.9812251212950627,
          2.3112495120057996 0.4597361120380885 1.4229048073769994,
          2.3569688397399817 4.62480464824604e-16 1.4229005568737711,
          2.3112495120058 -0.45973611203808756 1.4229048073769994,
          2.177555269803607 -0.9019729255694391 1.422900556873862,
          2.177555269803607 -0.9019729255694395 4.0888994431260945,
          2.311249512006366 -0.4597361120380879 4.088895192623195,
          2.356968839740548 1.4535332048794375e-16 4.0888994431260945,
          2.3112495120063654 0.4597361120380882 4.088895192623195,
          1.8955694865285986 0.37705221409804485 1.37795,
          1.933069660794541 3.783285604798208e-16 1.37795,
          1.8955694865285988 -0.377052214098044 1.37795,
          1.7859234945276075 -0.7397537327936458 1.37795,
          1.852376461765844 -0.7672794530836424 4.13385,
          1.9661023046319888 -0.3910820639249483 4.13385,
          2.0049978342194543 6.999969175065024e-17 4.13385,
          1.9661023046319883 0.3910820639249485 4.13385 ] }
        coordIndex [
          0, 1, 15, 14, -1,
          0, 4, 8, 12, -1,
          0, 12, 13, 1, -1,
          0, 14, 10, 4, -1,
          1, 13, 23, 22, -1,
          1, 22, 21, 15, -1,
          2, 6, 10, 14, -1,
          2, 14, 15, 3, -1,
          3, 15, 21, 20, -1,
          4, 5, 9, 8, -1,
          4, 10, 11, 5, -1,
          5, 11, 18, 17, -1,
          5, 17, 16, 9, -1,
          6, 7, 11, 10, -1,
          7, 19, 18, 11, -1,
          16, 17, 25, 24, -1,
          17, 18, 26, 25, -1,
          18, 19, 27, 26, -1,
          20, 21, 29, 28, -1,
          21, 22, 30, 29, -1,
          22, 23, 31, 30, -1 ]
        normal Normal { vector [
          0.9806500120500515 4.655773726394457e-16 0.19576913409992353,
          0.830343099810262 3.940096787733824e-16 0.557252489090435,
          0.906002474690237 -0.3752785125601916 0.19576913409875601,
          0.7671369948770319 -0.31775854747608245 0.557252489089934,
          0.9806500120505435 4.584693211485384e-16 -0.19576913409745886,
          0.8303430998107125 3.7981113179087434e-16 -0.5572524890897637,
          0.9060024746903548 -0.3752785125603597 -0.19576913409788838,
          0.7671369948774855 -0.31775854747643717 -0.5572524890891071,
          0.9618140421723642 0.19131670810752427 -0.1957336595452045,
          0.8144359520272937 0.16200138329675384 -0.557180071301311,
          0.9618140421723643 -0.19131670810752416 -0.1957336595452041,
          0.814435952027294 -0.16200138329675368 -0.5571800713013106,
          0.961814042172008 0.1913167081073483 0.19573365954712627,
          0.8144359520268678 0.16200138329651836 0.5571800713020021,
          0.9618140421720082 -0.1913167081073482 0.19573365954712588,
          0.814435952026868 -0.16200138329651814 0.5571800713020018,
          0.4212521010957304 0.08379225269244647 -0.9030645191298116,
          0.429438617598606 1.9335597264757328e-16 -0.9030960489975571,
          0.4212521010957305 -0.08379225269244625 -0.9030645191298116,
          0.3967495492703279 -0.16433904417319284 -0.9030960489970227,
          0.40566057011597484 -0.16803010986202754 0.8984460941163567,
          0.4307127423265097 -0.0856740912365231 0.8984133145097382,
          0.43908383706017334 2.1649525214309476e-16 0.8984460941161218,
          0.4307127423265098 0.08567409123652335 0.898413314509738,
          -0.6540277015743186 -0.13009419845112435 -0.7452001510351254,
          -0.6667715326136467 -1.8722077344888306e-16 -0.7452621842654091,
          -0.6540277015743186 0.13009419845112397 -0.7452001510351254,
          -0.6160165718427804 0.2551624187039376 -0.7452621842655275,
          -0.6085904290950994 0.25208640966169116 0.752376323177252,
          -0.6461446266725187 0.12852615736019407 0.7523151921212639,
          -0.6587335336253014 -3.789707930480556e-16 0.7523763231771212,
          -0.6461446266725187 -0.1285261573601943 0.7523151921212639 ] }
        normalIndex [
          0, 1, 15, 14, -1,
          0, 4, 8, 12, -1,
          0, 12, 13, 1, -1,
          0, 14, 10, 4, -1,
          1, 13, 23, 22, -1,
          1, 22, 21, 15, -1,
          2, 6, 10, 14, -1,
          2, 14, 15, 3, -1,
          3, 15, 21, 20, -1,
          4, 5, 9, 8, -1,
          4, 10, 11, 5, -1,
          5, 11, 18, 17, -1,
          5, 17, 16, 9, -1,
          6, 7, 11, 10, -1,
          7, 19, 18, 11, -1,
          16, 17, 25, 24, -1,
          17, 18, 26, 25, -1,
          18, 19, 27, 26, -1,
          20, 21, 29, 28, -1,
          21, 22, 30, 29, -1,
          22, 23, 31, 30, -1 ]
      }
    },
    Shape {
      appearance Appearance {
        material USE Metal
      }
      geometry IndexedFaceSet {
        normalPerVertex TRUE
        coord Coordinate { point [
          -0.37705221409804457 1.8955694865285988 1.541036335802242,
          -1.887800308694934e-16 1.933069660794541 1.541036335802242,
          0.37705221409804424 1.8955694865285988 1.541036335802242,
          0.7397537327936461 1.7859234945276075 1.541036335802242,
          1.0737538606849713 1.606986215584408 1.5410363358022419,
          1.3668866656538943 1.3668866656538943 1.5410363358022419,
          1.6069862155844081 1.0737538606849715 1.5410363358022419,
          1.785923494527607 0.7397537327936465 1.5410363358022419,
          1.8955694865285986 0.37705221409804485 1.5410363358022419,
          1.933069660794541 3.783285604798208e-16 1.5410363358022419,
          1.8955694865285988 -0.377052214098044 1.5410363358022419,
          1.7859234945276075 -0.7397537327936458 1.5410363358022419,
          1.6069862155844081 -1.073753860684971 1.5410363358022419,
          1.3668866656538943 -1.3668866656538943 1.5410363358022419,
          1.073753860684972 -1.6069862155844075 1.5410363358022419,
          0.7397537327936472 -1.7859234945276063 1.5410363358022419,
          0.3770522140980452 -1.8955694865285981 1.5410363358022419,
          2.5363596592939155e-16 -1.9330696607945406 1.5410363358022419,
          -0.37705221409804457 -1.8955694865285981 1.5410363358022419,
          -0.7397537327936465 -1.7859234945276063 1.5410363358022419,
          -1.0737538606849715 -1.606986215584408 1.5410363358022419,
          -1.3668866656538943 -1.3668866656538947 1.5410363358022419,
          -1.6069862155844075 -1.0737538606849721 1.5410363358022419,
          -1.7859234945276063 -0.7397537327936472 1.5410363358022419,
          -1.8955694865285986 -0.37705221409804496 1.5410363358022419,
          -1.933069660794541 -3.1447361275445387e-19 1.5410363358022419,
          -1.8955694865285986 0.3770522140980445 1.5410363358022419,
          -1.785923494527607 0.7397537327936464 1.5410363358022419,
          -1.606986215584408 1.0737538606849715 1.5410363358022419,
          -1.3668866656538945 1.3668866656538943 1.5410363358022419,
          -1.0737538606849715 1.606986215584408 1.5410363358022419,
          -0.7397537327936462 1.7859234945276075 1.541036335802242,
          -1.1137074927104589 -1.6667810515131303 3.965007675875326,
          -0.7672794530836429 -1.852376461765844 3.965007675875326,
          -0.3910820639249486 -1.9661023046319883 3.965007675875326,
          3.2581126859911697e-16 -2.004997834219454 3.965007675875326,
          0.3910820639249491 -1.9661023046319883 3.965007675875326,
          0.7672794530836434 -1.8523764617658434 3.965007675875326,
          1.1137074927104595 -1.6667810515131303 3.965007675875326,
          1.4177475648410165 -1.4177475648410163 3.965007675875326,
          1.6667810515131303 -1.1137074927104587 3.965007675875326,
          1.852376461765844 -0.7672794530836424 3.965007675875326,
          1.9661023046319888 -0.3910820639249483 3.965007675875326,
          2.0049978342194543 6.999969175065024e-17 3.965007675875326,
          1.9661023046319883 0.3910820639249485 3.965007675875326,
          1.8523764617658438 0.7672794530836423 3.965007675875326,
          1.6667810515131303 1.1137074927104587 3.965007675875326,
          1.4177475648410163 1.417747564841016 3.965007675875326,
          1.1137074927104587 1.6667810515131303 3.965007675875326,
          0.7672794530836421 1.8523764617658434 3.965007675875326,
          0.39108206392494815 1.9661023046319883 3.965007675875326,
          -2.1636768167765802e-16 2.004997834219454 3.965007675875326,
          -0.3910820639249486 1.9661023046319883 3.965007675875326,
          -0.7672794530836425 1.8523764617658434 3.965007675875326,
          -1.1137074927104589 1.6667810515131294 3.965007675875326,
          -1.417747564841016 1.417747564841016 3.965007675875326,
          -1.6667810515131303 1.1137074927104584 3.965007675875326,
          -1.8523764617658438 0.7672794530836422 3.965007675875326,
          -1.9661023046319883 0.3910820639249484 3.965007675875326,
          -2.0049978342194543 -2.8047682445582975e-16 3.965007675875326,
          -1.9661023046319883 -0.39108206392494915 3.965007675875326,
          -1.8523764617658431 -0.7672794530836436 3.965007675875326,
          -1.6667810515131294 -1.1137074927104595 3.965007675875326,
          -1.4177475648410156 -1.417747564841017 3.965007675875326 ] }
        coordIndex [
          0, 1, 2, 3, 4, 5, 6, 7, 8, 9, 10, 11, 12, 13, 14, 15, 16, 17, 18, 19, 20, 21, 22, 23, 24, 25, 26, 27, 28, 29, 30, 31, -1,
          32, 33, 34, 35, 36, 37, 38, 39, 40, 41, 42, 43, 44, 45, 46, 47, 48, 49, 50, 51, 52, 53, 54, 55, 56, 57, 58, 59, 60, 61, 62, 63, -1 ]
        normal Normal { vector [
          0.17432835546700762 -0.87640782604235 -0.44890861757365547,
          4.9846358153206783e-17 -0.8935437759727541 -0.4489760800091167,
          -0.17432835546700745 -0.87640782604235 -0.44890861757365547,
          -0.3419443991577711 -0.8255268060240051 -0.44897608000920863,
          -0.49644515457558785 -0.742982679183398 -0.44890861757364464,
          -0.6318308632773617 -0.6318308632773622 -0.44897608000913264,
          -0.742982679183398 -0.49644515457558763 -0.44890861757364464,
          -0.8255268060240053 -0.3419443991577709 -0.44897608000920863,
          -0.87640782604235 -0.17432835546700803 -0.4489086175736555,
          -0.8935437759727541 -2.4300099599688306e-16 -0.4489760800091167,
          -0.8764078260423501 0.1743283554670076 -0.4489086175736555,
          -0.8255268060240052 0.341944399157771 -0.4489760800092087,
          -0.742982679183398 0.49644515457558774 -0.44890861757364464,
          -0.6318308632773619 0.6318308632773619 -0.44897608000913264,
          -0.4964451545755876 0.7429826791833981 -0.44890861757364464,
          -0.3419443991577711 0.8255268060240052 -0.44897608000920863,
          -0.17432835546700806 0.87640782604235 -0.44890861757365547,
          5.607715292235763e-17 0.8935437759727541 -0.4489760800091167,
          0.17432835546700817 0.8764078260423499 -0.44890861757365547,
          0.34194439915777064 0.8255268060240053 -0.4489760800092085,
          0.49644515457558686 0.7429826791833987 -0.44890861757364464,
          0.6318308632773618 0.631830863277362 -0.44897608000913264,
          0.7429826791833983 0.49644515457558724 -0.44890861757364453,
          0.8255268060240052 0.3419443991577715 -0.44897608000920863,
          0.8764078260423499 0.17432835546700853 -0.44890861757365547,
          0.8935437759727541 -4.3615563384055935e-17 -0.4489760800091167,
          0.87640782604235 -0.17432835546700795 -0.44890861757365547,
          0.8255268060240053 -0.34194439915777103 -0.44897608000920863,
          0.7429826791833982 -0.4964451545755876 -0.44890861757364464,
          0.6318308632773619 -0.6318308632773619 -0.44897608000913264,
          0.49644515457558785 -0.742982679183398 -0.44890861757364464,
          0.3419443991577712 -0.8255268060240051 -0.44897608000920863,
          0.49644515457558774 0.742982679183398 0.44890861757364453,
          0.3419443991577709 0.8255268060240053 0.44897608000920863,
          0.1743283554670071 0.8764078260423502 0.44890861757365547,
          1.8692384307452544e-17 0.8935437759727541 0.4489760800091167,
          -0.1743283554670077 0.87640782604235 0.44890861757365547,
          -0.3419443991577708 0.8255268060240054 0.44897608000920863,
          -0.49644515457558736 0.7429826791833982 0.44890861757364464,
          -0.6318308632773624 0.6318308632773615 0.44897608000913264,
          -0.7429826791833982 0.49644515457558747 0.44890861757364464,
          -0.8255268060240051 0.3419443991577712 0.44897608000920863,
          -0.87640782604235 0.17432835546700762 0.44890861757365547,
          -0.8935437759727541 -5.109251710703696e-16 0.4489760800091167,
          -0.87640782604235 -0.17432835546700795 0.44890861757365547,
          -0.8255268060240053 -0.34194439915777086 0.4489760800092087,
          -0.7429826791833982 -0.49644515457558747 0.44890861757364464,
          -0.6318308632773619 -0.6318308632773619 0.44897608000913264,
          -0.49644515457558697 -0.7429826791833986 0.44890861757364464,
          -0.34194439915777064 -0.8255268060240053 0.4489760800092085,
          -0.1743283554670079 -0.87640782604235 0.4489086175736555,
          3.738476861490509e-17 -0.8935437759727541 0.4489760800091167,
          0.17432835546700798 -0.87640782604235 0.4489086175736555,
          0.34194439915777164 -0.8255268060240049 0.44897608000920863,
          0.49644515457558747 -0.7429826791833982 0.44890861757364464,
          0.6318308632773617 -0.6318308632773623 0.4489760800091327,
          0.7429826791833982 -0.4964451545755876 0.44890861757364464,
          0.8255268060240053 -0.3419443991577708 0.44897608000920863,
          0.87640782604235 -0.17432835546700792 0.44890861757365547,
          0.8935437759727541 -3.738476861490509e-17 0.4489760800091167,
          0.8764078260423499 0.1743283554670084 0.44890861757365547,
          0.8255268060240049 0.3419443991577717 0.44897608000920863,
          0.7429826791833981 0.49644515457558763 0.44890861757364453,
          0.631830863277362 0.6318308632773618 0.4489760800091325 ] }
        normalIndex [
          0, 1, 2, 3, 4, 5, 6, 7, 8, 9, 10, 11, 12, 13, 14, 15, 16, 17, 18, 19, 20, 21, 22, 23, 24, 25, 26, 27, 28, 29, 30, 31, -1,
          32, 33, 34, 35, 36, 37, 38, 39, 40, 41, 42, 43, 44, 45, 46, 47, 48, 49, 50, 51, 52, 53, 54, 55, 56, 57, 58, 59, 60, 61, 62, 63, -1 ]
      }
    }
  ]
}

