PCBNEW-LibModule-V1  Čt 21. červen 2012, 22:11:11 CEST
# encoding utf-8
Units deci-mils
$INDEX
P-SSO-3-2
P-SSO-3-2A
$EndINDEX
$MODULE P-SSO-3-2
Po 0 0 0 15 4FE37F81 00000000 ~~
Li P-SSO-3-2
Sc 0
AR 
Op 0 0 0
T0 -600 0 393 393 900 78 N V 21 N "P-SSO-3-2"
T1 800 0 393 393 900 78 N I 21 N "Value"
DS -280 -600 -280 600 50 21
DS -50 -830 320 -830 50 21
DS 320 830 320 -830 50 21
DS -50 830 320 830 50 21
DS -50 830 -280 600 50 21
DS -50 -830 -280 -600 50 21
$PAD
Sh "1" C 354 354 0 0 0
Dr 197 0 0
At STD N 00E0FFFF
Ne 0 ""
Po 0 -500
$EndPAD
$PAD
Sh "2" C 354 354 0 0 0
Dr 197 0 0
At STD N 00E0FFFF
Ne 0 ""
Po 0 0
$EndPAD
$PAD
Sh "3" C 354 354 0 0 0
Dr 197 0 0
At STD N 00E0FFFF
Ne 0 ""
Po 0 500
$EndPAD
$SHAPE3D
Na "LR/P-SSO-3-2.wrl"
Sc 1 1 1
Of 0 0 0
Ro 0 0 0
$EndSHAPE3D
$EndMODULE P-SSO-3-2
$MODULE P-SSO-3-2A
Po 0 0 0 15 4FE37FD9 00000000 ~~
Li P-SSO-3-2A
Sc 0
AR 
Op 0 0 0
T0 -900 0 393 393 900 78 N V 21 N "P-SSO-3-2A"
T1 900 0 392 392 900 77 N I 21 N "Value"
DS -280 -600 -280 600 50 21
DS -50 -830 320 -830 50 21
DS 320 830 320 -830 50 21
DS -50 830 320 830 50 21
DS -50 830 -280 600 50 21
DS -50 -830 -280 -600 50 21
$PAD
Sh "1" C 551 551 0 0 0
Dr 315 0 0
At STD N 00E0FFFF
Ne 2 "N-000004"
Po 0 -1000
$EndPAD
$PAD
Sh "2" C 551 551 0 0 0
Dr 315 0 0
At STD N 00E0FFFF
Ne 1 "N-000002"
Po 0 0
$EndPAD
$PAD
Sh "3" C 551 551 0 0 0
Dr 315 0 0
At STD N 00E0FFFF
Ne 3 "N-000005"
Po 0 1000
$EndPAD
$SHAPE3D
Na "LR/P-SSO-3-2A.wrl"
Sc 1 1 1
Of 0 0 0
Ro 0 0 0
$EndSHAPE3D
$EndMODULE P-SSO-3-2A
$EndLIBRARY
