PCBNEW-LibModule-V1  21.5.2012 19:07:43
# encoding utf-8
$INDEX
switch-316-917
switch-316-923
switch-320-916
switch-320-938
switch-9070-1W
switch-9070-2W
switch-LPV-1
$EndINDEX
$MODULE switch-316-917
Po 0 0 0 15 4FBA74B6 00000000 ~~
Li switch-316-917
Cd TOGGLE SWITCH
Kw TOGGLE SWITCH
Sc 00000000
AR
Op 0 0 0
At VIRTUAL
T0 3700 -2600 394 394 0 79 N V 21 N "switch-316-917"
T1 2850 0 394 394 0 79 N I 21 N "VALUE"
DS -300 1250 -2849 1250 60 21
DS -2849 1250 -2849 450 60 21
DS -2849 -1300 -300 -1300 60 21
DS -300 -1300 -300 -100 60 21
DS -2849 450 -6600 1450 60 21
DS -2849 450 -2849 -450 60 21
DS -2849 -450 -6600 250 60 21
DS -2849 -450 -2849 -1300 60 21
DS -300 1800 -400 1800 60 21
DS -300 1800 -300 2200 60 21
DS -300 -2200 -300 -1800 60 21
DS -1100 -1800 -1200 -1700 60 21
DS -1200 -1700 -1300 -1800 60 21
DS -2000 -1800 -2100 -1700 60 21
DS -2000 -1800 -1300 -1800 60 21
DS -400 -1800 -300 -1700 60 21
DS -400 -1800 -300 -1800 60 21
DS -300 -1800 -300 -1700 60 21
DS -2100 1700 -2000 1800 60 21
DS -2100 1700 -2100 100 60 21
DS -1200 1700 -1300 1800 60 21
DS -1200 1700 -1200 100 60 21
DS -1300 1800 -2000 1800 60 21
DS -1200 1700 -1100 1800 60 21
DS -300 1700 -400 1800 60 21
DS -300 1700 -300 1800 60 21
DS -2100 0 -2000 0 60 21
DS -2100 0 -2100 -100 60 21
DS -1200 0 -1200 -100 60 21
DS -1200 0 -1100 0 60 21
DS -300 -100 -400 0 60 21
DS -300 -100 -300 0 60 21
DS -400 0 -300 0 60 21
DS -300 0 -300 100 60 21
DS -400 0 -300 100 60 21
DS -300 100 -300 1250 60 21
DS -1200 -100 -1100 0 60 21
DS -1200 -100 -1200 -1700 60 21
DS -1100 0 -400 0 60 21
DS -1100 0 -1200 100 60 21
DS -1200 100 -1200 0 60 21
DS -1200 100 -1300 0 60 21
DS -1300 0 -1200 0 60 21
DS -1300 0 -1200 -100 60 21
DS -2100 -100 -2000 0 60 21
DS -2100 -100 -2100 -1700 60 21
DS -2000 0 -1300 0 60 21
DS -2000 0 -2100 100 60 21
DS -2100 100 -2100 0 60 21
DS -300 2200 600 2200 60 21
DS 600 2200 6450 2200 60 21
DS -300 -2200 600 -2200 60 21
DS 600 -2200 6450 -2200 60 21
DS -400 -1800 -500 -1800 60 21
DS -500 -1800 -1100 -1800 60 21
DS -300 -1700 -300 -1550 60 21
DS -300 -1550 -300 -1300 60 21
DS -300 1700 -300 1550 60 21
DS -300 1550 -300 1250 60 21
DS -400 1800 -500 1800 60 21
DS -500 1800 -1100 1800 60 21
DS 6450 2200 6450 300 60 21
DS 6450 300 6450 -300 60 21
DS 6450 -300 6450 -2200 60 21
DA -6600 850 -6600 1450 1800 60 21
$PAD
Sh "1" C 787 787 0 0 0
Dr 400 0 0
At STD N 00E0FFFF
Ne 0 ""
Po 4000 -1000
$EndPAD
$PAD
Sh "2" C 787 787 0 0 0
Dr 400 0 0
At STD N 00E0FFFF
Ne 0 ""
Po 6000 0
$EndPAD
$PAD
Sh "3" C 787 787 0 0 0
Dr 400 0 0
At STD N 00E0FFFF
Ne 0 ""
Po 4000 1000
$EndPAD
$PAD
Sh "B2" C 1000 1000 0 0 0
Dr 400 0 0
At STD N 00E0FFFF
Ne 0 ""
Po 0 2000
$EndPAD
$PAD
Sh "B1" C 1000 1000 0 0 0
Dr 400 0 0
At STD N 00E0FFFF
Ne 0 ""
Po 0 -2000
$EndPAD
$SHAPE3D
Na "Switch\\switch-316-917.wrl"
Sc 1.000000 1.000000 1.000000
Of 0.000000 0.000000 0.000000
Ro 0.000000 0.000000 0.000000
$EndSHAPE3D
$EndMODULE  switch-316-917
$MODULE switch-316-923
Po 0 0 0 15 4FBA7516 00000000 ~~
Li switch-316-923
Cd TOGGLE SWITCH
Kw TOGGLE SWITCH
Sc 00000000
AR
Op 0 0 0
At VIRTUAL
T0 3100 -4600 394 394 0 79 N V 21 N "switch-316-923"
T1 2650 0 394 394 0 79 N I 21 N "VALUE"
DS -300 4200 6450 4200 60 21
DS 6450 -4200 -300 -4200 60 21
DS -300 1250 -2849 1250 60 21
DS -2849 1250 -2849 450 60 21
DS -2849 -1300 -300 -1300 60 21
DS -300 -1300 -300 -100 60 21
DS -2849 450 -6600 1450 60 21
DS -2849 450 -2849 -450 60 21
DS -2849 -450 -6600 250 60 21
DS -2849 -450 -2849 -1300 60 21
DS -300 1800 -400 1800 60 21
DS -1100 -1800 -1200 -1700 60 21
DS -1200 -1700 -1300 -1800 60 21
DS -2000 -1800 -2100 -1700 60 21
DS -2000 -1800 -1300 -1800 60 21
DS -400 -1800 -300 -1700 60 21
DS -400 -1800 -300 -1800 60 21
DS -300 -1800 -300 -1700 60 21
DS -2100 1700 -2000 1800 60 21
DS -2100 1700 -2100 100 60 21
DS -1200 1700 -1300 1800 60 21
DS -1200 1700 -1200 100 60 21
DS -1300 1800 -2000 1800 60 21
DS -1200 1700 -1100 1800 60 21
DS -300 1700 -400 1800 60 21
DS -300 1700 -300 1800 60 21
DS -2100 0 -2000 0 60 21
DS -2100 0 -2100 -100 60 21
DS -1200 0 -1200 -100 60 21
DS -1200 0 -1100 0 60 21
DS -300 -100 -400 0 60 21
DS -300 -100 -300 0 60 21
DS -400 0 -300 0 60 21
DS -300 0 -300 100 60 21
DS -400 0 -300 100 60 21
DS -300 100 -300 1250 60 21
DS -1200 -100 -1100 0 60 21
DS -1200 -100 -1200 -1700 60 21
DS -1100 0 -400 0 60 21
DS -1100 0 -1200 100 60 21
DS -1200 100 -1200 0 60 21
DS -1200 100 -1300 0 60 21
DS -1300 0 -1200 0 60 21
DS -1300 0 -1200 -100 60 21
DS -2100 -100 -2000 0 60 21
DS -2100 -100 -2100 -1700 60 21
DS -2000 0 -1300 0 60 21
DS -2000 0 -2100 100 60 21
DS -2100 100 -2100 0 60 21
DS -300 1800 -300 2450 60 21
DS -300 2450 -300 4200 60 21
DS -400 1800 -500 1800 60 21
DS -500 1800 -1100 1800 60 21
DS -300 1700 -300 1550 60 21
DS -300 1550 -300 1250 60 21
DS -300 -1800 -300 -2450 60 21
DS -300 -2450 -300 -4200 60 21
DS -400 -1800 -500 -1800 60 21
DS -500 -1800 -1100 -1800 60 21
DS -300 -1700 -300 -1550 60 21
DS -300 -1550 -300 -1300 60 21
DS 6450 4200 6450 2350 60 21
DS 6450 1650 6450 2350 60 21
DS 6450 -4200 6450 -2350 60 21
DS 6450 -1650 6450 -2350 60 21
DS 6450 -1650 6450 1650 60 21
DA -6600 850 -6600 1450 1800 60 21
$PAD
Sh "1" C 787 787 0 0 0
Dr 400 0 0
At STD N 00E0FFFF
Ne 0 ""
Po 4000 -3000
$EndPAD
$PAD
Sh "2" C 787 787 0 0 0
Dr 400 0 0
At STD N 00E0FFFF
Ne 0 ""
Po 6000 -2000
$EndPAD
$PAD
Sh "3" C 787 787 0 0 0
Dr 400 0 0
At STD N 00E0FFFF
Ne 0 ""
Po 4000 -1000
$EndPAD
$PAD
Sh "4" C 787 787 0 0 0
Dr 400 0 0
At STD N 00E0FFFF
Ne 0 ""
Po 4000 1000
$EndPAD
$PAD
Sh "5" C 787 787 0 0 0
Dr 400 0 0
At STD N 00E0FFFF
Ne 0 ""
Po 6000 2000
$EndPAD
$PAD
Sh "6" C 787 787 0 0 0
Dr 400 0 0
At STD N 00E0FFFF
Ne 0 ""
Po 4000 3000
$EndPAD
$PAD
Sh "B2" C 1000 1000 0 0 0
Dr 400 0 0
At STD N 00E0FFFF
Ne 0 ""
Po 0 2000
$EndPAD
$PAD
Sh "B1" C 1000 1000 0 0 0
Dr 400 0 0
At STD N 00E0FFFF
Ne 0 ""
Po 0 -2000
$EndPAD
$SHAPE3D
Na "Switch\\switch-316-923.wrl"
Sc 1.000000 1.000000 1.000000
Of 0.000000 0.000000 0.000000
Ro 0.000000 0.000000 0.000000
$EndSHAPE3D
$EndMODULE  switch-316-923
$MODULE switch-320-916
Po 0 0 0 15 4FBA7535 00000000 ~~
Li switch-320-916
Cd TOGGLE SWITCH
Kw TOGGLE SWITCH
Sc 00000000
AR
Op 0 0 0
At VIRTUAL
T0 0 -3050 394 394 0 79 N V 21 N "switch-320-916"
T1 0 3150 394 394 0 79 N I 21 N "VALUE"
DS -1130 -2630 -1380 -2380 60 21
DS -1130 -2630 1130 -2630 60 21
DS 1380 -2380 1130 -2630 60 21
DS 1130 2630 1380 2380 60 21
DS 1130 2630 -1130 2630 60 21
DS -1380 2380 -1130 2630 60 21
DS 1700 -900 1700 900 60 21
DS -1700 -900 -1700 900 60 21
DS 750 500 1000 750 60 21
DS 1000 750 1000 1000 60 21
DS 750 1250 1000 1000 60 21
DS 750 1250 -750 1250 60 21
DS -1000 1000 -750 1250 60 21
DS -1000 1000 -1000 750 60 21
DS -750 500 -1000 750 60 21
DS -750 500 750 500 60 21
DS 630 -500 1000 750 60 21
DS 1380 2380 1380 1130 60 21
DS 1380 -2380 1380 -1130 60 21
DS -1380 -1130 -1380 -2380 60 21
DS -1380 2380 -1380 1110 60 21
DS -630 -500 -1000 750 60 21
DS -630 -500 630 -500 60 21
DS -1700 900 -1380 1110 60 21
DS -1380 1110 0 2000 60 21
DS 1700 900 1380 1130 60 21
DS 1380 1130 0 2000 60 21
DS 1700 -900 1380 -1130 60 21
DS 1380 -1130 0 -2000 60 21
DS -1700 -900 -1380 -1130 60 21
DS -1380 -1130 0 -2000 60 21
DA 0 0 -1000 1000 2700 60 21
DA 0 0 -1000 500 2331 60 21
$PAD
Sh "1" C 1185 1185 0 0 0
Dr 790 0 0
At STD N 00E0FFFF
Ne 0 ""
Po 0 -1580
$EndPAD
$PAD
Sh "2" C 1185 1185 0 0 0
Dr 790 0 0
At STD N 00E0FFFF
Ne 0 ""
Po 0 0
$EndPAD
$PAD
Sh "3" C 1185 1185 0 0 0
Dr 790 0 0
At STD N 00E0FFFF
Ne 0 ""
Po 0 1580
$EndPAD
$SHAPE3D
Na "Switch\\switch-320-916.wrl"
Sc 1.000000 1.000000 1.000000
Of 0.000000 0.000000 0.000000
Ro 0.000000 0.000000 0.000000
$EndSHAPE3D
$EndMODULE  switch-320-916
$MODULE switch-320-938
Po 0 0 0 15 4FBA754A 00000000 ~~
Li switch-320-938
Cd TOGGLE SWITCH
Kw TOGGLE SWITCH
Sc 00000000
AR
Op 0 0 0
At VIRTUAL
T0 0 -3100 394 394 0 79 N V 21 N "switch-320-938"
T1 0 3050 394 394 0 79 N I 21 N "Value"
DS -2130 -2630 -2380 -2380 60 21
DS -2130 -2630 2130 -2630 60 21
DS 2380 -2380 2130 -2630 60 21
DS 2130 2630 2380 2380 60 21
DS 2130 2630 -2130 2630 60 21
DS -2380 2380 -2130 2630 60 21
DS 2380 -2380 2380 2380 60 21
DS -2380 2380 -2380 -2380 60 21
DS 1700 -900 1700 900 60 21
DS -1700 -900 -1700 900 60 21
DS 1700 -900 0 -2000 60 21
DS 0 -2000 -1700 -900 60 21
DS -1700 900 0 2000 60 21
DS 0 2000 1700 900 60 21
DS 750 500 1000 750 60 21
DS 1000 750 1000 1000 60 21
DS 750 1250 1000 1000 60 21
DS 750 1250 -750 1250 60 21
DS -1000 1000 -750 1250 60 21
DS -1000 1000 -1000 750 60 21
DS -750 500 -1000 750 60 21
DS -750 500 750 500 60 21
DS 630 -500 1000 750 60 21
DS -630 -500 -1000 750 60 21
DS -630 -500 630 -500 60 21
DA 0 0 -1000 1000 2700 60 21
DA 0 0 -1000 500 2331 60 21
$PAD
Sh "1" C 1185 1185 0 0 0
Dr 790 0 0
At STD N 00E0FFFF
Ne 0 ""
Po -940 -1580
$EndPAD
$PAD
Sh "2" C 1185 1185 0 0 0
Dr 790 0 0
At STD N 00E0FFFF
Ne 0 ""
Po -940 0
$EndPAD
$PAD
Sh "3" C 1185 1185 0 0 0
Dr 790 0 0
At STD N 00E0FFFF
Ne 0 ""
Po -940 1580
$EndPAD
$PAD
Sh "4" C 1185 1185 0 0 0
Dr 790 0 0
At STD N 00E0FFFF
Ne 0 ""
Po 940 -1580
$EndPAD
$PAD
Sh "5" C 1185 1185 0 0 0
Dr 790 0 0
At STD N 00E0FFFF
Ne 0 ""
Po 940 0
$EndPAD
$PAD
Sh "6" C 1185 1185 0 0 0
Dr 790 0 0
At STD N 00E0FFFF
Ne 0 ""
Po 940 1580
$EndPAD
$SHAPE3D
Na "Switch\\switch-320-938.wrl"
Sc 1.000000 1.000000 1.000000
Of 0.000000 0.000000 0.000000
Ro 0.000000 0.000000 0.000000
$EndSHAPE3D
$EndMODULE  switch-320-938
$MODULE switch-9070-1W
Po 0 0 0 15 4FBA7567 00000000 ~~
Li switch-9070-1W
Cd TOGGLE SWITCH
Kw TOGGLE SWITCH
Sc 00000000
AR
Op 0 0 0
At VIRTUAL
T0 0 -2150 394 394 0 79 N V 21 N "switch-9070-1W"
T1 -350 0 394 394 0 79 N I 21 N "VALUE"
DS 1750 1150 2000 1150 26 21
DS 2000 1150 2000 850 26 21
DS 1750 850 2000 850 26 21
DS 1750 1150 1750 850 26 21
DS 1750 150 2000 150 26 21
DS 2000 150 2000 -150 26 21
DS 1750 -150 2000 -150 26 21
DS 1750 150 1750 -150 26 21
DS 1750 -850 2000 -850 26 21
DS 2000 -850 2000 -1150 26 21
DS 1750 -1150 2000 -1150 26 21
DS 1750 -850 1750 -1150 26 21
DS -2500 1750 1750 1750 60 21
DS 1750 -1750 -2500 -1750 60 21
DS -3600 900 -3600 500 60 21
DS -2500 -1750 -2500 -1000 60 21
DS -3600 -500 -7050 350 60 21
DS -3600 -500 -3600 -900 60 21
DS -3600 500 -7050 1350 60 21
DS -3600 500 -3600 -500 60 21
DS -3500 1000 -3600 900 60 21
DS -3500 1000 -2500 1000 60 21
DS -2500 1000 -2500 1750 60 21
DS -3600 -900 -3500 -1000 60 21
DS -3500 -1000 -2500 -1000 60 21
DS -2500 -1000 -2500 1000 60 21
DS -3500 -1000 -3500 1000 60 21
DS 1750 1750 1750 1300 60 21
DS 1750 700 1750 1300 60 21
DS 1750 700 1750 300 60 21
DS 1750 -300 1750 300 60 21
DS 1750 -1750 1750 -1300 60 21
DS 1750 -700 1750 -1300 60 21
DS 1750 -700 1750 -300 60 21
DA -7050 850 -7050 1350 1800 60 21
$PAD
Sh "1" O 520 1040 0 0 900
Dr 320 0 0
At STD N 00E0FFFF
Ne 0 ""
Po 2000 1000
$EndPAD
$PAD
Sh "2" O 520 1040 0 0 900
Dr 320 0 0
At STD N 00E0FFFF
Ne 0 ""
Po 2000 0
$EndPAD
$PAD
Sh "3" O 520 1040 0 0 900
Dr 320 0 0
At STD N 00E0FFFF
Ne 0 ""
Po 2000 -1000
$EndPAD
$PAD
Sh "B2" C 700 700 0 0 0
Dr 440 0 0
At STD N 00E0FFFF
Ne 0 ""
Po 0 1000
$EndPAD
$PAD
Sh "B1" C 700 700 0 0 0
Dr 440 0 0
At STD N 00E0FFFF
Ne 0 ""
Po 0 -1000
$EndPAD
$SHAPE3D
Na "Switch\\switch-9070-1W.wrl"
Sc 1.000000 1.000000 1.000000
Of 0.000000 0.000000 0.000000
Ro 0.000000 0.000000 0.000000
$EndSHAPE3D
$EndMODULE  switch-9070-1W
$MODULE switch-9070-2W
Po 0 0 0 15 4FBA75F5 00000000 ~~
Li switch-9070-2W
Cd TOGGLE SWITCH
Kw TOGGLE SWITCH
Sc 00000000
AR
Op 0 0 0
At VIRTUAL
T0 0 -2150 394 394 0 79 N V 21 N "switch-9070-2W"
T1 -400 0 394 394 0 79 N I 21 N "VALUE"
DS 1750 1100 3050 1100 26 21
DS 3050 1100 3050 900 26 21
DS 1750 900 3050 900 26 21
DS 1750 1100 1750 900 26 21
DS 1750 100 3050 100 26 21
DS 3050 100 3050 -100 26 21
DS 1750 -100 3050 -100 26 21
DS 1750 100 1750 -100 26 21
DS 1750 -900 3050 -900 26 21
DS 3050 -900 3050 -1100 26 21
DS 1750 -1100 3050 -1100 26 21
DS 1750 -900 1750 -1100 26 21
DS -2500 1750 1750 1750 60 21
DS 1750 -1750 -2500 -1750 60 21
DS -3600 900 -3600 500 60 21
DS -2500 -1750 -2500 -1000 60 21
DS -3600 -500 -7050 350 60 21
DS -3600 -500 -3600 -900 60 21
DS -3600 500 -7050 1350 60 21
DS -3600 500 -3600 -500 60 21
DS -3500 1000 -3600 900 60 21
DS -3500 1000 -2500 1000 60 21
DS -2500 1000 -2500 1750 60 21
DS -3600 -900 -3500 -1000 60 21
DS -3500 -1000 -2500 -1000 60 21
DS -2500 -1000 -2500 1000 60 21
DS -3500 -1000 -3500 1000 60 21
DS 1750 1750 1750 1300 60 21
DS 1750 700 1750 1300 60 21
DS 1750 700 1750 300 60 21
DS 1750 -300 1750 300 60 21
DS 1750 -300 1750 -700 60 21
DS 1750 -1300 1750 -700 60 21
DS 1750 -1300 1750 -1750 60 21
DA -7050 850 -7050 1350 1800 60 21
$PAD
Sh "1" C 591 591 0 0 0
Dr 320 0 0
At STD N 00E0FFFF
Ne 0 ""
Po 2000 1000
$EndPAD
$PAD
Sh "2" C 591 591 0 0 0
Dr 320 0 0
At STD N 00E0FFFF
Ne 0 ""
Po 2000 0
$EndPAD
$PAD
Sh "3" C 591 591 0 0 0
Dr 320 0 0
At STD N 00E0FFFF
Ne 0 ""
Po 2000 -1000
$EndPAD
$PAD
Sh "4" C 591 591 0 0 0
Dr 320 0 0
At STD N 00E0FFFF
Ne 0 ""
Po 3000 1000
$EndPAD
$PAD
Sh "5" C 591 591 0 0 0
Dr 320 0 0
At STD N 00E0FFFF
Ne 0 ""
Po 3000 0
$EndPAD
$PAD
Sh "6" C 591 591 0 0 0
Dr 320 0 0
At STD N 00E0FFFF
Ne 0 ""
Po 3000 -1000
$EndPAD
$PAD
Sh "B2" C 787 787 0 0 0
Dr 320 0 0
At STD N 00E0FFFF
Ne 0 ""
Po 0 1000
$EndPAD
$PAD
Sh "B1" C 787 787 0 0 0
Dr 320 0 0
At STD N 00E0FFFF
Ne 0 ""
Po 0 -1000
$EndPAD
$SHAPE3D
Na "Switch\\switch-9070-2W.wrl"
Sc 1.000000 1.000000 1.000000
Of 0.000000 0.000000 0.000000
Ro 0.000000 0.000000 0.000000
$EndSHAPE3D
$EndMODULE  switch-9070-2W
$MODULE switch-LPV-1
Po 0 0 0 15 4FBA7644 00000000 ~~
Li switch-LPV-1
Cd TOGGLE SWITCH
Kw TOGGLE SWITCH
Sc 00000000
AR 
Op 0 0 0
At VIRTUAL 
T0 0 -3250 394 394 900 79 N I 21 N ">VALUE"
T1 -1950 -2800 394 394 900 79 N V 21 N "switch-LPV-1"
DS -250 -5200 250 -5200 26 21
DS 250 -5200 250 -5500 26 21
DS -250 -5500 250 -5500 26 21
DS -250 -5200 -250 -5500 26 21
DS -250 -6500 250 -6500 26 21
DS 250 -6500 250 -7500 26 21
DS -250 -7500 250 -7500 26 21
DS -250 -6500 -250 -7500 26 21
DS -250 -8500 250 -8500 26 21
DS 250 -8500 250 -9500 26 21
DS -250 -9500 250 -9500 26 21
DS -250 -8500 -250 -9500 26 21
DS -250 -5500 250 -5500 26 21
DS 250 -5500 250 -6500 26 21
DS -250 -6500 250 -6500 26 21
DS -250 -5500 -250 -6500 26 21
DS -250 -7500 250 -7500 26 21
DS 250 -7500 250 -8500 26 21
DS -250 -8500 250 -8500 26 21
DS -250 -7500 -250 -8500 26 21
DS -250 -9500 250 -9500 26 21
DS 250 -9500 250 -10149 26 21
DS -250 -10149 250 -10149 26 21
DS -250 -9500 -250 -10149 26 21
DS 1350 0 1600 0 26 21
DS 1600 0 1600 -450 26 21
DS 1350 -450 1600 -450 26 21
DS 1350 0 1350 -450 26 21
DS 1350 -450 1600 -450 26 21
DS 1600 -450 1600 -3000 26 21
DS 1350 -3000 1600 -3000 26 21
DS 1350 -450 1350 -3000 26 21
DS -400 0 400 0 26 21
DS 400 0 400 -1500 26 21
DS -400 -1500 400 -1500 26 21
DS -400 0 -400 -1500 26 21
DS -500 0 -400 0 26 21
DS -400 0 -400 -1500 26 21
DS -500 -1500 -400 -1500 26 21
DS -500 0 -500 -1500 26 21
DS 400 0 500 0 26 21
DS 500 0 500 -1500 26 21
DS 400 -1500 500 -1500 26 21
DS 400 0 400 -1500 26 21
DS -1600 0 -1350 0 26 21
DS -1350 0 -1350 -450 26 21
DS -1600 -450 -1350 -450 26 21
DS -1600 0 -1600 -450 26 21
DS -1600 -450 -1350 -450 26 21
DS -1350 -450 -1350 -3000 26 21
DS -1600 -3000 -1350 -3000 26 21
DS -1600 -450 -1600 -3000 26 21
DS -1600 0 -1600 -5200 60 21
DS -1600 0 -1450 0 60 21
DS -1450 0 -1450 100 60 21
DS 1450 100 1350 100 60 21
DS 1450 100 1450 0 60 21
DS 1450 0 1600 0 60 21
DS -1350 100 -1350 350 60 21
DS -1350 100 -1450 100 60 21
DS 1350 350 1000 350 60 21
DS 1350 350 1350 100 60 21
DS 1000 2800 100 2800 60 21
DS -1000 2800 -850 2950 60 21
DS 1000 2800 850 2950 60 21
DS 100 2800 100 350 60 21
DS 100 2800 -100 2800 60 21
DS 100 350 -100 350 60 21
DS -100 2800 -100 350 60 21
DS -100 2800 -1000 2800 60 21
DS -350 2950 -500 6000 60 21
DS 500 6000 350 2950 60 21
DS 350 2950 850 2950 60 21
DS -350 2950 350 2950 60 21
DS 1550 -5250 1000 -5250 60 21
DS 1000 -5200 1000 -5250 60 21
DS -1000 -5200 -1000 -5250 60 21
DS 1550 -5250 1600 -5200 60 21
DS 1600 -5200 1600 0 60 21
DS -1600 -5200 -1550 -5250 60 21
DS -1550 -5250 -1000 -5250 60 21
DS -1000 -5200 1000 -5200 60 21
DS 1000 350 1000 550 60 21
DS 1000 550 1000 2800 60 21
DS 1000 350 550 350 60 21
DS 550 350 100 350 60 21
DS 1350 100 450 100 60 21
DS 1450 0 450 0 60 21
DS -400 0 450 0 60 21
DS -400 0 -1450 0 60 21
DS -450 100 450 100 60 21
DS -450 100 -1350 100 60 21
DS -550 350 -100 350 60 21
DS -550 350 -1000 350 60 21
DS -1000 350 -1350 350 60 21
DS -1000 350 -1000 550 60 21
DS -1000 550 -1000 2800 60 21
DA 0 6000 500 6000 1800 60 21
$PAD
Sh "1" C 945 945 0 0 0
Dr 630 0 0
At STD N 00E0FFFF
Ne 0 ""
Po 0 -6000
$EndPAD
$PAD
Sh "2" C 945 945 0 0 0
Dr 630 0 0
At STD N 00E0FFFF
Ne 0 ""
Po 0 -8000
$EndPAD
$PAD
Sh "3" C 945 945 0 0 0
Dr 630 0 0
At STD N 00E0FFFF
Ne 0 ""
Po 0 -10000
$EndPAD
$PAD
Sh "B2" C 1000 1000 0 0 0
Dr 630 0 0
At STD N 00E0FFFF
Ne 0 ""
Po -1000 0
$EndPAD
$PAD
Sh "B1" C 1000 1000 0 0 0
Dr 630 0 0
At STD N 00E0FFFF
Ne 0 ""
Po 1000 0
$EndPAD
$SHAPE3D
Na "Switch\\switch-LVP-1.wrl"
Sc 1.000000 1.000000 1.000000
Of 0.000000 0.000000 0.000000
Ro 0.000000 0.000000 0.000000
$EndSHAPE3D
$EndMODULE  switch-LPV-1
$EndLIBRARY
