PCBNEW-LibModule-V1  Čt 7. červen 2012, 18:48:21 CEST
# encoding utf-8
Units deci-mils
$INDEX
conn_2
$EndINDEX
$MODULE conn_2
Po 0 0 0 15 4FD0DB26 00000000 ~~
Li conn_2
Sc 0
AR 
Op 0 0 0
T0 0 -1200 393 393 0 78 N V 21 N "conn_2"
T1 0 1200 393 393 0 78 N I 21 N "VAL**"
DS -1750 -750 1750 -750 150 21
DS 1750 -750 1750 750 150 21
DS 1750 750 -1750 750 150 21
DS -1750 750 -1750 -750 150 21
$PAD
Sh "1" R 1250 1250 0 0 0
Dr 240 0 0
At STD N 00E0FFFF
Ne 0 ""
Po -1000 0
$EndPAD
$PAD
Sh "2" C 1250 1250 0 0 0
Dr 240 0 0
At STD N 00E0FFFF
Ne 0 ""
Po 1000 0
$EndPAD
$EndMODULE conn_2
$EndLIBRARY
