PCBNEW-LibModule-V1  13.5.2012 21:36:32
# encoding utf-8
$INDEX
DP-02
DP-03
DP-04
DP-05
DP-06
DP-07
DP-08
DP-09
DP-10
DP-12
$EndINDEX
$MODULE DP-05
Po 0 0 0 15 4FB00985 00000000 ~~
Li DP-05
Cd DIL/CODE SWITCH
Kw DIL/CODE SWITCH
Sc 00000000
AR
Op 0 0 0
At VIRTUAL
T0 0 -2461 394 394 0 79 N V 21 N "DP-05"
T1 0 0 394 394 0 79 N I 21 N "Value"
DS -2300 2450 -1700 2450 26 21
DS -1700 2450 -1700 1100 26 21
DS -2300 1100 -1700 1100 26 21
DS -2300 2450 -2300 1100 26 21
DS -1300 2450 -700 2450 26 21
DS -700 2450 -700 1100 26 21
DS -1300 1100 -700 1100 26 21
DS -1300 2450 -1300 1100 26 21
DS -300 2450 300 2450 26 21
DS 300 2450 300 1100 26 21
DS -300 1100 300 1100 26 21
DS -300 2450 -300 1100 26 21
DS 700 2450 1300 2450 26 21
DS 1300 2450 1300 1100 26 21
DS 700 1100 1300 1100 26 21
DS 700 2450 700 1100 26 21
DS 1700 2450 2300 2450 26 21
DS 2300 2450 2300 1100 26 21
DS 1700 1100 2300 1100 26 21
DS 1700 2450 1700 1100 26 21
DS -2800 1950 -2500 1950 60 21
DS 2800 -1950 -2800 -1950 60 21
DS -2800 -1950 -2800 -1700 60 21
DS -2800 -1700 -2800 -1000 60 21
DS -2800 -1000 -2800 550 60 21
DS -2800 550 -2800 1950 60 21
DS 2800 1950 2800 -1700 60 21
DS -2250 2450 -1750 2450 100 21
DS -1250 2450 -750 2450 100 21
DS -250 2450 250 2450 100 21
DS 750 2450 1250 2450 100 21
DS 1750 2450 2250 2450 100 21
DS -2800 -1000 -2550 -1000 60 21
DS -2550 550 -2550 -1000 60 21
DS -2550 550 -2800 550 60 21
DS -2500 1100 -2500 1950 60 21
DS -2300 -1700 -2800 -1700 60 21
DS -1700 -1700 -2300 -1700 60 21
DS -1700 -1700 -1300 -1700 60 21
DS -700 -1700 -1300 -1700 60 21
DS -2500 1100 2500 1100 60 21
DS -2500 1950 2500 1950 60 21
DS 2500 1100 2500 1950 60 21
DS 2500 1950 2800 1950 60 21
DS -700 -1700 -300 -1700 60 21
DS 300 -1700 700 -1700 60 21
DS 1300 -1700 1700 -1700 60 21
DS 300 -1700 -300 -1700 60 21
DS 1300 -1700 700 -1700 60 21
DS 2300 -1700 1700 -1700 60 21
DS 2800 -1700 2300 -1700 60 21
DS 2800 -1700 2800 -1950 60 21
$PAD
Sh "1" O 520 1040 0 0 0
Dr 320 0 0
At STD N 00E0FFFF
Ne 0 ""
Po -2000 1500
$EndPAD
$PAD
Sh "2" O 520 1040 0 0 0
Dr 320 0 0
At STD N 00E0FFFF
Ne 0 ""
Po -1000 1500
$EndPAD
$PAD
Sh "3" O 520 1040 0 0 0
Dr 320 0 0
At STD N 00E0FFFF
Ne 0 ""
Po 0 1500
$EndPAD
$PAD
Sh "4" O 520 1040 0 0 0
Dr 320 0 0
At STD N 00E0FFFF
Ne 0 ""
Po 1000 1500
$EndPAD
$PAD
Sh "5" O 520 1040 0 0 0
Dr 320 0 0
At STD N 00E0FFFF
Ne 0 ""
Po 2000 1500
$EndPAD
$PAD
Sh "6" O 520 1040 0 0 0
Dr 320 0 0
At STD N 00E0FFFF
Ne 0 ""
Po 2000 -1500
$EndPAD
$PAD
Sh "7" O 520 1040 0 0 0
Dr 320 0 0
At STD N 00E0FFFF
Ne 0 ""
Po 1000 -1500
$EndPAD
$PAD
Sh "8" O 520 1040 0 0 0
Dr 320 0 0
At STD N 00E0FFFF
Ne 0 ""
Po 0 -1500
$EndPAD
$PAD
Sh "9" O 520 1040 0 0 0
Dr 320 0 0
At STD N 00E0FFFF
Ne 0 ""
Po -1000 -1500
$EndPAD
$PAD
Sh "10" O 520 1040 0 0 0
Dr 320 0 0
At STD N 00E0FFFF
Ne 0 ""
Po -2000 -1500
$EndPAD
$SHAPE3D
Na "Switch\\DIP\\ds_dp05.wrl"
Sc 1.000000 1.000000 1.000000
Of 0.000000 0.000000 0.000000
Ro 0.000000 0.000000 0.000000
$EndSHAPE3D
$EndMODULE  DP-05
$MODULE DP-02
Po 0 0 0 15 4FB0099D 00000000 ~~
Li DP-02
Cd DIL/CODE SWITCH
Kw DIL/CODE SWITCH
Sc 00000000
AR
Op 0 0 0
At VIRTUAL
T0 0 -2362 394 394 0 79 N V 21 N "DP-02"
T1 0 0 394 394 0 79 N I 21 N "Value"
DS -800 2450 -200 2450 26 21
DS -200 2450 -200 1100 26 21
DS -800 1100 -200 1100 26 21
DS -800 2450 -800 1100 26 21
DS 200 2450 800 2450 26 21
DS 800 2450 800 1100 26 21
DS 200 1100 800 1100 26 21
DS 200 2450 200 1100 26 21
DS -1300 1950 -1000 1950 60 21
DS -1000 1950 1000 1950 60 21
DS 1300 -1950 -1300 -1950 60 21
DS -750 2450 -250 2450 100 21
DS 250 2450 750 2450 100 21
DS -200 -1700 -800 -1700 60 21
DS 1300 1950 1300 -1700 60 21
DS -1300 -1950 -1300 -1700 60 21
DS -1300 -1000 -1050 -1000 60 21
DS -1050 550 -1050 -1000 60 21
DS -1050 550 -1300 550 60 21
DS -1300 -1000 -1300 550 60 21
DS -1300 550 -1300 1950 60 21
DS -1000 1100 -1000 1950 60 21
DS -1000 1100 1000 1100 60 21
DS 1000 1100 1000 1950 60 21
DS 1000 1950 1300 1950 60 21
DS -800 -1700 -1300 -1700 60 21
DS -1300 -1700 -1300 -1000 60 21
DS -200 -1700 200 -1700 60 21
DS 800 -1700 200 -1700 60 21
DS 1300 -1700 800 -1700 60 21
DS 1300 -1700 1300 -1950 60 21
$PAD
Sh "1" O 520 1040 0 0 0
Dr 320 0 0
At STD N 00E0FFFF
Ne 0 ""
Po -500 1500
$EndPAD
$PAD
Sh "2" O 520 1040 0 0 0
Dr 320 0 0
At STD N 00E0FFFF
Ne 0 ""
Po 500 1500
$EndPAD
$PAD
Sh "3" O 520 1040 0 0 0
Dr 320 0 0
At STD N 00E0FFFF
Ne 0 ""
Po 500 -1500
$EndPAD
$PAD
Sh "4" O 520 1040 0 0 0
Dr 320 0 0
At STD N 00E0FFFF
Ne 0 ""
Po -500 -1500
$EndPAD
$SHAPE3D
Na "Switch\\DIP\\ds_dp02.wrl"
Sc 1.000000 1.000000 1.000000
Of 0.000000 0.000000 0.000000
Ro 0.000000 0.000000 0.000000
$EndSHAPE3D
$EndMODULE  DP-02
$MODULE DP-03
Po 0 0 0 15 4FB009C6 00000000 ~~
Li DP-03
Cd DIL/CODE SWITCH
Kw DIL/CODE SWITCH
Sc 00000000
AR DP-03
Op 0 0 0
At VIRTUAL
T0 0 -2461 394 394 0 79 N V 21 N "DP-03"
T1 0 0 394 394 0 79 N I 21 N "Value"
DS -1300 2450 -700 2450 26 21
DS -700 2450 -700 1100 26 21
DS -1300 1100 -700 1100 26 21
DS -1300 2450 -1300 1100 26 21
DS -300 2450 300 2450 26 21
DS 300 2450 300 1100 26 21
DS -300 1100 300 1100 26 21
DS -300 2450 -300 1100 26 21
DS 700 2450 1300 2450 26 21
DS 1300 2450 1300 1100 26 21
DS 700 1100 1300 1100 26 21
DS 700 2450 700 1100 26 21
DS -1800 1950 -1500 1950 60 21
DS 1800 -1950 -1800 -1950 60 21
DS -1800 -1950 -1800 -1700 60 21
DS 1800 1950 1800 -1700 60 21
DS -1250 2450 -750 2450 100 21
DS -250 2450 250 2450 100 21
DS 750 2450 1250 2450 100 21
DS -1800 -1000 -1550 -1000 60 21
DS -1550 550 -1550 -1000 60 21
DS -1550 550 -1800 550 60 21
DS -1500 1100 -1500 1950 60 21
DS 1500 1100 1500 1950 60 21
DS 1500 1950 1800 1950 60 21
DS -1500 1100 1500 1100 60 21
DS -1500 1950 1500 1950 60 21
DS -1300 -1700 -1800 -1700 60 21
DS -700 -1700 -1300 -1700 60 21
DS -700 -1700 -300 -1700 60 21
DS 300 -1700 -300 -1700 60 21
DS -1800 -1700 -1800 1950 60 21
DS 300 -1700 700 -1700 60 21
DS 1300 -1700 700 -1700 60 21
DS 1800 -1700 1300 -1700 60 21
DS 1800 -1700 1800 -1950 60 21
$PAD
Sh "1" O 520 1040 0 0 0
Dr 320 0 0
At STD N 00E0FFFF
Ne 0 ""
Po -1000 1500
$EndPAD
$PAD
Sh "2" O 520 1040 0 0 0
Dr 320 0 0
At STD N 00E0FFFF
Ne 0 ""
Po 0 1500
$EndPAD
$PAD
Sh "3" O 520 1040 0 0 0
Dr 320 0 0
At STD N 00E0FFFF
Ne 0 ""
Po 1000 1500
$EndPAD
$PAD
Sh "4" O 520 1040 0 0 0
Dr 320 0 0
At STD N 00E0FFFF
Ne 0 ""
Po 1000 -1500
$EndPAD
$PAD
Sh "5" O 520 1040 0 0 0
Dr 320 0 0
At STD N 00E0FFFF
Ne 0 ""
Po 0 -1500
$EndPAD
$PAD
Sh "6" O 520 1040 0 0 0
Dr 320 0 0
At STD N 00E0FFFF
Ne 0 ""
Po -1000 -1500
$EndPAD
$SHAPE3D
Na "Switch\\DIP\\ds_dp03.wrl"
Sc 1.000000 1.000000 1.000000
Of 0.000000 0.000000 0.000000
Ro 0.000000 0.000000 0.000000
$EndSHAPE3D
$EndMODULE  DP-03
$MODULE DP-04
Po 0 0 0 15 4FB009EF 00000000 ~~
Li DP-04
Cd DIL/CODE SWITCH
Kw DIL/CODE SWITCH
Sc 00000000
AR
Op 0 0 0
At VIRTUAL
T0 0 -2461 394 394 0 79 N V 21 N "DP-04"
T1 0 0 394 394 0 79 N I 21 N "Value"
DS -1800 2450 -1200 2450 26 21
DS -1200 2450 -1200 1100 26 21
DS -1800 1100 -1200 1100 26 21
DS -1800 2450 -1800 1100 26 21
DS -800 2450 -200 2450 26 21
DS -200 2450 -200 1100 26 21
DS -800 1100 -200 1100 26 21
DS -800 2450 -800 1100 26 21
DS 200 2450 800 2450 26 21
DS 800 2450 800 1100 26 21
DS 200 1100 800 1100 26 21
DS 200 2450 200 1100 26 21
DS 1200 2450 1800 2450 26 21
DS 1800 2450 1800 1100 26 21
DS 1200 1100 1800 1100 26 21
DS 1200 2450 1200 1100 26 21
DS -2300 1950 -2000 1950 60 21
DS 2300 -1950 -2300 -1950 60 21
DS -2300 -1950 -2300 -1700 60 21
DS -2300 -1700 -2300 -1000 60 21
DS -2300 -1000 -2300 550 60 21
DS -2300 550 -2300 1950 60 21
DS 2300 1950 2300 -1700 60 21
DS -1750 2450 -1250 2450 100 21
DS -750 2450 -250 2450 100 21
DS 250 2450 750 2450 100 21
DS 1250 2450 1750 2450 100 21
DS -2300 -1000 -2050 -1000 60 21
DS -2050 550 -2050 -1000 60 21
DS -2050 550 -2300 550 60 21
DS -2000 1100 -2000 1950 60 21
DS -1800 -1700 -2300 -1700 60 21
DS -1200 -1700 -1800 -1700 60 21
DS -1200 -1700 -800 -1700 60 21
DS -200 -1700 -800 -1700 60 21
DS -200 -1700 200 -1700 60 21
DS 800 -1700 1200 -1700 60 21
DS 800 -1700 200 -1700 60 21
DS 1800 -1700 1200 -1700 60 21
DS 2300 -1700 1800 -1700 60 21
DS 2300 -1700 2300 -1950 60 21
DS 2000 1100 2000 1950 60 21
DS 2000 1950 2300 1950 60 21
DS -2000 1100 2000 1100 60 21
DS -2000 1950 2000 1950 60 21
$PAD
Sh "1" O 520 1040 0 0 0
Dr 320 0 0
At STD N 00E0FFFF
Ne 0 ""
Po -1500 1500
$EndPAD
$PAD
Sh "2" O 520 1040 0 0 0
Dr 320 0 0
At STD N 00E0FFFF
Ne 0 ""
Po -500 1500
$EndPAD
$PAD
Sh "3" O 520 1040 0 0 0
Dr 320 0 0
At STD N 00E0FFFF
Ne 0 ""
Po 500 1500
$EndPAD
$PAD
Sh "4" O 520 1040 0 0 0
Dr 320 0 0
At STD N 00E0FFFF
Ne 0 ""
Po 1500 1500
$EndPAD
$PAD
Sh "5" O 520 1040 0 0 0
Dr 320 0 0
At STD N 00E0FFFF
Ne 0 ""
Po 1500 -1500
$EndPAD
$PAD
Sh "6" O 520 1040 0 0 0
Dr 320 0 0
At STD N 00E0FFFF
Ne 0 ""
Po 500 -1500
$EndPAD
$PAD
Sh "7" O 520 1040 0 0 0
Dr 320 0 0
At STD N 00E0FFFF
Ne 0 ""
Po -500 -1500
$EndPAD
$PAD
Sh "8" O 520 1040 0 0 0
Dr 320 0 0
At STD N 00E0FFFF
Ne 0 ""
Po -1500 -1500
$EndPAD
$SHAPE3D
Na "Switch\\DIP\\ds_dp04.wrl"
Sc 1.000000 1.000000 1.000000
Of 0.000000 0.000000 0.000000
Ro 0.000000 0.000000 0.000000
$EndSHAPE3D
$EndMODULE  DP-04
$MODULE DP-06
Po 0 0 0 15 4FB00A73 00000000 ~~
Li DP-06
Cd DIL/CODE SWITCH
Kw DIL/CODE SWITCH
Sc 00000000
AR
Op 0 0 0
At VIRTUAL
T0 0 -2461 394 394 0 79 N V 21 N "DP-06"
T1 0 0 394 394 0 79 N I 21 N "Value"
DS -2800 2450 -2200 2450 26 21
DS -2200 2450 -2200 1100 26 21
DS -2800 1100 -2200 1100 26 21
DS -2800 2450 -2800 1100 26 21
DS -1800 2450 -1200 2450 26 21
DS -1200 2450 -1200 1100 26 21
DS -1800 1100 -1200 1100 26 21
DS -1800 2450 -1800 1100 26 21
DS -800 2450 -200 2450 26 21
DS -200 2450 -200 1100 26 21
DS -800 1100 -200 1100 26 21
DS -800 2450 -800 1100 26 21
DS 200 2450 800 2450 26 21
DS 800 2450 800 1100 26 21
DS 200 1100 800 1100 26 21
DS 200 2450 200 1100 26 21
DS 1200 2450 1800 2450 26 21
DS 1800 2450 1800 1100 26 21
DS 1200 1100 1800 1100 26 21
DS 1200 2450 1200 1100 26 21
DS 2200 2450 2800 2450 26 21
DS 2800 2450 2800 1100 26 21
DS 2200 1100 2800 1100 26 21
DS 2200 2450 2200 1100 26 21
DS -3300 1950 -3000 1950 60 21
DS 3300 -1950 -3300 -1950 60 21
DS -3300 -1950 -3300 -1700 60 21
DS -3300 -1700 -3300 -1000 60 21
DS -3300 -1000 -3300 550 60 21
DS -3300 550 -3300 1950 60 21
DS 3300 1950 3300 -1700 60 21
DS -2750 2450 -2250 2450 100 21
DS -1750 2450 -1250 2450 100 21
DS -750 2450 -250 2450 100 21
DS 250 2450 750 2450 100 21
DS 1250 2450 1750 2450 100 21
DS 2250 2450 2750 2450 100 21
DS -3300 -1000 -3050 -1000 60 21
DS -3050 550 -3050 -1000 60 21
DS -3050 550 -3300 550 60 21
DS -3000 1100 -3000 1950 60 21
DS -2800 -1700 -3300 -1700 60 21
DS -2200 -1700 -2800 -1700 60 21
DS -2200 -1700 -1800 -1700 60 21
DS -1200 -1700 -1800 -1700 60 21
DS 3000 1100 3000 1950 60 21
DS 3000 1950 3300 1950 60 21
DS -1200 -1700 -800 -1700 60 21
DS -200 -1700 200 -1700 60 21
DS 800 -1700 1200 -1700 60 21
DS 1800 -1700 2200 -1700 60 21
DS 3300 -1700 2800 -1700 60 21
DS 3300 -1700 3300 -1950 60 21
DS -200 -1700 -800 -1700 60 21
DS 800 -1700 200 -1700 60 21
DS 1800 -1700 1200 -1700 60 21
DS 2800 -1700 2200 -1700 60 21
DS -3000 1100 3000 1100 60 21
DS -3000 1950 3000 1950 60 21
$PAD
Sh "1" O 520 1040 0 0 0
Dr 320 0 0
At STD N 00E0FFFF
Ne 0 ""
Po -2500 1500
$EndPAD
$PAD
Sh "2" O 520 1040 0 0 0
Dr 320 0 0
At STD N 00E0FFFF
Ne 0 ""
Po -1500 1500
$EndPAD
$PAD
Sh "3" O 520 1040 0 0 0
Dr 320 0 0
At STD N 00E0FFFF
Ne 0 ""
Po -500 1500
$EndPAD
$PAD
Sh "4" O 520 1040 0 0 0
Dr 320 0 0
At STD N 00E0FFFF
Ne 0 ""
Po 500 1500
$EndPAD
$PAD
Sh "5" O 520 1040 0 0 0
Dr 320 0 0
At STD N 00E0FFFF
Ne 0 ""
Po 1500 1500
$EndPAD
$PAD
Sh "6" O 520 1040 0 0 0
Dr 320 0 0
At STD N 00E0FFFF
Ne 0 ""
Po 2500 1500
$EndPAD
$PAD
Sh "7" O 520 1040 0 0 0
Dr 320 0 0
At STD N 00E0FFFF
Ne 0 ""
Po 2500 -1500
$EndPAD
$PAD
Sh "8" O 520 1040 0 0 0
Dr 320 0 0
At STD N 00E0FFFF
Ne 0 ""
Po 1500 -1500
$EndPAD
$PAD
Sh "9" O 520 1040 0 0 0
Dr 320 0 0
At STD N 00E0FFFF
Ne 0 ""
Po 500 -1500
$EndPAD
$PAD
Sh "10" O 520 1040 0 0 0
Dr 320 0 0
At STD N 00E0FFFF
Ne 0 ""
Po -500 -1500
$EndPAD
$PAD
Sh "11" O 520 1040 0 0 0
Dr 320 0 0
At STD N 00E0FFFF
Ne 0 ""
Po -1500 -1500
$EndPAD
$PAD
Sh "12" O 520 1040 0 0 0
Dr 320 0 0
At STD N 00E0FFFF
Ne 0 ""
Po -2500 -1500
$EndPAD
$SHAPE3D
Na "Switch\\DIP\\ds_dp06.wrl"
Sc 1.000000 1.000000 1.000000
Of 0.000000 0.000000 0.000000
Ro 0.000000 0.000000 0.000000
$EndSHAPE3D
$EndMODULE  DP-06
$MODULE DP-07
Po 0 0 0 15 4FB00AEB 00000000 ~~
Li DP-07
Cd DIL/CODE SWITCH
Kw DIL/CODE SWITCH
Sc 00000000
AR
Op 0 0 0
At VIRTUAL
T0 0 -2559 394 394 0 79 N V 21 N "DP-07"
T1 0 0 394 394 0 79 N I 21 N "Value"
DS -3300 2450 -2700 2450 26 21
DS -2700 2450 -2700 1100 26 21
DS -3300 1100 -2700 1100 26 21
DS -3300 2450 -3300 1100 26 21
DS -2300 2450 -1700 2450 26 21
DS -1700 2450 -1700 1100 26 21
DS -2300 1100 -1700 1100 26 21
DS -2300 2450 -2300 1100 26 21
DS -1300 2450 -700 2450 26 21
DS -700 2450 -700 1100 26 21
DS -1300 1100 -700 1100 26 21
DS -1300 2450 -1300 1100 26 21
DS -300 2450 300 2450 26 21
DS 300 2450 300 1100 26 21
DS -300 1100 300 1100 26 21
DS -300 2450 -300 1100 26 21
DS 700 2450 1300 2450 26 21
DS 1300 2450 1300 1100 26 21
DS 700 1100 1300 1100 26 21
DS 700 2450 700 1100 26 21
DS 1700 2450 2300 2450 26 21
DS 2300 2450 2300 1100 26 21
DS 1700 1100 2300 1100 26 21
DS 1700 2450 1700 1100 26 21
DS 2700 2450 3300 2450 26 21
DS 3300 2450 3300 1100 26 21
DS 2700 1100 3300 1100 26 21
DS 2700 2450 2700 1100 26 21
DS -3800 1950 -3500 1950 60 21
DS 3800 -1950 -3800 -1950 60 21
DS -3800 -1950 -3800 -1700 60 21
DS -3800 -1700 -3800 -1000 60 21
DS -3800 -1000 -3800 550 60 21
DS -3800 550 -3800 1950 60 21
DS 3800 1950 3800 -1700 60 21
DS -3250 2450 -2750 2450 100 21
DS -2250 2450 -1750 2450 100 21
DS -1250 2450 -750 2450 100 21
DS -250 2450 250 2450 100 21
DS 750 2450 1250 2450 100 21
DS 1750 2450 2250 2450 100 21
DS 2750 2450 3250 2450 100 21
DS -3800 -1000 -3550 -1000 60 21
DS -3550 550 -3550 -1000 60 21
DS -3550 550 -3800 550 60 21
DS -3500 1100 -3500 1950 60 21
DS -3300 -1700 -3800 -1700 60 21
DS -2700 -1700 -3300 -1700 60 21
DS -2700 -1700 -2300 -1700 60 21
DS -1700 -1700 -2300 -1700 60 21
DS 3500 1100 3500 1950 60 21
DS 3500 1950 3800 1950 60 21
DS -1700 -1700 -1300 -1700 60 21
DS -700 -1700 -1300 -1700 60 21
DS -700 -1700 -300 -1700 60 21
DS 300 -1700 -300 -1700 60 21
DS 300 -1700 700 -1700 60 21
DS 1300 -1700 700 -1700 60 21
DS 1300 -1700 1700 -1700 60 21
DS 2300 -1700 1700 -1700 60 21
DS 2300 -1700 2700 -1700 60 21
DS 3300 -1700 2700 -1700 60 21
DS 3800 -1700 3300 -1700 60 21
DS 3800 -1700 3800 -1950 60 21
DS -3500 1100 3500 1100 60 21
DS -3500 1950 3500 1950 60 21
$PAD
Sh "1" O 520 1040 0 0 0
Dr 320 0 0
At STD N 00E0FFFF
Ne 0 ""
Po -3000 1500
$EndPAD
$PAD
Sh "2" O 520 1040 0 0 0
Dr 320 0 0
At STD N 00E0FFFF
Ne 0 ""
Po -2000 1500
$EndPAD
$PAD
Sh "3" O 520 1040 0 0 0
Dr 320 0 0
At STD N 00E0FFFF
Ne 0 ""
Po -1000 1500
$EndPAD
$PAD
Sh "4" O 520 1040 0 0 0
Dr 320 0 0
At STD N 00E0FFFF
Ne 0 ""
Po 0 1500
$EndPAD
$PAD
Sh "5" O 520 1040 0 0 0
Dr 320 0 0
At STD N 00E0FFFF
Ne 0 ""
Po 1000 1500
$EndPAD
$PAD
Sh "6" O 520 1040 0 0 0
Dr 320 0 0
At STD N 00E0FFFF
Ne 0 ""
Po 2000 1500
$EndPAD
$PAD
Sh "7" O 520 1040 0 0 0
Dr 320 0 0
At STD N 00E0FFFF
Ne 0 ""
Po 3000 1500
$EndPAD
$PAD
Sh "8" O 520 1040 0 0 0
Dr 320 0 0
At STD N 00E0FFFF
Ne 0 ""
Po 3000 -1500
$EndPAD
$PAD
Sh "9" O 520 1040 0 0 0
Dr 320 0 0
At STD N 00E0FFFF
Ne 0 ""
Po 2000 -1500
$EndPAD
$PAD
Sh "10" O 520 1040 0 0 0
Dr 320 0 0
At STD N 00E0FFFF
Ne 0 ""
Po 1000 -1500
$EndPAD
$PAD
Sh "11" O 520 1040 0 0 0
Dr 320 0 0
At STD N 00E0FFFF
Ne 0 ""
Po 0 -1500
$EndPAD
$PAD
Sh "12" O 520 1040 0 0 0
Dr 320 0 0
At STD N 00E0FFFF
Ne 0 ""
Po -1000 -1500
$EndPAD
$PAD
Sh "13" O 520 1040 0 0 0
Dr 320 0 0
At STD N 00E0FFFF
Ne 0 ""
Po -2000 -1500
$EndPAD
$PAD
Sh "14" O 520 1040 0 0 0
Dr 320 0 0
At STD N 00E0FFFF
Ne 0 ""
Po -3000 -1500
$EndPAD
$SHAPE3D
Na "Switch\\DIP\\ds_dp07.wrl"
Sc 1.000000 1.000000 1.000000
Of 0.000000 0.000000 0.000000
Ro 0.000000 0.000000 0.000000
$EndSHAPE3D
$EndMODULE  DP-07
$MODULE DP-08
Po 0 0 0 15 4FB00C10 00000000 ~~
Li DP-08
Cd DIL/CODE SWITCH
Kw DIL/CODE SWITCH
Sc 00000000
AR
Op 0 0 0
At VIRTUAL
T0 0 -2559 394 394 0 79 N V 21 N "DP-08"
T1 0 0 394 394 0 79 N I 21 N "Value"
DS -3800 2450 -3200 2450 26 21
DS -3200 2450 -3200 1100 26 21
DS -3800 1100 -3200 1100 26 21
DS -3800 2450 -3800 1100 26 21
DS -2800 2450 -2200 2450 26 21
DS -2200 2450 -2200 1100 26 21
DS -2800 1100 -2200 1100 26 21
DS -2800 2450 -2800 1100 26 21
DS -1800 2450 -1200 2450 26 21
DS -1200 2450 -1200 1100 26 21
DS -1800 1100 -1200 1100 26 21
DS -1800 2450 -1800 1100 26 21
DS -800 2450 -200 2450 26 21
DS -200 2450 -200 1100 26 21
DS -800 1100 -200 1100 26 21
DS -800 2450 -800 1100 26 21
DS 200 2450 800 2450 26 21
DS 800 2450 800 1100 26 21
DS 200 1100 800 1100 26 21
DS 200 2450 200 1100 26 21
DS 1200 2450 1800 2450 26 21
DS 1800 2450 1800 1100 26 21
DS 1200 1100 1800 1100 26 21
DS 1200 2450 1200 1100 26 21
DS 2200 2450 2800 2450 26 21
DS 2800 2450 2800 1100 26 21
DS 2200 1100 2800 1100 26 21
DS 2200 2450 2200 1100 26 21
DS 3200 2450 3800 2450 26 21
DS 3800 2450 3800 1100 26 21
DS 3200 1100 3800 1100 26 21
DS 3200 2450 3200 1100 26 21
DS -4300 1950 -4000 1950 60 21
DS 4300 -1950 -4300 -1950 60 21
DS -4300 -1950 -4300 -1700 60 21
DS -4300 -1700 -4300 -1000 60 21
DS -4300 -1000 -4300 550 60 21
DS -4300 550 -4300 1950 60 21
DS 4300 1950 4300 -1700 60 21
DS -3750 2450 -3250 2450 100 21
DS -2750 2450 -2250 2450 100 21
DS -1750 2450 -1250 2450 100 21
DS -750 2450 -250 2450 100 21
DS 250 2450 750 2450 100 21
DS 1250 2450 1750 2450 100 21
DS 2250 2450 2750 2450 100 21
DS 3250 2450 3750 2450 100 21
DS -4300 -1000 -4050 -1000 60 21
DS -4050 550 -4050 -1000 60 21
DS -4050 550 -4300 550 60 21
DS -4000 1100 -4000 1950 60 21
DS -3800 -1700 -4300 -1700 60 21
DS -3200 -1700 -3800 -1700 60 21
DS -3200 -1700 -2800 -1700 60 21
DS -2200 -1700 -2800 -1700 60 21
DS 4000 1100 4000 1950 60 21
DS 4000 1950 4300 1950 60 21
DS -4000 1100 4000 1100 60 21
DS -4000 1950 4000 1950 60 21
DS -2200 -1700 -1800 -1700 60 21
DS -1200 -1700 -800 -1700 60 21
DS -1200 -1700 -1800 -1700 60 21
DS -200 -1700 -800 -1700 60 21
DS -200 -1700 200 -1700 60 21
DS 800 -1700 200 -1700 60 21
DS 800 -1700 1200 -1700 60 21
DS 1800 -1700 1200 -1700 60 21
DS 1800 -1700 2200 -1700 60 21
DS 2800 -1700 2200 -1700 60 21
DS 2800 -1700 3200 -1700 60 21
DS 3800 -1700 3200 -1700 60 21
DS 4300 -1700 3800 -1700 60 21
DS 4300 -1700 4300 -1950 60 21
$PAD
Sh "1" O 520 1040 0 0 0
Dr 320 0 0
At STD N 00E0FFFF
Ne 0 ""
Po -3500 1500
$EndPAD
$PAD
Sh "2" O 520 1040 0 0 0
Dr 320 0 0
At STD N 00E0FFFF
Ne 0 ""
Po -2500 1500
$EndPAD
$PAD
Sh "3" O 520 1040 0 0 0
Dr 320 0 0
At STD N 00E0FFFF
Ne 0 ""
Po -1500 1500
$EndPAD
$PAD
Sh "4" O 520 1040 0 0 0
Dr 320 0 0
At STD N 00E0FFFF
Ne 0 ""
Po -500 1500
$EndPAD
$PAD
Sh "5" O 520 1040 0 0 0
Dr 320 0 0
At STD N 00E0FFFF
Ne 0 ""
Po 500 1500
$EndPAD
$PAD
Sh "6" O 520 1040 0 0 0
Dr 320 0 0
At STD N 00E0FFFF
Ne 0 ""
Po 1500 1500
$EndPAD
$PAD
Sh "7" O 520 1040 0 0 0
Dr 320 0 0
At STD N 00E0FFFF
Ne 0 ""
Po 2500 1500
$EndPAD
$PAD
Sh "8" O 520 1040 0 0 0
Dr 320 0 0
At STD N 00E0FFFF
Ne 0 ""
Po 3500 1500
$EndPAD
$PAD
Sh "9" O 520 1040 0 0 0
Dr 320 0 0
At STD N 00E0FFFF
Ne 0 ""
Po 3500 -1500
$EndPAD
$PAD
Sh "10" O 520 1040 0 0 0
Dr 320 0 0
At STD N 00E0FFFF
Ne 0 ""
Po 2500 -1500
$EndPAD
$PAD
Sh "11" O 520 1040 0 0 0
Dr 320 0 0
At STD N 00E0FFFF
Ne 0 ""
Po 1500 -1500
$EndPAD
$PAD
Sh "12" O 520 1040 0 0 0
Dr 320 0 0
At STD N 00E0FFFF
Ne 0 ""
Po 500 -1500
$EndPAD
$PAD
Sh "13" O 520 1040 0 0 0
Dr 320 0 0
At STD N 00E0FFFF
Ne 0 ""
Po -500 -1500
$EndPAD
$PAD
Sh "14" O 520 1040 0 0 0
Dr 320 0 0
At STD N 00E0FFFF
Ne 0 ""
Po -1500 -1500
$EndPAD
$PAD
Sh "15" O 520 1040 0 0 0
Dr 320 0 0
At STD N 00E0FFFF
Ne 0 ""
Po -2500 -1500
$EndPAD
$PAD
Sh "16" O 520 1040 0 0 0
Dr 320 0 0
At STD N 00E0FFFF
Ne 0 ""
Po -3500 -1500
$EndPAD
$SHAPE3D
Na "Switch\\DIP\\ds_dp08.wrl"
Sc 1.000000 1.000000 1.000000
Of 0.000000 0.000000 0.000000
Ro 0.000000 0.000000 0.000000
$EndSHAPE3D
$EndMODULE  DP-08
$MODULE DP-09
Po 0 0 0 15 4FB00C7E 00000000 ~~
Li DP-09
Cd DIL/CODE SWITCH
Kw DIL/CODE SWITCH
Sc 00000000
AR
Op 0 0 0
At VIRTUAL
T0 0 -2559 394 394 0 79 N V 21 N "DP-09"
T1 0 0 394 394 0 79 N I 21 N "Value"
DS -4300 2450 -3700 2450 26 21
DS -3700 2450 -3700 1100 26 21
DS -4300 1100 -3700 1100 26 21
DS -4300 2450 -4300 1100 26 21
DS -3300 2450 -2700 2450 26 21
DS -2700 2450 -2700 1100 26 21
DS -3300 1100 -2700 1100 26 21
DS -3300 2450 -3300 1100 26 21
DS -2300 2450 -1700 2450 26 21
DS -1700 2450 -1700 1100 26 21
DS -2300 1100 -1700 1100 26 21
DS -2300 2450 -2300 1100 26 21
DS -1300 2450 -700 2450 26 21
DS -700 2450 -700 1100 26 21
DS -1300 1100 -700 1100 26 21
DS -1300 2450 -1300 1100 26 21
DS -300 2450 300 2450 26 21
DS 300 2450 300 1100 26 21
DS -300 1100 300 1100 26 21
DS -300 2450 -300 1100 26 21
DS 700 2450 1300 2450 26 21
DS 1300 2450 1300 1100 26 21
DS 700 1100 1300 1100 26 21
DS 700 2450 700 1100 26 21
DS 1700 2450 2300 2450 26 21
DS 2300 2450 2300 1100 26 21
DS 1700 1100 2300 1100 26 21
DS 1700 2450 1700 1100 26 21
DS 2700 2450 3300 2450 26 21
DS 3300 2450 3300 1100 26 21
DS 2700 1100 3300 1100 26 21
DS 2700 2450 2700 1100 26 21
DS 3700 2450 4300 2450 26 21
DS 4300 2450 4300 1100 26 21
DS 3700 1100 4300 1100 26 21
DS 3700 2450 3700 1100 26 21
DS -4800 1950 -4500 1950 60 21
DS 4800 -1950 -4800 -1950 60 21
DS -4800 -1950 -4800 -1700 60 21
DS -4800 -1700 -4800 -1000 60 21
DS -4800 -1000 -4800 550 60 21
DS -4800 550 -4800 1950 60 21
DS 4800 1950 4800 -1700 60 21
DS -4250 2450 -3750 2450 100 21
DS -3250 2450 -2750 2450 100 21
DS -2250 2450 -1750 2450 100 21
DS -1250 2450 -750 2450 100 21
DS -250 2450 250 2450 100 21
DS 750 2450 1250 2450 100 21
DS 1750 2450 2250 2450 100 21
DS 2750 2450 3250 2450 100 21
DS 3750 2450 4250 2450 100 21
DS -4800 -1000 -4550 -1000 60 21
DS -4550 550 -4550 -1000 60 21
DS -4550 550 -4800 550 60 21
DS -4500 1100 -4500 1950 60 21
DS -4300 -1700 -4800 -1700 60 21
DS -3700 -1700 -4300 -1700 60 21
DS -3700 -1700 -3300 -1700 60 21
DS -2700 -1700 -3300 -1700 60 21
DS 4500 1100 4500 1950 60 21
DS 4500 1950 4800 1950 60 21
DS -4500 1100 4500 1100 60 21
DS -4500 1950 4500 1950 60 21
DS -2700 -1700 -2300 -1700 60 21
DS -1700 -1700 -2300 -1700 60 21
DS -1700 -1700 -1300 -1700 60 21
DS -700 -1700 -1300 -1700 60 21
DS -700 -1700 -300 -1700 60 21
DS 300 -1700 -300 -1700 60 21
DS 300 -1700 700 -1700 60 21
DS 1300 -1700 700 -1700 60 21
DS 1300 -1700 1700 -1700 60 21
DS 2300 -1700 1700 -1700 60 21
DS 2300 -1700 2700 -1700 60 21
DS 3300 -1700 2700 -1700 60 21
DS 3300 -1700 3700 -1700 60 21
DS 4300 -1700 3700 -1700 60 21
DS 4300 -1700 4800 -1700 60 21
DS 4800 -1700 4800 -1950 60 21
$PAD
Sh "1" O 520 1040 0 0 0
Dr 320 0 0
At STD N 00E0FFFF
Ne 0 ""
Po -4000 1500
$EndPAD
$PAD
Sh "2" O 520 1040 0 0 0
Dr 320 0 0
At STD N 00E0FFFF
Ne 0 ""
Po -3000 1500
$EndPAD
$PAD
Sh "3" O 520 1040 0 0 0
Dr 320 0 0
At STD N 00E0FFFF
Ne 0 ""
Po -2000 1500
$EndPAD
$PAD
Sh "4" O 520 1040 0 0 0
Dr 320 0 0
At STD N 00E0FFFF
Ne 0 ""
Po -1000 1500
$EndPAD
$PAD
Sh "5" O 520 1040 0 0 0
Dr 320 0 0
At STD N 00E0FFFF
Ne 0 ""
Po 0 1500
$EndPAD
$PAD
Sh "6" O 520 1040 0 0 0
Dr 320 0 0
At STD N 00E0FFFF
Ne 0 ""
Po 1000 1500
$EndPAD
$PAD
Sh "7" O 520 1040 0 0 0
Dr 320 0 0
At STD N 00E0FFFF
Ne 0 ""
Po 2000 1500
$EndPAD
$PAD
Sh "8" O 520 1040 0 0 0
Dr 320 0 0
At STD N 00E0FFFF
Ne 0 ""
Po 3000 1500
$EndPAD
$PAD
Sh "9" O 520 1040 0 0 0
Dr 320 0 0
At STD N 00E0FFFF
Ne 0 ""
Po 4000 1500
$EndPAD
$PAD
Sh "10" O 520 1040 0 0 0
Dr 320 0 0
At STD N 00E0FFFF
Ne 0 ""
Po 4000 -1500
$EndPAD
$PAD
Sh "11" O 520 1040 0 0 0
Dr 320 0 0
At STD N 00E0FFFF
Ne 0 ""
Po 3000 -1500
$EndPAD
$PAD
Sh "12" O 520 1040 0 0 0
Dr 320 0 0
At STD N 00E0FFFF
Ne 0 ""
Po 2000 -1500
$EndPAD
$PAD
Sh "13" O 520 1040 0 0 0
Dr 320 0 0
At STD N 00E0FFFF
Ne 0 ""
Po 1000 -1500
$EndPAD
$PAD
Sh "14" O 520 1040 0 0 0
Dr 320 0 0
At STD N 00E0FFFF
Ne 0 ""
Po 0 -1500
$EndPAD
$PAD
Sh "15" O 520 1040 0 0 0
Dr 320 0 0
At STD N 00E0FFFF
Ne 0 ""
Po -1000 -1500
$EndPAD
$PAD
Sh "16" O 520 1040 0 0 0
Dr 320 0 0
At STD N 00E0FFFF
Ne 0 ""
Po -2000 -1500
$EndPAD
$PAD
Sh "17" O 520 1040 0 0 0
Dr 320 0 0
At STD N 00E0FFFF
Ne 0 ""
Po -3000 -1500
$EndPAD
$PAD
Sh "18" O 520 1040 0 0 0
Dr 320 0 0
At STD N 00E0FFFF
Ne 0 ""
Po -4000 -1500
$EndPAD
$SHAPE3D
Na "Switch\\DIP\\ds_dp09.wrl"
Sc 1.000000 1.000000 1.000000
Of 0.000000 0.000000 0.000000
Ro 0.000000 0.000000 0.000000
$EndSHAPE3D
$EndMODULE  DP-09
$MODULE DP-10
Po 0 0 0 15 4FB00CCC 00000000 ~~
Li DP-10
Cd DIL/CODE SWITCH
Kw DIL/CODE SWITCH
Sc 00000000
AR
Op 0 0 0
At VIRTUAL
T0 0 -2461 394 394 0 79 N V 21 N "DP-10"
T1 0 0 394 394 0 79 N I 21 N "Value"
DS -4800 2450 -4200 2450 26 21
DS -4200 2450 -4200 1100 26 21
DS -4800 1100 -4200 1100 26 21
DS -4800 2450 -4800 1100 26 21
DS -3800 2450 -3200 2450 26 21
DS -3200 2450 -3200 1100 26 21
DS -3800 1100 -3200 1100 26 21
DS -3800 2450 -3800 1100 26 21
DS -2800 2450 -2200 2450 26 21
DS -2200 2450 -2200 1100 26 21
DS -2800 1100 -2200 1100 26 21
DS -2800 2450 -2800 1100 26 21
DS -1800 2450 -1200 2450 26 21
DS -1200 2450 -1200 1100 26 21
DS -1800 1100 -1200 1100 26 21
DS -1800 2450 -1800 1100 26 21
DS -800 2450 -200 2450 26 21
DS -200 2450 -200 1100 26 21
DS -800 1100 -200 1100 26 21
DS -800 2450 -800 1100 26 21
DS 200 2450 800 2450 26 21
DS 800 2450 800 1100 26 21
DS 200 1100 800 1100 26 21
DS 200 2450 200 1100 26 21
DS 1200 2450 1800 2450 26 21
DS 1800 2450 1800 1100 26 21
DS 1200 1100 1800 1100 26 21
DS 1200 2450 1200 1100 26 21
DS 2200 2450 2800 2450 26 21
DS 2800 2450 2800 1100 26 21
DS 2200 1100 2800 1100 26 21
DS 2200 2450 2200 1100 26 21
DS 3200 2450 3800 2450 26 21
DS 3800 2450 3800 1100 26 21
DS 3200 1100 3800 1100 26 21
DS 3200 2450 3200 1100 26 21
DS 4200 2450 4800 2450 26 21
DS 4800 2450 4800 1100 26 21
DS 4200 1100 4800 1100 26 21
DS 4200 2450 4200 1100 26 21
DS -5300 1950 -5000 1950 60 21
DS 5300 -1950 -5300 -1950 60 21
DS -5300 -1950 -5300 -1700 60 21
DS -5300 -1700 -5300 -1000 60 21
DS -5300 -1000 -5300 550 60 21
DS -5300 550 -5300 1950 60 21
DS 5300 1950 5300 -1700 60 21
DS -4750 2450 -4250 2450 100 21
DS -3750 2450 -3250 2450 100 21
DS -2750 2450 -2250 2450 100 21
DS -1750 2450 -1250 2450 100 21
DS -750 2450 -250 2450 100 21
DS 250 2450 750 2450 100 21
DS 1250 2450 1750 2450 100 21
DS 2250 2450 2750 2450 100 21
DS 3250 2450 3750 2450 100 21
DS 4250 2450 4750 2450 100 21
DS -5300 -1000 -5050 -1000 60 21
DS -5050 550 -5050 -1000 60 21
DS -5050 550 -5300 550 60 21
DS -5000 1100 -5000 1950 60 21
DS -4800 -1700 -5300 -1700 60 21
DS -4200 -1700 -4800 -1700 60 21
DS -4200 -1700 -3800 -1700 60 21
DS -3200 -1700 -3800 -1700 60 21
DS 5000 1100 5000 1950 60 21
DS 5000 1950 5300 1950 60 21
DS -5000 1100 5000 1100 60 21
DS -5000 1950 5000 1950 60 21
DS -3200 -1700 -2800 -1700 60 21
DS -2200 -1700 -2800 -1700 60 21
DS -2200 -1700 -1800 -1700 60 21
DS -1200 -1700 -1800 -1700 60 21
DS -1200 -1700 -800 -1700 60 21
DS -200 -1700 -800 -1700 60 21
DS -200 -1700 200 -1700 60 21
DS 800 -1700 200 -1700 60 21
DS 800 -1700 1200 -1700 60 21
DS 1800 -1700 1200 -1700 60 21
DS 1800 -1700 2200 -1700 60 21
DS 2800 -1700 2200 -1700 60 21
DS 2800 -1700 3200 -1700 60 21
DS 3800 -1700 3200 -1700 60 21
DS 3800 -1700 4200 -1700 60 21
DS 4800 -1700 4200 -1700 60 21
DS 4800 -1700 5300 -1700 60 21
DS 5300 -1700 5300 -1950 60 21
$PAD
Sh "1" O 520 1040 0 0 0
Dr 320 0 0
At STD N 00E0FFFF
Ne 0 ""
Po -4500 1500
$EndPAD
$PAD
Sh "2" O 520 1040 0 0 0
Dr 320 0 0
At STD N 00E0FFFF
Ne 0 ""
Po -3500 1500
$EndPAD
$PAD
Sh "3" O 520 1040 0 0 0
Dr 320 0 0
At STD N 00E0FFFF
Ne 0 ""
Po -2500 1500
$EndPAD
$PAD
Sh "4" O 520 1040 0 0 0
Dr 320 0 0
At STD N 00E0FFFF
Ne 0 ""
Po -1500 1500
$EndPAD
$PAD
Sh "5" O 520 1040 0 0 0
Dr 320 0 0
At STD N 00E0FFFF
Ne 0 ""
Po -500 1500
$EndPAD
$PAD
Sh "6" O 520 1040 0 0 0
Dr 320 0 0
At STD N 00E0FFFF
Ne 0 ""
Po 500 1500
$EndPAD
$PAD
Sh "7" O 520 1040 0 0 0
Dr 320 0 0
At STD N 00E0FFFF
Ne 0 ""
Po 1500 1500
$EndPAD
$PAD
Sh "8" O 520 1040 0 0 0
Dr 320 0 0
At STD N 00E0FFFF
Ne 0 ""
Po 2500 1500
$EndPAD
$PAD
Sh "9" O 520 1040 0 0 0
Dr 320 0 0
At STD N 00E0FFFF
Ne 0 ""
Po 3500 1500
$EndPAD
$PAD
Sh "10" O 520 1040 0 0 0
Dr 320 0 0
At STD N 00E0FFFF
Ne 0 ""
Po 4500 1500
$EndPAD
$PAD
Sh "11" O 520 1040 0 0 0
Dr 320 0 0
At STD N 00E0FFFF
Ne 0 ""
Po 4500 -1500
$EndPAD
$PAD
Sh "12" O 520 1040 0 0 0
Dr 320 0 0
At STD N 00E0FFFF
Ne 0 ""
Po 3500 -1500
$EndPAD
$PAD
Sh "13" O 520 1040 0 0 0
Dr 320 0 0
At STD N 00E0FFFF
Ne 0 ""
Po 2500 -1500
$EndPAD
$PAD
Sh "14" O 520 1040 0 0 0
Dr 320 0 0
At STD N 00E0FFFF
Ne 0 ""
Po 1500 -1500
$EndPAD
$PAD
Sh "15" O 520 1040 0 0 0
Dr 320 0 0
At STD N 00E0FFFF
Ne 0 ""
Po 500 -1500
$EndPAD
$PAD
Sh "16" O 520 1040 0 0 0
Dr 320 0 0
At STD N 00E0FFFF
Ne 0 ""
Po -500 -1500
$EndPAD
$PAD
Sh "17" O 520 1040 0 0 0
Dr 320 0 0
At STD N 00E0FFFF
Ne 0 ""
Po -1500 -1500
$EndPAD
$PAD
Sh "18" O 520 1040 0 0 0
Dr 320 0 0
At STD N 00E0FFFF
Ne 0 ""
Po -2500 -1500
$EndPAD
$PAD
Sh "19" O 520 1040 0 0 0
Dr 320 0 0
At STD N 00E0FFFF
Ne 0 ""
Po -3500 -1500
$EndPAD
$PAD
Sh "20" O 520 1040 0 0 0
Dr 320 0 0
At STD N 00E0FFFF
Ne 0 ""
Po -4500 -1500
$EndPAD
$SHAPE3D
Na "Switch\\DIP\\ds_dp10.wrl"
Sc 1.000000 1.000000 1.000000
Of 0.000000 0.000000 0.000000
Ro 0.000000 0.000000 0.000000
$EndSHAPE3D
$EndMODULE  DP-10
$MODULE DP-12
Po 0 0 0 15 4FB00D25 00000000 ~~
Li DP-12
Cd DIL/CODE SWITCH
Kw DIL/CODE SWITCH
Sc 00000000
AR 
Op 0 0 0
At VIRTUAL 
T0 0 -2461 394 394 0 79 N V 21 N "DP-12"
T1 0 0 394 394 0 79 N I 21 N "Value"
DS -5800 2450 -5200 2450 26 21
DS -5200 2450 -5200 1100 26 21
DS -5800 1100 -5200 1100 26 21
DS -5800 2450 -5800 1100 26 21
DS -4800 2450 -4200 2450 26 21
DS -4200 2450 -4200 1100 26 21
DS -4800 1100 -4200 1100 26 21
DS -4800 2450 -4800 1100 26 21
DS -3800 2450 -3200 2450 26 21
DS -3200 2450 -3200 1100 26 21
DS -3800 1100 -3200 1100 26 21
DS -3800 2450 -3800 1100 26 21
DS -2800 2450 -2200 2450 26 21
DS -2200 2450 -2200 1100 26 21
DS -2800 1100 -2200 1100 26 21
DS -2800 2450 -2800 1100 26 21
DS -1800 2450 -1200 2450 26 21
DS -1200 2450 -1200 1100 26 21
DS -1800 1100 -1200 1100 26 21
DS -1800 2450 -1800 1100 26 21
DS -800 2450 -200 2450 26 21
DS -200 2450 -200 1100 26 21
DS -800 1100 -200 1100 26 21
DS -800 2450 -800 1100 26 21
DS 200 2450 800 2450 26 21
DS 800 2450 800 1100 26 21
DS 200 1100 800 1100 26 21
DS 200 2450 200 1100 26 21
DS 1200 2450 1800 2450 26 21
DS 1800 2450 1800 1100 26 21
DS 1200 1100 1800 1100 26 21
DS 1200 2450 1200 1100 26 21
DS 2200 2450 2800 2450 26 21
DS 2800 2450 2800 1100 26 21
DS 2200 1100 2800 1100 26 21
DS 2200 2450 2200 1100 26 21
DS 3200 2450 3800 2450 26 21
DS 3800 2450 3800 1100 26 21
DS 3200 1100 3800 1100 26 21
DS 3200 2450 3200 1100 26 21
DS 4200 2450 4800 2450 26 21
DS 4800 2450 4800 1100 26 21
DS 4200 1100 4800 1100 26 21
DS 4200 2450 4200 1100 26 21
DS 5200 2450 5800 2450 26 21
DS 5800 2450 5800 1100 26 21
DS 5200 1100 5800 1100 26 21
DS 5200 2450 5200 1100 26 21
DS -6300 1950 -6000 1950 60 21
DS 6300 -1950 -6300 -1950 60 21
DS -6300 -1950 -6300 -1700 60 21
DS -6300 -1700 -6300 -1000 60 21
DS -6300 -1000 -6300 550 60 21
DS -6300 550 -6300 1950 60 21
DS 6300 1950 6300 -1700 60 21
DS -5750 2450 -5250 2450 100 21
DS -4750 2450 -4250 2450 100 21
DS -3750 2450 -3250 2450 100 21
DS -2750 2450 -2250 2450 100 21
DS -1750 2450 -1250 2450 100 21
DS -750 2450 -250 2450 100 21
DS 250 2450 750 2450 100 21
DS 1250 2450 1750 2450 100 21
DS 2250 2450 2750 2450 100 21
DS 3250 2450 3750 2450 100 21
DS 4250 2450 4750 2450 100 21
DS 5250 2450 5750 2450 100 21
DS -6300 -1000 -6050 -1000 60 21
DS -6050 550 -6050 -1000 60 21
DS -6050 550 -6300 550 60 21
DS -6000 1100 -6000 1950 60 21
DS -5800 -1700 -6300 -1700 60 21
DS -5200 -1700 -5800 -1700 60 21
DS -5200 -1700 -4800 -1700 60 21
DS -4200 -1700 -4800 -1700 60 21
DS -6000 1100 6000 1100 60 21
DS -6000 1950 6000 1950 60 21
DS 6000 1100 6000 1950 60 21
DS 6000 1950 6300 1950 60 21
DS -4200 -1700 -3800 -1700 60 21
DS -3200 -1700 -2800 -1700 60 21
DS -2200 -1700 -1800 -1700 60 21
DS -3200 -1700 -3800 -1700 60 21
DS -2200 -1700 -2800 -1700 60 21
DS -1200 -1700 -800 -1700 60 21
DS -1200 -1700 -1800 -1700 60 21
DS -200 -1700 -800 -1700 60 21
DS -200 -1700 200 -1700 60 21
DS 800 -1700 1200 -1700 60 21
DS 800 -1700 200 -1700 60 21
DS 1800 -1700 1200 -1700 60 21
DS 1800 -1700 2200 -1700 60 21
DS 2800 -1700 3200 -1700 60 21
DS 3800 -1700 4200 -1700 60 21
DS 4800 -1700 5200 -1700 60 21
DS 2800 -1700 2200 -1700 60 21
DS 3800 -1700 3200 -1700 60 21
DS 4800 -1700 4200 -1700 60 21
DS 5800 -1700 5200 -1700 60 21
DS 5800 -1700 6300 -1700 60 21
DS 6300 -1700 6300 -1950 60 21
$PAD
Sh "1" O 520 1040 0 0 0
Dr 320 0 0
At STD N 00E0FFFF
Ne 0 ""
Po -5500 1500
$EndPAD
$PAD
Sh "2" O 520 1040 0 0 0
Dr 320 0 0
At STD N 00E0FFFF
Ne 0 ""
Po -4500 1500
$EndPAD
$PAD
Sh "3" O 520 1040 0 0 0
Dr 320 0 0
At STD N 00E0FFFF
Ne 0 ""
Po -3500 1500
$EndPAD
$PAD
Sh "4" O 520 1040 0 0 0
Dr 320 0 0
At STD N 00E0FFFF
Ne 0 ""
Po -2500 1500
$EndPAD
$PAD
Sh "5" O 520 1040 0 0 0
Dr 320 0 0
At STD N 00E0FFFF
Ne 0 ""
Po -1500 1500
$EndPAD
$PAD
Sh "6" O 520 1040 0 0 0
Dr 320 0 0
At STD N 00E0FFFF
Ne 0 ""
Po -500 1500
$EndPAD
$PAD
Sh "7" O 520 1040 0 0 0
Dr 320 0 0
At STD N 00E0FFFF
Ne 0 ""
Po 500 1500
$EndPAD
$PAD
Sh "8" O 520 1040 0 0 0
Dr 320 0 0
At STD N 00E0FFFF
Ne 0 ""
Po 1500 1500
$EndPAD
$PAD
Sh "9" O 520 1040 0 0 0
Dr 320 0 0
At STD N 00E0FFFF
Ne 0 ""
Po 2500 1500
$EndPAD
$PAD
Sh "10" O 520 1040 0 0 0
Dr 320 0 0
At STD N 00E0FFFF
Ne 0 ""
Po 3500 1500
$EndPAD
$PAD
Sh "11" O 520 1040 0 0 0
Dr 320 0 0
At STD N 00E0FFFF
Ne 0 ""
Po 4500 1500
$EndPAD
$PAD
Sh "12" O 520 1040 0 0 0
Dr 320 0 0
At STD N 00E0FFFF
Ne 0 ""
Po 5500 1500
$EndPAD
$PAD
Sh "13" O 520 1040 0 0 0
Dr 320 0 0
At STD N 00E0FFFF
Ne 0 ""
Po 5500 -1500
$EndPAD
$PAD
Sh "14" O 520 1040 0 0 0
Dr 320 0 0
At STD N 00E0FFFF
Ne 0 ""
Po 4500 -1500
$EndPAD
$PAD
Sh "15" O 520 1040 0 0 0
Dr 320 0 0
At STD N 00E0FFFF
Ne 0 ""
Po 3500 -1500
$EndPAD
$PAD
Sh "16" O 520 1040 0 0 0
Dr 320 0 0
At STD N 00E0FFFF
Ne 0 ""
Po 2500 -1500
$EndPAD
$PAD
Sh "17" O 520 1040 0 0 0
Dr 320 0 0
At STD N 00E0FFFF
Ne 0 ""
Po 1500 -1500
$EndPAD
$PAD
Sh "18" O 520 1040 0 0 0
Dr 320 0 0
At STD N 00E0FFFF
Ne 0 ""
Po 500 -1500
$EndPAD
$PAD
Sh "19" O 520 1040 0 0 0
Dr 320 0 0
At STD N 00E0FFFF
Ne 0 ""
Po -500 -1500
$EndPAD
$PAD
Sh "20" O 520 1040 0 0 0
Dr 320 0 0
At STD N 00E0FFFF
Ne 0 ""
Po -1500 -1500
$EndPAD
$PAD
Sh "21" O 520 1040 0 0 0
Dr 320 0 0
At STD N 00E0FFFF
Ne 0 ""
Po -2500 -1500
$EndPAD
$PAD
Sh "22" O 520 1040 0 0 0
Dr 320 0 0
At STD N 00E0FFFF
Ne 0 ""
Po -3500 -1500
$EndPAD
$PAD
Sh "23" O 520 1040 0 0 0
Dr 320 0 0
At STD N 00E0FFFF
Ne 0 ""
Po -4500 -1500
$EndPAD
$PAD
Sh "24" O 520 1040 0 0 0
Dr 320 0 0
At STD N 00E0FFFF
Ne 0 ""
Po -5500 -1500
$EndPAD
$SHAPE3D
Na "Switch\\DIP\\ds_dp12.wrl"
Sc 1.000000 1.000000 1.000000
Of 0.000000 0.000000 0.000000
Ro 0.000000 0.000000 0.000000
$EndSHAPE3D
$EndMODULE  DP-12
$EndLIBRARY
