#VRML V2.0 utf8
#Exported from Wings 3D 1.4.1
DEF cube6_copy16 Transform {
  children [
    Shape {
      appearance Appearance {
        material DEF PIN Material {
          diffuseColor 0.79354 0.79354 0.79354
          emissiveColor 0.0 0.0 0.0
          specularColor 0.7402599999999999 0.7402599999999999 0.7402599999999999
          ambientIntensity 0.8867799999999999
          transparency 0.0
          shininess 1.0
        }
      }
      geometry IndexedFaceSet {
        normalPerVertex TRUE
        coord Coordinate { point [
          1.37795 -2.00787 2.2834599999999994,
          1.37795 -1.9291300000000005 2.2834599999999994,
          0.59055 -1.9291300000000005 2.2834599999999994,
          0.59055 -2.00787 2.2834599999999994,
          1.37795 -2.00787 -8.20748954885942e-17,
          1.37795 -1.9291300000000005 -8.508934241821435e-17,
          0.59055 -1.9291300000000005 -5.494487312201269e-17,
          0.59055 -2.00787 -5.193042619239254e-17,
          1.1811 -2.00787 -7.453877816454378e-17,
          1.1811 -1.9291300000000005 -7.755322509416394e-17,
          0.7874 -1.9291300000000005 -6.248099044606311e-17,
          0.7874 -2.00787 -5.946654351644296e-17,
          1.1811 -2.00787 -1.227185105336726,
          1.0303351053370609 -2.00787 -1.37795,
          1.1811 -1.9291300000000005 -1.227185105336726,
          1.0303351053370609 -1.9291300000000005 -1.37795,
          0.9381648946629392 -1.9291300000000005 -1.37795,
          0.7874 -1.9291300000000005 -1.227185105336726,
          0.9381648946629392 -2.00787 -1.37795,
          0.7874 -2.00787 -1.227185105336726,
          1.37795 -1.9291300000000005 2.3622,
          1.37795 -0.7480299999999998 2.3622,
          0.5905500000000001 -1.9291300000000005 2.3622,
          1.37795 -1.9291300000000005 2.2834600000000003,
          1.37795 -0.7480299999999998 2.2834600000000003,
          0.59055 -1.9291300000000005 2.2834600000000003,
          0.5905500000000001 -1.260655535238912 2.3622,
          1.1031755352389123 -0.7480299999999998 2.3622,
          0.59055 -1.2606555352389122 2.2834600000000003,
          1.1031755352389123 -0.7480299999999998 2.2834600000000003,
          1.144190625 -1.5598035497323768 2.3622,
          0.9842500000000002 -1.836623862232377 2.3622,
          0.9842500000000002 -1.2829832372323766 2.3622,
          0.8243093750000001 -1.5598035497323768 2.3622,
          1.144190625 -1.5598035497323768 2.2834600000000003,
          0.98425 -1.836623862232377 2.2834600000000003,
          0.98425 -1.2829832372323766 2.2834600000000003,
          0.824309375 -1.5598035497323768 2.2834600000000003,
          1.144190625 -1.6705316747323773 2.2834600000000003,
          1.05806875 -1.818169174732377 2.2834600000000003,
          1.05806875 -1.3014379247323766 2.2834600000000003,
          0.824309375 -1.4490754247323765 2.2834600000000003,
          1.144190625 -1.4490754247323765 2.2834600000000003,
          0.91043125 -1.8181691747323774 2.2834600000000003,
          0.91043125 -1.3014379247323766 2.2834600000000003,
          0.824309375 -1.6705316747323773 2.2834600000000003,
          1.144190625 -1.6705316747323773 2.3622,
          1.05806875 -1.818169174732377 2.3622,
          1.05806875 -1.3014379247323766 2.3622,
          0.8243093750000001 -1.4490754247323765 2.3622,
          1.144190625 -1.4490754247323765 2.3622,
          0.9104312500000001 -1.8181691747323774 2.3622,
          0.9104312500000001 -1.3014379247323766 2.3622,
          0.8243093750000001 -1.6705316747323773 2.3622,
          1.144190625 -1.7315602065725477 2.2834600000000003,
          1.1179080828937809 -1.779701032157825 2.2834600000000003,
          1.1179080828937809 -1.3399060673069485 2.2834600000000003,
          1.144190625 -1.3880468928922103 2.2834600000000003,
          0.824309375 -1.3880468928922103 2.2834600000000003,
          0.8505919171062192 -1.3399060673069485 2.2834600000000003,
          0.8505919171062192 -1.779701032157825 2.2834600000000003,
          0.824309375 -1.7315602065725477 2.2834600000000003,
          1.144190625 -1.7315602065725477 2.3622,
          1.1179080828937809 -1.779701032157825 2.3622,
          1.1179080828937809 -1.3399060673069485 2.3622,
          1.144190625 -1.38804689289221 2.3622,
          0.8243093750000001 -1.38804689289221 2.3622,
          0.8505919171062193 -1.3399060673069485 2.3622,
          0.8505919171062193 -1.779701032157825 2.3622,
          0.8243093750000001 -1.7315602065725477 2.3622,
          1.1811 -1.9291300000000005 2.3622,
          0.9842500000000002 -1.9291300000000005 2.3622,
          0.7874000000000002 -1.9291300000000005 2.3622,
          0.5905500000000001 -1.427774151429184 2.3622,
          0.5905500000000001 -1.5948927676194564 2.3622,
          0.5905500000000001 -1.762011383809728 2.3622,
          0.9750191514291843 -0.8761863838097278 2.3622,
          0.8468627676194561 -1.0043427676194558 2.3622,
          0.7187063838097282 -1.132499151429184 2.3622,
          1.309256383809728 -0.7480299999999998 2.3622,
          1.240562767619456 -0.7480299999999998 2.3622,
          1.1718691514291844 -0.7480299999999998 2.3622,
          1.37795 -1.6338550000000005 2.3622,
          1.37795 -1.3385799999999999 2.3622,
          1.37795 -1.0433049999999997 2.3622,
          1.309256383809728 -0.7480299999999998 2.2834600000000003,
          1.240562767619456 -0.7480299999999998 2.2834600000000003,
          1.1718691514291844 -0.7480299999999998 2.2834600000000003,
          0.718706383809728 -1.132499151429184 2.2834600000000003,
          0.846862767619456 -1.004342767619456 2.2834600000000003,
          0.9750191514291843 -0.8761863838097278 2.2834600000000003,
          0.59055 -1.4277741514291842 2.2834600000000003,
          0.59055 -1.5948927676194564 2.2834600000000003,
          0.59055 -1.762011383809728 2.2834600000000003,
          1.1811 -1.9291300000000005 2.2834600000000003,
          0.98425 -1.9291300000000005 2.2834600000000003,
          0.7874 -1.9291300000000005 2.2834600000000003,
          1.37795 -1.6338550000000005 2.2834600000000003,
          1.37795 -1.3385799999999999 2.2834600000000003,
          1.37795 -1.0433049999999997 2.2834600000000003,
          1.1154833333333336 -2.00787 2.2834599999999994,
          0.8530166666666668 -2.00787 2.2834599999999994,
          0.59055 -1.955376666666667 2.2834599999999994,
          0.59055 -1.9816233333333335 2.2834599999999994,
          1.1154833333333336 -1.9291300000000005 2.2834599999999994,
          0.8530166666666668 -1.9291300000000005 2.2834599999999994,
          0.5905500000000001 -1.9688080696761385 2.3313772564605726,
          1.37795 -1.9819314030094717 2.3313772564605726,
          0.6153055165436028 -1.4854789230425482 2.3622,
          1.1369363459518391 -1.1369363459518387 2.3622,
          1.4854789230425485 -0.6153055165436028 2.3622,
          0.6153055165436025 -1.4854789230425485 2.2834600000000003,
          1.1369363459518391 -1.1369363459518391 2.2834600000000003,
          1.4854789230425485 -0.6153055165436029 2.2834600000000003,
          0.3848843372103538 -0.9291929868382149 2.362199999999997,
          0.7111735230656363 -0.7111735230656357 2.362199999999998,
          0.3848843372103538 -0.9291929868382154 2.2834599999999976,
          0.7111735230656361 -0.7111735230656361 2.283459999999998,
          0.3076527582718016 -1.5466748615212738 2.3622,
          0.3076527582718013 -1.5466748615212744 2.2834600000000003,
          0.3076527582718016 -0.9445553030413513 2.362199999999997,
          0.3076527582718013 -0.9445553030413518 2.2834599999999976,
          0.7752304770835666 -0.6153055165436028 2.3621999999999987,
          0.7752304770835666 -0.6153055165436029 2.283459999999999 ] }
        coordIndex [
          0, 1, 23, 20, 107, -1,
          0, 4, 5, 1, -1,
          0, 100, 101, 3, 7, 4, -1,
          0, 107, 106, 103, 3, 101, 100, -1,
          1, 5, 6, 2, 105, 104, -1,
          1, 104, 94, 23, -1,
          2, 6, 7, 3, 103, 102, -1,
          2, 96, 95, 105, -1,
          2, 102, 25, 96, -1,
          4, 7, 6, 5, -1,
          8, 9, 10, 11, -1,
          8, 11, 19, 18, 13, 12, -1,
          8, 12, 14, 9, -1,
          9, 14, 15, 16, 17, 10, -1,
          10, 17, 19, 11, -1,
          12, 13, 15, 14, -1,
          13, 18, 16, 15, -1,
          16, 18, 19, 17, -1,
          20, 23, 97, 98, 99, 24, 21, 84, 83, 82, -1,
          20, 63, 47, 70, -1,
          20, 70, 71, 72, 22, 106, 107, -1,
          20, 82, 62, 63, -1,
          21, 24, 85, 86, 87, 29, 27, 81, 80, 79, -1,
          21, 50, 30, 84, -1,
          21, 79, 65, 50, -1,
          22, 25, 102, 103, 106, -1,
          22, 68, 69, 75, -1,
          22, 72, 51, 68, -1,
          22, 75, 74, 73, 26, 28, 91, 92, 93, 25, -1,
          23, 55, 54, 97, -1,
          23, 94, 39, 55, -1,
          24, 42, 57, 85, -1,
          24, 99, 34, 42, -1,
          25, 60, 43, 96, -1,
          25, 93, 61, 60, -1,
          26, 49, 66, 78, -1,
          26, 73, 33, 49, -1,
          26, 78, 77, 76, 27, 29, 90, 89, 88, 28, -1,
          27, 32, 48, 81, -1,
          27, 76, 52, 32, -1,
          28, 41, 37, 91, -1,
          28, 88, 58, 41, -1,
          29, 36, 44, 90, -1,
          29, 87, 40, 36, -1,
          30, 34, 38, 46, -1,
          30, 46, 83, 84, -1,
          30, 50, 42, 34, -1,
          31, 35, 43, 51, -1,
          31, 47, 39, 35, -1,
          31, 51, 72, 71, -1,
          31, 71, 70, 47, -1,
          32, 36, 40, 48, -1,
          32, 52, 44, 36, -1,
          33, 37, 41, 49, -1,
          33, 53, 45, 37, -1,
          33, 73, 74, 53, -1,
          34, 99, 98, 38, -1,
          35, 39, 94, 95, -1,
          35, 95, 96, 43, -1,
          37, 45, 92, 91, -1,
          38, 54, 62, 46, -1,
          38, 98, 97, 54, -1,
          39, 47, 63, 55, -1,
          40, 56, 64, 48, -1,
          40, 87, 86, 56, -1,
          41, 58, 66, 49, -1,
          42, 50, 65, 57, -1,
          43, 60, 68, 51, -1,
          44, 52, 67, 59, -1,
          44, 59, 89, 90, -1,
          45, 53, 69, 61, -1,
          45, 61, 93, 92, -1,
          46, 62, 82, 83, -1,
          48, 64, 80, 81, -1,
          52, 76, 77, 67, -1,
          53, 74, 75, 69, -1,
          54, 55, 63, 62, -1,
          56, 57, 65, 64, -1,
          56, 86, 85, 57, -1,
          58, 59, 67, 66, -1,
          58, 88, 89, 59, -1,
          60, 61, 69, 68, -1,
          64, 65, 79, 80, -1,
          66, 67, 77, 78, -1,
          94, 104, 105, 95, -1,
          108, 109, 115, 114, -1,
          108, 111, 112, 109, -1,
          108, 114, 120, 118, -1,
          108, 118, 119, 111, -1,
          109, 110, 122, 115, -1,
          109, 112, 113, 110, -1,
          110, 113, 123, 122, -1,
          111, 116, 117, 112, -1,
          111, 119, 121, 116, -1,
          112, 117, 123, 113, -1,
          114, 115, 117, 116, -1,
          114, 116, 121, 120, -1,
          115, 122, 123, 117, -1,
          118, 120, 121, 119, -1 ]
        normal Normal { vector [
          0.7192945037962621 -0.6640948495931046 0.20394471690240237,
          0.8944271909999159 0.4472135954999579 -5.52289014087989e-17,
          -0.7071067811865475 0.7071067811865475 -8.732456056034334e-17,
          -0.4709970778548435 -0.8432657415496327 0.25896841850107305,
          0.5773502691896257 -0.5773502691896257 -0.5773502691896258,
          0.5773502691896257 0.5773502691896257 -0.5773502691896258,
          -0.5773502691896257 0.5773502691896257 -0.5773502691896258,
          -0.5773502691896257 -0.5773502691896257 -0.5773502691896258,
          0.5773502691896258 -0.5773502691896258 0.5773502691896258,
          0.5773502691896258 0.5773502691896258 0.5773502691896258,
          -0.5773502691896258 0.5773502691896258 0.5773502691896258,
          -0.5773502691896258 -0.5773502691896258 0.5773502691896258,
          0.8125199200689746 -0.4759631494778832 -0.33655677059034383,
          0.33655677059121114 -0.47596314947805257 -0.8125199200685163,
          0.8125199200689746 0.4759631494778832 -0.33655677059034383,
          0.33655677059121114 0.47596314947805257 -0.8125199200685163,
          -0.33655677059121114 0.47596314947805257 -0.8125199200685163,
          -0.8125199200689746 0.4759631494778832 -0.33655677059034383,
          -0.33655677059121114 -0.47596314947805257 -0.8125199200685163,
          -0.8125199200689746 -0.4759631494778832 -0.33655677059034383,
          0.5687214841799242 -0.1580853393582248 0.8071957005040221,
          0.4082482904638631 0.4082482904638631 0.8164965809277261,
          -0.5705000408281532 -0.15784844247802998 0.8059860871146197,
          0.7071067811865475 0.0 -0.7071067811865475,
          0.4082482904638631 0.4082482904638631 -0.8164965809277261,
          -0.707106781186548 0.0 -0.7071067811865469,
          -0.6269431213219503 0.2596883436880721 0.7345095552677555,
          -0.25968834368807286 0.62694312132195 0.7345095552677555,
          -0.6269431213219507 0.25968834368807225 -0.7345095552677552,
          -0.25968834368807286 0.62694312132195 -0.7345095552677555,
          -0.7071067811865475 0.0 0.7071067811865475,
          -2.141540014093581e-15 0.6963106238227915 0.7177405625652732,
          -1.7929172211016033e-16 -0.6963106238227913 0.7177405625652734,
          0.707106781186548 0.0 0.7071067811865471,
          -0.7071067811865475 0.0 -0.7071067811865475,
          -2.141540014093581e-15 0.6963106238227915 -0.7177405625652732,
          -1.7929172211016033e-16 -0.6963106238227913 -0.7177405625652734,
          0.707106781186547 0.0 -0.707106781186548,
          -0.7071067811865475 0.0 -0.7071067811865475,
          -0.278781482309262 0.6446663088021707 -0.7118189625296836,
          -0.27878148230933536 -0.6446663088021313 -0.7118189625296903,
          0.707106781186547 0.0 -0.707106781186548,
          -0.7071067811865475 0.0 -0.7071067811865475,
          0.27878148230926164 0.64466630880217 -0.7118189625296842,
          0.27878148230933536 -0.6446663088021309 -0.7118189625296907,
          0.707106781186547 0.0 -0.707106781186548,
          -0.7071067811865475 0.0 0.7071067811865475,
          -0.27878148230926186 0.6446663088021705 0.7118189625296837,
          -0.2787814823093353 -0.6446663088021312 0.7118189625296906,
          0.707106781186548 0.0 0.7071067811865471,
          -0.7071067811865475 0.0 0.7071067811865475,
          0.2787814823092618 0.6446663088021704 0.7118189625296837,
          0.2787814823093356 -0.6446663088021314 0.7118189625296902,
          0.707106781186548 0.0 0.7071067811865471,
          -0.6742582244971703 0.17206922712889433 -0.7181699156698144,
          -0.5093511835379197 0.47412376449118376 -0.7181699156698427,
          -0.5093511835379558 -0.4741237644911701 -0.7181699156698259,
          -0.6742582244971527 -0.17206922712893893 -0.7181699156698205,
          0.6742582244971522 -0.17206922712893885 -0.7181699156698208,
          0.5093511835379559 -0.47412376449116983 -0.7181699156698262,
          0.5093511835379212 0.4741237644911822 -0.7181699156698427,
          0.6742582244971699 0.17206922712889422 -0.7181699156698148,
          -0.6742582244971703 0.17206922712889433 0.7181699156698144,
          -0.5093511835379197 0.47412376449118376 0.7181699156698427,
          -0.5093511835379557 -0.47412376449116994 0.7181699156698262,
          -0.6742582244971523 -0.17206922712893885 0.7181699156698206,
          0.6742582244971529 -0.172069227128939 0.7181699156698201,
          0.5093511835379563 -0.4741237644911701 0.7181699156698258,
          0.5093511835379216 0.47412376449118265 0.718169915669842,
          0.6742582244971708 0.17206922712889444 0.7181699156698138,
          -0.0016016143763769892 -0.19219372516523597 0.981355698428709,
          -0.0016016143763769892 -0.19219372516523597 0.981355698428709,
          -0.0016016143763769892 -0.19219372516523597 0.981355698428709,
          -0.44721359549995776 0.0 0.8944271909999161,
          -0.44721359549995776 0.0 0.8944271909999161,
          -0.44721359549995776 0.0 0.8944271909999161,
          -0.3162277660168383 0.3162277660168375 0.8944271909999159,
          -0.3162277660168383 0.3162277660168375 0.8944271909999159,
          -0.3162277660168383 0.3162277660168375 0.8944271909999159,
          0.0 0.4472135954999579 0.8944271909999159,
          0.0 0.4472135954999579 0.8944271909999159,
          0.0 0.4472135954999579 0.8944271909999159,
          0.4472135954999579 0.0 0.8944271909999159,
          0.4472135954999579 0.0 0.8944271909999159,
          0.4472135954999579 0.0 0.8944271909999159,
          0.0 0.4472135954999579 -0.8944271909999159,
          0.0 0.4472135954999579 -0.8944271909999159,
          0.0 0.4472135954999579 -0.8944271909999159,
          -0.3162277660168383 0.3162277660168375 -0.8944271909999159,
          -0.3162277660168383 0.3162277660168375 -0.8944271909999159,
          -0.3162277660168383 0.3162277660168375 -0.8944271909999159,
          -0.4472135954999582 0.0 -0.8944271909999157,
          -0.4472135954999582 0.0 -0.8944271909999157,
          -0.4472135954999582 0.0 -0.8944271909999157,
          0.0 0.0 -1.0,
          0.0 0.0 -1.0,
          0.0 0.0 -1.0,
          0.4472135954999579 0.0 -0.8944271909999159,
          0.4472135954999579 0.0 -0.8944271909999159,
          0.4472135954999579 0.0 -0.8944271909999159,
          -0.010820105837163306 -0.9558815796974252 0.29355294395530684,
          -0.010820105837163306 -0.9558815796974252 0.29355294395530684,
          -1.0 0.0 9.072543852103065e-16,
          -0.8962923536686822 -0.36700886884758654 0.24892670998161018,
          0.0 1.0 -1.2349557787270825e-16,
          0.0 1.0 -1.2349557787270825e-16,
          -0.46306470957878326 -0.624189643474713 0.6292522258376428,
          0.44482153476301495 -0.6307354278194821 0.6358511007338514,
          0.2679604910387162 -0.6469138516458235 0.7139325204744883,
          0.4951264263846885 -0.49512642638468946 0.7139325204744874,
          0.604987707383686 0.3233726667099207 0.7276125289874729,
          0.26796049103871883 -0.6469138516458287 -0.7139325204744824,
          0.49512642638469223 -0.49512642638469156 -0.7139325204744833,
          0.6049877073836892 0.3233726667099194 -0.7276125289874709,
          -0.2679604910387189 0.6469138516458294 0.713932520474482,
          -0.4951264263846923 0.49512642638469134 0.7139325204744834,
          -0.267960491038716 0.6469138516458234 -0.7139325204744883,
          -0.4951264263846888 0.49512642638468946 -0.7139325204744871,
          -0.49824382544281853 -0.6071118579045108 0.6190058823628731,
          -0.49824382544281937 -0.6071118579045193 -0.6190058823628644,
          -0.6490666715816498 0.5326752512008139 0.543110976320741,
          -0.6490666715816503 0.53267525120081 -0.5431109763207441,
          -0.41007682266197015 0.7671997739252362 0.4931952011166873,
          -0.41007682266196754 0.7671997739252362 -0.4931952011166894 ] }
        normalIndex [
          0, 1, 23, 20, 107, -1,
          0, 4, 5, 1, -1,
          0, 100, 101, 3, 7, 4, -1,
          0, 107, 106, 103, 3, 101, 100, -1,
          1, 5, 6, 2, 105, 104, -1,
          1, 104, 94, 23, -1,
          2, 6, 7, 3, 103, 102, -1,
          2, 96, 95, 105, -1,
          2, 102, 25, 96, -1,
          4, 7, 6, 5, -1,
          8, 9, 10, 11, -1,
          8, 11, 19, 18, 13, 12, -1,
          8, 12, 14, 9, -1,
          9, 14, 15, 16, 17, 10, -1,
          10, 17, 19, 11, -1,
          12, 13, 15, 14, -1,
          13, 18, 16, 15, -1,
          16, 18, 19, 17, -1,
          20, 23, 97, 98, 99, 24, 21, 84, 83, 82, -1,
          20, 63, 47, 70, -1,
          20, 70, 71, 72, 22, 106, 107, -1,
          20, 82, 62, 63, -1,
          21, 24, 85, 86, 87, 29, 27, 81, 80, 79, -1,
          21, 50, 30, 84, -1,
          21, 79, 65, 50, -1,
          22, 25, 102, 103, 106, -1,
          22, 68, 69, 75, -1,
          22, 72, 51, 68, -1,
          22, 75, 74, 73, 26, 28, 91, 92, 93, 25, -1,
          23, 55, 54, 97, -1,
          23, 94, 39, 55, -1,
          24, 42, 57, 85, -1,
          24, 99, 34, 42, -1,
          25, 60, 43, 96, -1,
          25, 93, 61, 60, -1,
          26, 49, 66, 78, -1,
          26, 73, 33, 49, -1,
          26, 78, 77, 76, 27, 29, 90, 89, 88, 28, -1,
          27, 32, 48, 81, -1,
          27, 76, 52, 32, -1,
          28, 41, 37, 91, -1,
          28, 88, 58, 41, -1,
          29, 36, 44, 90, -1,
          29, 87, 40, 36, -1,
          30, 34, 38, 46, -1,
          30, 46, 83, 84, -1,
          30, 50, 42, 34, -1,
          31, 35, 43, 51, -1,
          31, 47, 39, 35, -1,
          31, 51, 72, 71, -1,
          31, 71, 70, 47, -1,
          32, 36, 40, 48, -1,
          32, 52, 44, 36, -1,
          33, 37, 41, 49, -1,
          33, 53, 45, 37, -1,
          33, 73, 74, 53, -1,
          34, 99, 98, 38, -1,
          35, 39, 94, 95, -1,
          35, 95, 96, 43, -1,
          37, 45, 92, 91, -1,
          38, 54, 62, 46, -1,
          38, 98, 97, 54, -1,
          39, 47, 63, 55, -1,
          40, 56, 64, 48, -1,
          40, 87, 86, 56, -1,
          41, 58, 66, 49, -1,
          42, 50, 65, 57, -1,
          43, 60, 68, 51, -1,
          44, 52, 67, 59, -1,
          44, 59, 89, 90, -1,
          45, 53, 69, 61, -1,
          45, 61, 93, 92, -1,
          46, 62, 82, 83, -1,
          48, 64, 80, 81, -1,
          52, 76, 77, 67, -1,
          53, 74, 75, 69, -1,
          54, 55, 63, 62, -1,
          56, 57, 65, 64, -1,
          56, 86, 85, 57, -1,
          58, 59, 67, 66, -1,
          58, 88, 89, 59, -1,
          60, 61, 69, 68, -1,
          64, 65, 79, 80, -1,
          66, 67, 77, 78, -1,
          94, 104, 105, 95, -1,
          108, 109, 115, 114, -1,
          108, 111, 112, 109, -1,
          108, 114, 120, 118, -1,
          108, 118, 119, 111, -1,
          109, 110, 122, 115, -1,
          109, 112, 113, 110, -1,
          110, 113, 123, 122, -1,
          111, 116, 117, 112, -1,
          111, 119, 121, 116, -1,
          112, 117, 123, 113, -1,
          114, 115, 117, 116, -1,
          114, 116, 121, 120, -1,
          115, 122, 123, 117, -1,
          118, 120, 121, 119, -1 ]
      }
    }
  ]
}

DEF cube6_copy7 Transform {
  children [
    Shape {
      appearance Appearance {
        material USE PIN
      }
      geometry IndexedFaceSet {
        normalPerVertex TRUE
        coord Coordinate { point [
          -1.37795 -2.00787 2.28346,
          -1.37795 -1.92913 2.28346,
          -0.59055 -1.92913 2.28346,
          -0.59055 -2.00787 2.28346,
          -1.37795 -2.00787 0.0,
          -1.37795 -1.92913 0.0,
          -0.59055 -1.92913 0.0,
          -0.59055 -2.00787 0.0,
          -1.1811 -2.00787 0.0,
          -1.1811 -1.92913 0.0,
          -0.7874 -1.92913 0.0,
          -0.7874 -2.00787 0.0,
          -1.1811 -2.00787 -1.227185105336726,
          -1.0303351053370609 -2.00787 -1.37795,
          -1.1811 -1.92913 -1.227185105336726,
          -1.0303351053370609 -1.92913 -1.37795,
          -0.9381648946629392 -1.92913 -1.37795,
          -0.7874 -1.92913 -1.227185105336726,
          -0.9381648946629392 -2.00787 -1.37795,
          -0.7874 -2.00787 -1.227185105336726,
          -1.37795 -1.92913 2.3622,
          -1.37795 -0.74803 2.3622,
          -0.59055 -1.92913 2.3622,
          -1.37795 -1.92913 2.2834600000000003,
          -1.37795 -0.74803 2.2834600000000003,
          -0.59055 -1.92913 2.2834600000000003,
          -0.59055 -1.2606555352389122 2.3622,
          -1.103175535238912 -0.74803 2.3622,
          -0.59055 -1.2606555352389122 2.2834600000000003,
          -1.103175535238912 -0.74803 2.2834600000000003,
          -1.144190625 -1.5598035497323768 2.3622,
          -0.98425 -1.8366238622323765 2.3622,
          -0.98425 -1.2829832372323768 2.3622,
          -0.824309375 -1.5598035497323768 2.3622,
          -1.144190625 -1.5598035497323768 2.2834600000000003,
          -0.98425 -1.8366238622323765 2.2834600000000003,
          -0.98425 -1.2829832372323768 2.2834600000000003,
          -0.824309375 -1.5598035497323768 2.2834600000000003,
          -1.144190625 -1.6705316747323768 2.2834600000000003,
          -1.05806875 -1.8181691747323765 2.2834600000000003,
          -1.05806875 -1.3014379247323768 2.2834600000000003,
          -0.824309375 -1.4490754247323767 2.2834600000000003,
          -1.144190625 -1.4490754247323767 2.2834600000000003,
          -0.91043125 -1.818169174732377 2.2834600000000003,
          -0.91043125 -1.3014379247323768 2.2834600000000003,
          -0.824309375 -1.6705316747323768 2.2834600000000003,
          -1.144190625 -1.6705316747323768 2.3622,
          -1.05806875 -1.8181691747323765 2.3622,
          -1.05806875 -1.3014379247323768 2.3622,
          -0.824309375 -1.4490754247323767 2.3622,
          -1.144190625 -1.4490754247323767 2.3622,
          -0.91043125 -1.818169174732377 2.3622,
          -0.91043125 -1.3014379247323768 2.3622,
          -0.824309375 -1.6705316747323768 2.3622,
          -1.144190625 -1.7315602065725475 2.2834600000000003,
          -1.1179080828937809 -1.7797010321578246 2.2834600000000003,
          -1.1179080828937809 -1.3399060673069487 2.2834600000000003,
          -1.144190625 -1.3880468928922103 2.2834600000000003,
          -0.824309375 -1.3880468928922103 2.2834600000000003,
          -0.8505919171062192 -1.3399060673069487 2.2834600000000003,
          -0.8505919171062192 -1.7797010321578246 2.2834600000000003,
          -0.824309375 -1.7315602065725475 2.2834600000000003,
          -1.144190625 -1.7315602065725475 2.3622,
          -1.1179080828937809 -1.7797010321578246 2.3622,
          -1.1179080828937809 -1.3399060673069487 2.3622,
          -1.144190625 -1.3880468928922103 2.3622,
          -0.824309375 -1.3880468928922103 2.3622,
          -0.8505919171062192 -1.3399060673069487 2.3622,
          -0.8505919171062192 -1.7797010321578246 2.3622,
          -0.824309375 -1.7315602065725475 2.3622,
          -1.1811 -1.92913 2.3622,
          -0.98425 -1.92913 2.3622,
          -0.7874 -1.92913 2.3622,
          -0.59055 -1.4277741514291842 2.3622,
          -0.59055 -1.5948927676194562 2.3622,
          -0.59055 -1.7620113838097278 2.3622,
          -0.9750191514291842 -0.8761863838097279 2.3622,
          -0.846862767619456 -1.0043427676194558 2.3622,
          -0.718706383809728 -1.132499151429184 2.3622,
          -1.309256383809728 -0.74803 2.3622,
          -1.240562767619456 -0.74803 2.3622,
          -1.1718691514291841 -0.74803 2.3622,
          -1.37795 -1.633855 2.3622,
          -1.37795 -1.3385799999999999 2.3622,
          -1.37795 -1.043305 2.3622,
          -1.309256383809728 -0.74803 2.2834600000000003,
          -1.240562767619456 -0.74803 2.2834600000000003,
          -1.1718691514291841 -0.74803 2.2834600000000003,
          -0.718706383809728 -1.132499151429184 2.2834600000000003,
          -0.846862767619456 -1.004342767619456 2.2834600000000003,
          -0.9750191514291842 -0.8761863838097279 2.2834600000000003,
          -0.59055 -1.4277741514291842 2.2834600000000003,
          -0.59055 -1.5948927676194562 2.2834600000000003,
          -0.59055 -1.7620113838097278 2.2834600000000003,
          -1.1811 -1.92913 2.2834600000000003,
          -0.98425 -1.92913 2.2834600000000003,
          -0.7874 -1.92913 2.2834600000000003,
          -1.37795 -1.633855 2.2834600000000003,
          -1.37795 -1.3385799999999999 2.2834600000000003,
          -1.37795 -1.043305 2.2834600000000003,
          -1.1154833333333334 -2.00787 2.28346,
          -0.8530166666666668 -2.00787 2.28346,
          -0.59055 -1.9553766666666668 2.28346,
          -0.59055 -1.9816233333333333 2.28346,
          -1.1154833333333334 -1.92913 2.28346,
          -0.8530166666666668 -1.92913 2.28346,
          -0.59055 -1.968808069676138 2.3313772564605726,
          -1.37795 -1.9819314030094715 2.3313772564605726,
          -0.6153055165436025 -1.4854789230425482 2.3622,
          -1.136936345951839 -1.136936345951839 2.3622,
          -1.4854789230425485 -0.6153055165436029 2.3622,
          -0.6153055165436025 -1.4854789230425487 2.2834600000000003,
          -1.136936345951839 -1.1369363459518393 2.2834600000000003,
          -1.4854789230425485 -0.615305516543603 2.2834600000000003,
          -0.38488433721035364 -0.929192986838215 2.3621999999999974,
          -0.711173523065636 -0.7111735230656357 2.3621999999999983,
          -0.38488433721035364 -0.9291929868382154 2.2834599999999976,
          -0.711173523065636 -0.7111735230656361 2.2834599999999985,
          -0.3076527582718012 -1.546674861521274 2.3622,
          -0.3076527582718012 -1.5466748615212744 2.2834600000000003,
          -0.3076527582718012 -0.9445553030413515 2.3621999999999974,
          -0.3076527582718012 -0.9445553030413518 2.2834599999999976,
          -0.7752304770835664 -0.6153055165436029 2.3621999999999987,
          -0.7752304770835665 -0.615305516543603 2.283459999999999 ] }
        coordIndex [
          0, 1, 5, 4, -1,
          0, 4, 7, 3, 101, 100, -1,
          0, 100, 101, 3, 103, 106, 107, -1,
          0, 107, 20, 23, 1, -1,
          1, 23, 94, 104, -1,
          1, 104, 105, 2, 6, 5, -1,
          2, 96, 25, 102, -1,
          2, 102, 103, 3, 7, 6, -1,
          2, 105, 95, 96, -1,
          4, 5, 6, 7, -1,
          8, 9, 14, 12, -1,
          8, 11, 10, 9, -1,
          8, 12, 13, 18, 19, 11, -1,
          9, 10, 17, 16, 15, 14, -1,
          10, 11, 19, 17, -1,
          12, 14, 15, 13, -1,
          13, 15, 16, 18, -1,
          16, 17, 19, 18, -1,
          20, 63, 62, 82, -1,
          20, 70, 47, 63, -1,
          20, 82, 83, 84, 21, 24, 99, 98, 97, 23, -1,
          20, 107, 106, 22, 72, 71, 70, -1,
          21, 50, 65, 79, -1,
          21, 79, 80, 81, 27, 29, 87, 86, 85, 24, -1,
          21, 84, 30, 50, -1,
          22, 25, 93, 92, 91, 28, 26, 73, 74, 75, -1,
          22, 68, 51, 72, -1,
          22, 75, 69, 68, -1,
          22, 106, 103, 102, 25, -1,
          23, 55, 39, 94, -1,
          23, 97, 54, 55, -1,
          24, 42, 34, 99, -1,
          24, 85, 57, 42, -1,
          25, 60, 61, 93, -1,
          25, 96, 43, 60, -1,
          26, 28, 88, 89, 90, 29, 27, 76, 77, 78, -1,
          26, 49, 33, 73, -1,
          26, 78, 66, 49, -1,
          27, 32, 52, 76, -1,
          27, 81, 48, 32, -1,
          28, 41, 58, 88, -1,
          28, 91, 37, 41, -1,
          29, 36, 40, 87, -1,
          29, 90, 44, 36, -1,
          30, 34, 42, 50, -1,
          30, 46, 38, 34, -1,
          30, 84, 83, 46, -1,
          31, 35, 39, 47, -1,
          31, 47, 70, 71, -1,
          31, 51, 43, 35, -1,
          31, 71, 72, 51, -1,
          32, 36, 44, 52, -1,
          32, 48, 40, 36, -1,
          33, 37, 45, 53, -1,
          33, 49, 41, 37, -1,
          33, 53, 74, 73, -1,
          34, 38, 98, 99, -1,
          35, 43, 96, 95, -1,
          35, 95, 94, 39, -1,
          37, 91, 92, 45, -1,
          38, 46, 62, 54, -1,
          38, 54, 97, 98, -1,
          39, 55, 63, 47, -1,
          40, 48, 64, 56, -1,
          40, 56, 86, 87, -1,
          41, 49, 66, 58, -1,
          42, 57, 65, 50, -1,
          43, 51, 68, 60, -1,
          44, 59, 67, 52, -1,
          44, 90, 89, 59, -1,
          45, 61, 69, 53, -1,
          45, 92, 93, 61, -1,
          46, 83, 82, 62, -1,
          48, 81, 80, 64, -1,
          52, 67, 77, 76, -1,
          53, 69, 75, 74, -1,
          54, 62, 63, 55, -1,
          56, 57, 85, 86, -1,
          56, 64, 65, 57, -1,
          58, 59, 89, 88, -1,
          58, 66, 67, 59, -1,
          60, 68, 69, 61, -1,
          64, 80, 79, 65, -1,
          66, 78, 77, 67, -1,
          94, 95, 105, 104, -1,
          108, 109, 112, 111, -1,
          108, 111, 119, 118, -1,
          108, 114, 115, 109, -1,
          108, 118, 120, 114, -1,
          109, 110, 113, 112, -1,
          109, 115, 122, 110, -1,
          110, 122, 123, 113, -1,
          111, 112, 117, 116, -1,
          111, 116, 121, 119, -1,
          112, 113, 123, 117, -1,
          114, 116, 117, 115, -1,
          114, 120, 121, 116, -1,
          115, 117, 123, 122, -1,
          118, 119, 121, 120, -1 ]
        normal Normal { vector [
          -0.7192945037962624 -0.6640948495931033 0.20394471690240498,
          -0.894427190999916 0.44721359549995787 0.0,
          0.7071067811865475 0.7071067811865475 0.0,
          0.47099707785484396 -0.8432657415496312 0.25896841850107644,
          -0.5773502691896257 -0.5773502691896257 -0.5773502691896258,
          -0.5773502691896258 0.5773502691896258 -0.5773502691896258,
          0.5773502691896258 0.5773502691896258 -0.5773502691896258,
          0.5773502691896257 -0.5773502691896257 -0.5773502691896258,
          -0.5773502691896258 -0.5773502691896258 0.5773502691896258,
          -0.5773502691896258 0.5773502691896258 0.5773502691896258,
          0.5773502691896258 0.5773502691896258 0.5773502691896258,
          0.5773502691896258 -0.5773502691896258 0.5773502691896258,
          -0.8125199200689746 -0.47596314947788326 -0.3365567705903439,
          -0.3365567705912111 -0.47596314947805257 -0.8125199200685163,
          -0.8125199200689746 0.47596314947788326 -0.3365567705903439,
          -0.3365567705912111 0.47596314947805257 -0.8125199200685163,
          0.3365567705912111 0.47596314947805257 -0.8125199200685163,
          0.8125199200689746 0.47596314947788326 -0.3365567705903439,
          0.3365567705912111 -0.47596314947805257 -0.8125199200685163,
          0.8125199200689746 -0.47596314947788326 -0.3365567705903439,
          -0.568721484179924 -0.1580853393582239 0.8071957005040226,
          -0.4082482904638631 0.4082482904638631 0.8164965809277261,
          0.5705000408281535 -0.15784844247802907 0.8059860871146198,
          -0.7071067811865475 -1.1680781281515436e-16 -0.7071067811865475,
          -0.4082482904638631 0.4082482904638631 -0.8164965809277259,
          0.7071067811865475 0.0 -0.7071067811865475,
          0.6269431213219504 0.25968834368807237 0.7345095552677553,
          0.2596883436880727 0.6269431213219501 0.7345095552677554,
          0.6269431213219503 0.25968834368807237 -0.7345095552677555,
          0.2596883436880727 0.6269431213219501 -0.7345095552677554,
          0.7071067811865475 0.0 0.7071067811865475,
          1.9821695944401053e-15 0.6963106238227916 0.7177405625652732,
          0.0 -0.6963106238227914 0.7177405625652734,
          -0.7071067811865475 0.0 0.7071067811865475,
          0.7071067811865475 0.0 -0.7071067811865475,
          1.9821695944401053e-15 0.6963106238227916 -0.7177405625652732,
          0.0 -0.6963106238227914 -0.7177405625652734,
          -0.7071067811865475 0.0 -0.7071067811865475,
          0.7071067811865475 0.0 -0.7071067811865475,
          0.2787814823092618 0.6446663088021706 -0.7118189625296837,
          0.27878148230933525 -0.6446663088021313 -0.7118189625296905,
          -0.7071067811865475 0.0 -0.7071067811865475,
          0.7071067811865475 0.0 -0.7071067811865475,
          -0.27878148230926186 0.6446663088021702 -0.7118189625296841,
          -0.2787814823093355 -0.6446663088021313 -0.7118189625296905,
          -0.7071067811865475 0.0 -0.7071067811865475,
          0.7071067811865475 0.0 0.7071067811865475,
          0.2787814823092618 0.6446663088021706 0.7118189625296837,
          0.27878148230933525 -0.6446663088021313 0.7118189625296905,
          -0.7071067811865475 0.0 0.7071067811865475,
          0.7071067811865475 0.0 0.7071067811865475,
          -0.27878148230926186 0.6446663088021702 0.7118189625296841,
          -0.2787814823093355 -0.6446663088021313 0.7118189625296905,
          -0.7071067811865475 0.0 0.7071067811865475,
          0.6742582244971701 0.17206922712889494 -0.7181699156698145,
          0.5093511835379193 0.47412376449118426 -0.7181699156698426,
          0.5093511835379556 -0.47412376449117033 -0.718169915669826,
          0.6742582244971524 -0.1720692271289392 -0.7181699156698206,
          -0.6742582244971524 -0.1720692271289392 -0.7181699156698206,
          -0.5093511835379558 -0.4741237644911701 -0.7181699156698259,
          -0.509351183537921 0.474123764491183 -0.7181699156698423,
          -0.6742582244971701 0.17206922712889494 -0.7181699156698145,
          0.6742582244971701 0.17206922712889494 0.7181699156698145,
          0.5093511835379193 0.47412376449118426 0.7181699156698426,
          0.5093511835379556 -0.47412376449117033 0.718169915669826,
          0.6742582244971524 -0.1720692271289392 0.7181699156698206,
          -0.6742582244971524 -0.1720692271289392 0.7181699156698206,
          -0.5093511835379558 -0.4741237644911701 0.7181699156698259,
          -0.509351183537921 0.474123764491183 0.7181699156698423,
          -0.6742582244971701 0.17206922712889494 0.7181699156698145,
          0.001601614376377088 -0.1921937251652347 0.9813556984287093,
          0.001601614376377088 -0.1921937251652347 0.9813556984287093,
          0.001601614376377088 -0.1921937251652347 0.9813556984287093,
          0.4472135954999579 0.0 0.8944271909999159,
          0.4472135954999579 0.0 0.8944271909999159,
          0.4472135954999579 0.0 0.8944271909999159,
          0.31622776601683816 0.31622776601683783 0.8944271909999159,
          0.31622776601683816 0.31622776601683783 0.8944271909999159,
          0.31622776601683816 0.31622776601683783 0.8944271909999159,
          0.0 0.4472135954999579 0.8944271909999159,
          0.0 0.4472135954999579 0.8944271909999159,
          0.0 0.4472135954999579 0.8944271909999159,
          -0.4472135954999579 0.0 0.8944271909999159,
          -0.4472135954999579 0.0 0.8944271909999159,
          -0.4472135954999579 0.0 0.8944271909999159,
          0.0 0.447213595499958 -0.8944271909999159,
          0.0 0.447213595499958 -0.8944271909999159,
          0.0 0.447213595499958 -0.8944271909999159,
          0.31622776601683805 0.31622776601683766 -0.8944271909999159,
          0.31622776601683805 0.31622776601683766 -0.8944271909999159,
          0.31622776601683805 0.31622776601683766 -0.8944271909999159,
          0.4472135954999579 0.0 -0.8944271909999159,
          0.4472135954999579 0.0 -0.8944271909999159,
          0.4472135954999579 0.0 -0.8944271909999159,
          0.0 0.0 -1.0,
          0.0 0.0 -1.0,
          0.0 0.0 -1.0,
          -0.4472135954999579 0.0 -0.8944271909999159,
          -0.4472135954999579 0.0 -0.8944271909999159,
          -0.4472135954999579 0.0 -0.8944271909999159,
          0.010820105837163438 -0.9558815796974239 0.29355294395531084,
          0.010820105837163438 -0.9558815796974239 0.29355294395531084,
          1.0 0.0 0.0,
          0.8962923536686825 -0.36700886884758455 0.24892670998161254,
          0.0 1.0 0.0,
          0.0 1.0 0.0,
          0.46306470957878354 -0.6241896434747095 0.6292522258376463,
          -0.4448215347630146 -0.6307354278194784 0.6358511007338555,
          -0.2679604910387161 -0.6469138516458233 0.7139325204744884,
          -0.4951264263846884 -0.49512642638468934 0.7139325204744876,
          -0.6049877073836862 0.32337266670992076 0.7276125289874728,
          -0.26796049103871905 -0.6469138516458292 -0.7139325204744821,
          -0.4951264263846923 -0.49512642638469195 -0.713932520474483,
          -0.604987707383689 0.3233726667099191 -0.7276125289874711,
          0.2679604910387189 0.6469138516458287 0.7139325204744825,
          0.49512642638469223 0.4951264263846919 0.7139325204744832,
          0.26796049103871633 0.6469138516458237 -0.7139325204744881,
          0.4951264263846885 0.49512642638468946 -0.7139325204744874,
          0.4982438254428191 -0.6071118579045119 0.6190058823628716,
          0.49824382544281864 -0.6071118579045183 -0.6190058823628656,
          0.6490666715816507 0.5326752512008139 0.5431109763207401,
          0.6490666715816501 0.5326752512008095 -0.543110976320745,
          0.41007682266196976 0.7671997739252369 0.4931952011166865,
          0.41007682266196727 0.7671997739252359 -0.4931952011166899 ] }
        normalIndex [
          0, 1, 5, 4, -1,
          0, 4, 7, 3, 101, 100, -1,
          0, 100, 101, 3, 103, 106, 107, -1,
          0, 107, 20, 23, 1, -1,
          1, 23, 94, 104, -1,
          1, 104, 105, 2, 6, 5, -1,
          2, 96, 25, 102, -1,
          2, 102, 103, 3, 7, 6, -1,
          2, 105, 95, 96, -1,
          4, 5, 6, 7, -1,
          8, 9, 14, 12, -1,
          8, 11, 10, 9, -1,
          8, 12, 13, 18, 19, 11, -1,
          9, 10, 17, 16, 15, 14, -1,
          10, 11, 19, 17, -1,
          12, 14, 15, 13, -1,
          13, 15, 16, 18, -1,
          16, 17, 19, 18, -1,
          20, 63, 62, 82, -1,
          20, 70, 47, 63, -1,
          20, 82, 83, 84, 21, 24, 99, 98, 97, 23, -1,
          20, 107, 106, 22, 72, 71, 70, -1,
          21, 50, 65, 79, -1,
          21, 79, 80, 81, 27, 29, 87, 86, 85, 24, -1,
          21, 84, 30, 50, -1,
          22, 25, 93, 92, 91, 28, 26, 73, 74, 75, -1,
          22, 68, 51, 72, -1,
          22, 75, 69, 68, -1,
          22, 106, 103, 102, 25, -1,
          23, 55, 39, 94, -1,
          23, 97, 54, 55, -1,
          24, 42, 34, 99, -1,
          24, 85, 57, 42, -1,
          25, 60, 61, 93, -1,
          25, 96, 43, 60, -1,
          26, 28, 88, 89, 90, 29, 27, 76, 77, 78, -1,
          26, 49, 33, 73, -1,
          26, 78, 66, 49, -1,
          27, 32, 52, 76, -1,
          27, 81, 48, 32, -1,
          28, 41, 58, 88, -1,
          28, 91, 37, 41, -1,
          29, 36, 40, 87, -1,
          29, 90, 44, 36, -1,
          30, 34, 42, 50, -1,
          30, 46, 38, 34, -1,
          30, 84, 83, 46, -1,
          31, 35, 39, 47, -1,
          31, 47, 70, 71, -1,
          31, 51, 43, 35, -1,
          31, 71, 72, 51, -1,
          32, 36, 44, 52, -1,
          32, 48, 40, 36, -1,
          33, 37, 45, 53, -1,
          33, 49, 41, 37, -1,
          33, 53, 74, 73, -1,
          34, 38, 98, 99, -1,
          35, 43, 96, 95, -1,
          35, 95, 94, 39, -1,
          37, 91, 92, 45, -1,
          38, 46, 62, 54, -1,
          38, 54, 97, 98, -1,
          39, 55, 63, 47, -1,
          40, 48, 64, 56, -1,
          40, 56, 86, 87, -1,
          41, 49, 66, 58, -1,
          42, 57, 65, 50, -1,
          43, 51, 68, 60, -1,
          44, 59, 67, 52, -1,
          44, 90, 89, 59, -1,
          45, 61, 69, 53, -1,
          45, 92, 93, 61, -1,
          46, 83, 82, 62, -1,
          48, 81, 80, 64, -1,
          52, 67, 77, 76, -1,
          53, 69, 75, 74, -1,
          54, 62, 63, 55, -1,
          56, 57, 85, 86, -1,
          56, 64, 65, 57, -1,
          58, 59, 89, 88, -1,
          58, 66, 67, 59, -1,
          60, 68, 69, 61, -1,
          64, 80, 79, 65, -1,
          66, 78, 77, 67, -1,
          94, 95, 105, 104, -1,
          108, 109, 112, 111, -1,
          108, 111, 119, 118, -1,
          108, 114, 115, 109, -1,
          108, 118, 120, 114, -1,
          109, 110, 113, 112, -1,
          109, 115, 122, 110, -1,
          110, 122, 123, 113, -1,
          111, 112, 117, 116, -1,
          111, 116, 121, 119, -1,
          112, 113, 123, 117, -1,
          114, 116, 117, 115, -1,
          114, 120, 121, 116, -1,
          115, 117, 123, 122, -1,
          118, 119, 121, 120, -1 ]
      }
    }
  ]
}

DEF cube6 Transform {
  children [
    Shape {
      appearance Appearance {
        material USE PIN
      }
      geometry IndexedFaceSet {
        normalPerVertex TRUE
        coord Coordinate { point [
          -0.3937 1.92913 0.59055,
          -0.3937 2.00787 0.59055,
          0.3937 2.00787 0.59055,
          0.3937 1.92913 0.59055,
          -0.3937 1.92913 0.0,
          -0.3937 2.00787 0.0,
          0.3937 2.00787 0.0,
          0.3937 1.92913 0.0,
          -0.19685 1.92913 0.0,
          -0.19685 2.00787 0.0,
          0.19685 2.00787 0.0,
          0.19685 1.92913 0.0,
          -0.19685 1.92913 -1.227185105336726,
          -0.046085105337060776 1.92913 -1.37795,
          -0.19685 2.00787 -1.227185105336726,
          -0.046085105337060776 2.00787 -1.37795,
          0.046085105337060776 2.00787 -1.37795,
          0.19685 2.00787 -1.227185105336726,
          0.046085105337060776 1.92913 -1.37795,
          0.19685 1.92913 -1.227185105336726 ] }
        coordIndex [
          0, 1, 5, 4, -1,
          0, 3, 2, 1, -1,
          0, 4, 7, 3, -1,
          1, 2, 6, 5, -1,
          2, 3, 7, 6, -1,
          4, 5, 6, 7, -1,
          8, 9, 14, 12, -1,
          8, 11, 10, 9, -1,
          8, 12, 13, 18, 19, 11, -1,
          9, 10, 17, 16, 15, 14, -1,
          10, 11, 19, 17, -1,
          12, 14, 15, 13, -1,
          13, 15, 16, 18, -1,
          16, 17, 19, 18, -1 ]
        normal Normal { vector [
          -0.5773502691896258 -0.5773502691896258 0.5773502691896258,
          -0.5773502691896258 0.5773502691896258 0.5773502691896258,
          0.5773502691896258 0.5773502691896258 0.5773502691896258,
          0.5773502691896258 -0.5773502691896258 0.5773502691896258,
          -0.5773502691896258 -0.5773502691896258 -0.5773502691896258,
          -0.5773502691896258 0.5773502691896258 -0.5773502691896258,
          0.5773502691896258 0.5773502691896258 -0.5773502691896258,
          0.5773502691896258 -0.5773502691896258 -0.5773502691896258,
          -0.5773502691896257 -0.5773502691896257 0.5773502691896258,
          -0.5773502691896258 0.5773502691896258 0.5773502691896258,
          0.5773502691896258 0.5773502691896258 0.5773502691896258,
          0.5773502691896257 -0.5773502691896257 0.5773502691896258,
          -0.8125199200689746 -0.47596314947788326 -0.33655677059034383,
          -0.3365567705912111 -0.47596314947805257 -0.8125199200685163,
          -0.8125199200689746 0.47596314947788326 -0.33655677059034395,
          -0.3365567705912111 0.47596314947805257 -0.8125199200685163,
          0.3365567705912111 0.47596314947805257 -0.8125199200685163,
          0.8125199200689746 0.47596314947788326 -0.33655677059034395,
          0.3365567705912111 -0.47596314947805257 -0.8125199200685163,
          0.8125199200689746 -0.47596314947788326 -0.33655677059034383 ] }
        normalIndex [
          0, 1, 5, 4, -1,
          0, 3, 2, 1, -1,
          0, 4, 7, 3, -1,
          1, 2, 6, 5, -1,
          2, 3, 7, 6, -1,
          4, 5, 6, 7, -1,
          8, 9, 14, 12, -1,
          8, 11, 10, 9, -1,
          8, 12, 13, 18, 19, 11, -1,
          9, 10, 17, 16, 15, 14, -1,
          10, 11, 19, 17, -1,
          12, 14, 15, 13, -1,
          13, 15, 16, 18, -1,
          16, 17, 19, 18, -1 ]
      }
    }
  ]
}

DEF cylinder2_sep7 Transform {
  children [
    Shape {
      appearance Appearance {
        material DEF Body Material {
          diffuseColor 0.001 0.001 0.001
          emissiveColor 0.0 0.0 0.0
          specularColor 0.85348 0.85348 0.85348
          ambientIntensity 0.2674
          transparency 0.0
          shininess 1.0
        }
      }
      geometry IndexedFaceSet {
        normalPerVertex TRUE
        coord Coordinate { point [
          2.027555 1.6759472921436412e-16 2.2834600000000003,
          1.873216565540922 -0.7759117067089994 2.2834600000000003,
          1.4336978897286905 -1.43369788972869 2.2834600000000003,
          0.7759117067089999 -1.873216565540922 2.2834600000000003,
          2.0351196253783904e-16 -2.027555 2.2834600000000003,
          -0.7759117067089994 -1.873216565540922 2.2834600000000003,
          -1.4336978897286903 -1.4336978897286905 2.2834600000000003,
          -1.873216565540922 -0.7759117067089996 2.2834600000000003,
          -2.027555 -8.070914487015702e-17 2.2834600000000003,
          -1.873216565540922 0.7759117067089997 2.2834600000000003,
          -1.433697889728691 1.4336978897286905 2.28346,
          -0.7759117067090007 1.8732165655409214 2.28346,
          -2.9309578563120335e-16 2.027555 2.28346,
          0.7759117067090002 1.8732165655409219 2.28346,
          1.43369788972869 1.433697889728691 2.28346,
          1.8732165655409219 0.7759117067090012 2.2834600000000003,
          2.027555 6.393388857713686e-17 0.5905500000000001,
          1.873216565540922 -0.7759117067089996 0.5905500000000001,
          1.4336978897286905 -1.43369788972869 0.5905500000000004,
          0.7759117067089999 -1.873216565540922 0.5905500000000004,
          2.0351196253783904e-16 -2.027555 0.5905500000000004,
          -0.7759117067089994 -1.873216565540922 0.5905500000000004,
          -1.4336978897286903 -1.4336978897286905 0.5905500000000004,
          -1.873216565540922 -0.7759117067089998 0.5905500000000001,
          -2.027555 -1.843699855073843e-16 0.5905500000000001,
          -1.873216565540922 0.7759117067089996 0.5905500000000001,
          -1.433697889728691 1.4336978897286905 0.59055,
          -0.7759117067090007 1.8732165655409214 0.59055,
          -2.9309578563120335e-16 2.027555 0.59055,
          0.7759117067090002 1.8732165655409219 0.59055,
          1.43369788972869 1.433697889728691 0.59055,
          1.8732165655409219 0.775911706709001 0.5905500000000001,
          0.8617068587607566 8.511289836143124e-17 2.2834600000000003,
          0.7961133298336571 -0.3297609384031056 2.2834600000000003,
          0.6093187632246895 -0.6093187632246895 2.2834600000000003,
          0.3297609384031059 -0.7961133298336572 2.2834600000000003,
          2.2000832870842563e-16 -0.8617068587607565 2.2834600000000003,
          -0.32976093840310566 -0.7961133298336571 2.2834600000000003,
          -0.6093187632246895 -0.6093187632246897 2.2834600000000003,
          -0.7961133298336572 -0.3297609384031059 2.2834600000000003,
          -0.8617068587607565 -6.421277869957044e-17 2.2834600000000003,
          -0.7961133298336571 0.3297609384031063 2.2834600000000003,
          -0.60931876322469 0.6093187632246897 2.28346,
          -0.3297609384031069 0.7961133298336568 2.28346,
          -2.9153926901818e-17 0.8617068587607565 2.28346,
          0.3297609384031067 0.7961133298336571 2.28346,
          0.6093187632246897 0.6093187632246901 2.28346,
          0.7961133298336569 0.3297609384031071 2.2834600000000003,
          0.8617068587607566 -1.8547942275796025e-17 0.5905500000000001,
          0.7961133298336571 -0.3297609384031058 0.5905500000000001,
          0.6093187632246895 -0.6093187632246895 0.5905500000000004,
          0.3297609384031059 -0.7961133298336572 0.5905500000000004,
          2.2000832870842563e-16 -0.8617068587607565 0.5905500000000004,
          -0.32976093840310566 -0.7961133298336571 0.5905500000000004,
          -0.6093187632246895 -0.6093187632246897 0.5905500000000004,
          -0.7961133298336572 -0.32976093840310605 0.5905500000000001,
          -0.8617068587607565 -1.6787361933679773e-16 0.5905500000000001,
          -0.7961133298336571 0.3297609384031061 0.5905500000000001,
          -0.60931876322469 0.6093187632246897 0.59055,
          -0.3297609384031069 0.7961133298336568 0.59055,
          -2.9153926901818e-17 0.8617068587607565 0.59055,
          0.3297609384031067 0.7961133298336571 0.59055,
          0.6093187632246897 0.6093187632246901 0.59055,
          0.7961133298336569 0.3297609384031069 0.5905500000000001 ] }
        coordIndex [
          0, 1, 17, 16, -1,
          0, 15, 47, 32, -1,
          0, 16, 31, 15, -1,
          0, 32, 33, 1, -1,
          1, 2, 18, 17, -1,
          1, 33, 34, 2, -1,
          2, 3, 19, 18, -1,
          2, 34, 35, 3, -1,
          3, 4, 20, 19, -1,
          3, 35, 36, 4, -1,
          4, 5, 21, 20, -1,
          4, 36, 37, 5, -1,
          5, 6, 22, 21, -1,
          5, 37, 38, 6, -1,
          6, 7, 23, 22, -1,
          6, 38, 39, 7, -1,
          7, 8, 24, 23, -1,
          7, 39, 40, 8, -1,
          8, 9, 25, 24, -1,
          8, 40, 41, 9, -1,
          9, 10, 26, 25, -1,
          9, 41, 42, 10, -1,
          10, 11, 27, 26, -1,
          10, 42, 43, 11, -1,
          11, 12, 28, 27, -1,
          11, 43, 44, 12, -1,
          12, 13, 29, 28, -1,
          12, 44, 45, 13, -1,
          13, 14, 30, 29, -1,
          13, 45, 46, 14, -1,
          14, 15, 31, 30, -1,
          14, 46, 47, 15, -1,
          16, 17, 49, 48, -1,
          16, 48, 63, 31, -1,
          17, 18, 50, 49, -1,
          18, 19, 51, 50, -1,
          19, 20, 52, 51, -1,
          20, 21, 53, 52, -1,
          21, 22, 54, 53, -1,
          22, 23, 55, 54, -1,
          23, 24, 56, 55, -1,
          24, 25, 57, 56, -1,
          25, 26, 58, 57, -1,
          26, 27, 59, 58, -1,
          27, 28, 60, 59, -1,
          28, 29, 61, 60, -1,
          29, 30, 62, 61, -1,
          30, 31, 63, 62, -1,
          32, 47, 63, 48, -1,
          32, 48, 49, 33, -1,
          33, 49, 50, 34, -1,
          34, 50, 51, 35, -1,
          35, 51, 52, 36, -1,
          36, 52, 53, 37, -1,
          37, 53, 54, 38, -1,
          38, 54, 55, 39, -1,
          39, 55, 56, 40, -1,
          40, 56, 57, 41, -1,
          41, 57, 58, 42, -1,
          42, 58, 59, 43, -1,
          43, 59, 60, 44, -1,
          44, 60, 61, 45, -1,
          45, 61, 62, 46, -1,
          46, 62, 63, 47, -1 ]
        normal Normal { vector [
          0.7002145072825531 -9.907804028243057e-18 0.7139325204744853,
          0.6469138516458262 -0.2679604910387176 0.7139325204744853,
          0.4951264263846906 -0.49512642638469045 0.7139325204744853,
          0.2679604910387177 -0.6469138516458262 0.7139325204744854,
          0.0 -0.7002145072825531 0.7139325204744853,
          -0.2679604910387175 -0.6469138516458263 0.7139325204744854,
          -0.4951264263846904 -0.49512642638469057 0.7139325204744854,
          -0.6469138516458262 -0.2679604910387176 0.7139325204744854,
          -0.7002145072825531 -9.907804028243057e-18 0.7139325204744853,
          -0.6469138516458262 0.2679604910387176 0.7139325204744853,
          -0.4951264263846904 0.4951264263846906 0.7139325204744854,
          -0.26796049103871766 0.6469138516458262 0.7139325204744853,
          -2.1797168862134725e-16 0.7002145072825531 0.7139325204744853,
          0.2679604910387175 0.6469138516458262 0.7139325204744853,
          0.4951264263846902 0.495126426384691 0.7139325204744853,
          0.6469138516458259 0.26796049103871805 0.7139325204744854,
          0.7002145072825531 -9.907804028243057e-18 -0.7139325204744853,
          0.646913851645826 -0.2679604910387177 -0.7139325204744853,
          0.49512642638469057 -0.49512642638469057 -0.7139325204744853,
          0.2679604910387177 -0.6469138516458262 -0.7139325204744854,
          0.0 -0.7002145072825531 -0.7139325204744853,
          -0.2679604910387175 -0.6469138516458263 -0.7139325204744854,
          -0.4951264263846903 -0.4951264263846906 -0.7139325204744854,
          -0.646913851645826 -0.2679604910387177 -0.7139325204744854,
          -0.7002145072825531 -9.907804028243057e-18 -0.7139325204744853,
          -0.6469138516458264 0.26796049103871733 -0.7139325204744853,
          -0.49512642638469057 0.4951264263846903 -0.7139325204744854,
          -0.26796049103871766 0.6469138516458262 -0.7139325204744853,
          -2.1797168862134725e-16 0.7002145072825531 -0.7139325204744853,
          0.2679604910387175 0.6469138516458262 -0.7139325204744853,
          0.4951264263846903 0.49512642638469073 -0.7139325204744853,
          0.6469138516458262 0.2679604910387178 -0.7139325204744854,
          -0.7002145072825531 3.963121611297223e-17 0.7139325204744853,
          -0.6469138516458262 0.26796049103871755 0.7139325204744853,
          -0.4951264263846906 0.4951264263846903 0.7139325204744853,
          -0.26796049103871755 0.6469138516458262 0.7139325204744854,
          5.944682416945834e-17 0.7002145072825531 0.7139325204744853,
          0.2679604910387172 0.6469138516458264 0.7139325204744853,
          0.49512642638469023 0.49512642638469073 0.7139325204744854,
          0.6469138516458263 0.2679604910387175 0.7139325204744854,
          0.7002145072825531 -1.9815608056486114e-17 0.7139325204744853,
          0.6469138516458266 -0.26796049103871683 0.7139325204744853,
          0.4951264263846908 -0.49512642638469007 0.7139325204744855,
          0.26796049103871744 -0.6469138516458263 0.7139325204744853,
          3.368653369602639e-16 -0.7002145072825531 0.7139325204744853,
          -0.2679604910387171 -0.6469138516458264 0.7139325204744853,
          -0.49512642638469057 -0.4951264263846903 0.7139325204744854,
          -0.6469138516458264 -0.2679604910387173 0.7139325204744853,
          -0.7002145072825531 3.963121611297223e-17 -0.7139325204744853,
          -0.6469138516458263 0.26796049103871744 -0.7139325204744853,
          -0.49512642638469073 0.49512642638469023 -0.7139325204744853,
          -0.26796049103871755 0.6469138516458262 -0.7139325204744854,
          5.944682416945834e-17 0.7002145072825531 -0.7139325204744853,
          0.2679604910387172 0.6469138516458264 -0.7139325204744853,
          0.4951264263846903 0.4951264263846906 -0.7139325204744854,
          0.6469138516458263 0.26796049103871733 -0.7139325204744853,
          0.7002145072825531 -1.9815608056486114e-17 -0.7139325204744853,
          0.6469138516458265 -0.2679604910387171 -0.7139325204744853,
          0.49512642638469057 -0.4951264263846903 -0.7139325204744854,
          0.26796049103871744 -0.6469138516458263 -0.7139325204744853,
          3.368653369602639e-16 -0.7002145072825531 -0.7139325204744853,
          -0.2679604910387171 -0.6469138516458264 -0.7139325204744853,
          -0.4951264263846904 -0.4951264263846906 -0.7139325204744854,
          -0.6469138516458262 -0.26796049103871755 -0.7139325204744853 ] }
        normalIndex [
          0, 1, 17, 16, -1,
          0, 15, 47, 32, -1,
          0, 16, 31, 15, -1,
          0, 32, 33, 1, -1,
          1, 2, 18, 17, -1,
          1, 33, 34, 2, -1,
          2, 3, 19, 18, -1,
          2, 34, 35, 3, -1,
          3, 4, 20, 19, -1,
          3, 35, 36, 4, -1,
          4, 5, 21, 20, -1,
          4, 36, 37, 5, -1,
          5, 6, 22, 21, -1,
          5, 37, 38, 6, -1,
          6, 7, 23, 22, -1,
          6, 38, 39, 7, -1,
          7, 8, 24, 23, -1,
          7, 39, 40, 8, -1,
          8, 9, 25, 24, -1,
          8, 40, 41, 9, -1,
          9, 10, 26, 25, -1,
          9, 41, 42, 10, -1,
          10, 11, 27, 26, -1,
          10, 42, 43, 11, -1,
          11, 12, 28, 27, -1,
          11, 43, 44, 12, -1,
          12, 13, 29, 28, -1,
          12, 44, 45, 13, -1,
          13, 14, 30, 29, -1,
          13, 45, 46, 14, -1,
          14, 15, 31, 30, -1,
          14, 46, 47, 15, -1,
          16, 17, 49, 48, -1,
          16, 48, 63, 31, -1,
          17, 18, 50, 49, -1,
          18, 19, 51, 50, -1,
          19, 20, 52, 51, -1,
          20, 21, 53, 52, -1,
          21, 22, 54, 53, -1,
          22, 23, 55, 54, -1,
          23, 24, 56, 55, -1,
          24, 25, 57, 56, -1,
          25, 26, 58, 57, -1,
          26, 27, 59, 58, -1,
          27, 28, 60, 59, -1,
          28, 29, 61, 60, -1,
          29, 30, 62, 61, -1,
          30, 31, 63, 62, -1,
          32, 47, 63, 48, -1,
          32, 48, 49, 33, -1,
          33, 49, 50, 34, -1,
          34, 50, 51, 35, -1,
          35, 51, 52, 36, -1,
          36, 52, 53, 37, -1,
          37, 53, 54, 38, -1,
          38, 54, 55, 39, -1,
          39, 55, 56, 40, -1,
          40, 56, 57, 41, -1,
          41, 57, 58, 42, -1,
          42, 58, 59, 43, -1,
          43, 59, 60, 44, -1,
          44, 60, 61, 45, -1,
          45, 61, 62, 46, -1,
          46, 62, 63, 47, -1 ]
      }
    }
  ]
}

DEF cylinder2_sep6 Transform {
  children [
    Shape {
      appearance Appearance {
        material USE Body
      }
      geometry IndexedFaceSet {
        normalPerVertex TRUE
        coord Coordinate { point [
          -1.5748 -0.5461563094262987 2.28346,
          1.5748 -0.5461563094262987 2.28346,
          -1.5748 -0.5461563094262987 0.59055,
          1.5748 -0.5461563094262987 0.59055,
          -1.5748 -1.83048561650199 2.28346,
          -1.4761556165015517 -1.92913 2.28346,
          1.4761556165015517 -1.92913 2.28346,
          1.5748 -1.83048561650199 2.28346,
          -1.5748 -1.83048561650199 0.59055,
          -1.4761556165015517 -1.92913 0.59055,
          1.4761556165015517 -1.92913 0.59055,
          1.5748 -1.83048561650199 0.59055 ] }
        coordIndex [
          0, 1, 3, 2, -1,
          0, 2, 8, 4, -1,
          0, 4, 5, 6, 7, 1, -1,
          1, 7, 11, 3, -1,
          2, 3, 11, 10, 9, 8, -1,
          4, 8, 9, 5, -1,
          5, 9, 10, 6, -1,
          6, 10, 11, 7, -1 ]
        normal Normal { vector [
          -0.5773502691896258 0.5773502691896258 0.5773502691896258,
          0.5773502691896258 0.5773502691896258 0.5773502691896258,
          -0.5773502691896258 0.5773502691896258 -0.5773502691896258,
          0.5773502691896258 0.5773502691896258 -0.5773502691896258,
          -0.8125199200682868 -0.336556770591645 0.4759631494781373,
          -0.3365567705899099 -0.8125199200692039 0.4759631494777985,
          0.3365567705899099 -0.8125199200692039 0.4759631494777985,
          0.8125199200682868 -0.336556770591645 0.4759631494781373,
          -0.8125199200682868 -0.336556770591645 -0.4759631494781373,
          -0.3365567705899099 -0.8125199200692039 -0.4759631494777985,
          0.3365567705899099 -0.8125199200692039 -0.4759631494777985,
          0.8125199200682868 -0.336556770591645 -0.4759631494781373 ] }
        normalIndex [
          0, 1, 3, 2, -1,
          0, 2, 8, 4, -1,
          0, 4, 5, 6, 7, 1, -1,
          1, 7, 11, 3, -1,
          2, 3, 11, 10, 9, 8, -1,
          4, 8, 9, 5, -1,
          5, 9, 10, 6, -1,
          6, 10, 11, 7, -1 ]
      }
    }
  ]
}

DEF cylinder4 Transform {
  children [
    Shape {
      appearance Appearance {
        material DEF WIPER Material {
          diffuseColor 1.0 1.0 1.0
          emissiveColor 0.0 0.0 0.0
          specularColor 0.39394 0.39394 0.39394
          ambientIntensity 0.92674
          transparency 0.0
          shininess 1.0
        }
      }
      geometry IndexedFaceSet {
        normalPerVertex TRUE
        coord Coordinate { point [
          0.4827598037342792 6.556422071923862e-17 2.3622,
          0.4460119017892665 -0.18474417870093104 2.3622,
          0.34136273090479563 -0.3413627309047956 2.3622,
          0.1847441787009311 -0.44601190178926636 2.3622,
          3.5513952889587586e-17 -0.48275980373427907 2.3622,
          -0.18474417870093104 -0.44601190178926636 2.3622,
          -0.3413627309047956 -0.3413627309047956 2.3622,
          -0.4460119017892665 -0.1847441787009311 2.3622,
          -0.48275980373427935 -3.5513952889587586e-17 2.3622,
          -0.4460119017892665 0.18474417870093104 2.3622,
          -0.34136273090479574 0.34136273090479563 2.3622,
          -0.18474417870093127 0.44601190178926636 2.3622,
          -8.468711842901654e-17 0.48275980373427924 2.3622,
          0.18474417870093113 0.4460119017892665 2.3622,
          0.3413627309047955 0.3413627309047958 2.3622,
          0.44601190178926636 0.18474417870093132 2.3622,
          0.492125 -3.4750875435969816e-17 0.59055,
          0.454664214937117 -0.18832808415266983 0.59055,
          0.3479849246914297 -0.3479849246914297 0.59055,
          0.18832808415266983 -0.454664214937117 0.5905500000000001,
          3.491468972896404e-17 -0.492125 0.5905500000000001,
          -0.18832808415266977 -0.454664214937117 0.5905500000000001,
          -0.34798492469142966 -0.3479849246914298 0.59055,
          -0.454664214937117 -0.1883280841526699 0.59055,
          -0.492125 -9.501880603900893e-17 0.59055,
          -0.454664214937117 0.18832808415266972 0.59055,
          -0.3479849246914298 0.3479849246914296 0.59055,
          -0.18832808415267008 0.45466421493711684 0.59055,
          -8.562117147711419e-17 0.4921249999999999 0.59055,
          0.1883280841526699 0.45466421493711684 0.59055,
          0.3479849246914296 0.3479849246914297 0.59055,
          0.45466421493711684 0.18832808415267008 0.59055,
          0.4733946074685585 -0.09416404207633487 2.3622,
          0.47339460746855844 0.09416404207633508 2.3622,
          0.40132456981427334 -0.2681565044220497 2.3622,
          0.26815650442204975 -0.4013245698142733 2.3622,
          0.09416404207633494 -0.47339460746855844 2.3622,
          -0.09416404207633486 -0.47339460746855844 2.3622,
          -0.2681565044220497 -0.4013245698142733 2.3622,
          -0.40132456981427334 -0.26815650442204975 2.3622,
          -0.4733946074685585 -0.09416404207633494 2.3622,
          -0.4733946074685585 0.09416404207633486 2.3622,
          -0.40132456981427334 0.2681565044220497 2.3622,
          -0.2681565044220499 0.40132456981427334 2.3622,
          -0.09416404207633508 0.4733946074685585 2.3622,
          0.09416404207633491 0.4733946074685585 2.3622,
          0.26815650442204975 0.40132456981427345 2.3622,
          0.40132456981427317 0.26815650442204997 2.3622,
          0.47339460746855844 0.09416404207633501 0.59055,
          0.40132456981427317 0.2681565044220499 0.59055,
          0.26815650442204975 0.4013245698142733 0.59055,
          0.09416404207633491 0.4733946074685583 0.59055,
          -0.09416404207633508 0.4733946074685583 0.59055,
          -0.2681565044220499 0.40132456981427317 0.59055,
          -0.40132456981427334 0.2681565044220497 0.59055,
          -0.4733946074685585 0.09416404207633482 0.59055,
          -0.4733946074685585 -0.094164042076335 0.59055,
          -0.40132456981427334 -0.26815650442204986 0.59055,
          -0.2681565044220497 -0.40132456981427334 0.5905500000000001,
          -0.09416404207633486 -0.4733946074685585 0.5905500000000001,
          0.09416404207633494 -0.4733946074685585 0.5905500000000001,
          0.26815650442204975 -0.40132456981427334 0.5905500000000001,
          0.40132456981427334 -0.26815650442204975 0.59055,
          0.4733946074685585 -0.09416404207633494 0.59055,
          -0.09416404207633491 -0.039847303734279166 2.3622,
          -0.369754042076335 -0.03936999999999991 2.3622,
          -0.09416404207633502 0.2366973037342793 2.3622,
          0.09416404207633493 0.23669730373427925 2.3622,
          0.36975404207633494 -0.03937 2.3622,
          0.09416404207633493 -0.03984730373427921 2.3622,
          -0.09416404207633486 -0.47339460746855844 1.7499646622808158,
          3.5513952889587586e-17 -0.48275980373427907 1.7499646622808158,
          0.09416404207633494 -0.47339460746855844 1.7499646622808158,
          0.09416404207633493 -0.03984730373427921 1.7499646622808156,
          0.36975404207633494 -0.03937 1.7499646622808156,
          0.09416404207633493 0.23669730373427925 1.7499646622808156,
          0.09416404207633491 0.4733946074685585 1.7499646622808156,
          -8.468711842901654e-17 0.48275980373427924 1.7499646622808156,
          -0.09416404207633508 0.4733946074685585 1.7499646622808156,
          -0.09416404207633502 0.2366973037342793 1.7499646622808156,
          -0.369754042076335 -0.03936999999999991 1.7499646622808158,
          -0.09416404207633491 -0.039847303734279166 1.7499646622808158 ] }
        coordIndex [
          0, 16, 48, 33, -1,
          0, 32, 63, 16, -1,
          0, 33, 15, 47, 14, 46, 13, 45, 67, 68, 69, 36, 3, 35, 2, 34, 1, 32, -1,
          1, 17, 63, 32, -1,
          1, 34, 62, 17, -1,
          2, 18, 62, 34, -1,
          2, 35, 61, 18, -1,
          3, 19, 61, 35, -1,
          3, 36, 60, 19, -1,
          4, 20, 60, 36, -1,
          4, 36, 72, 71, -1,
          4, 37, 59, 20, -1,
          4, 71, 70, 37, -1,
          5, 21, 59, 37, -1,
          5, 37, 64, 65, 66, 44, 11, 43, 10, 42, 9, 41, 8, 40, 7, 39, 6, 38, -1,
          5, 38, 58, 21, -1,
          6, 22, 58, 38, -1,
          6, 39, 57, 22, -1,
          7, 23, 57, 39, -1,
          7, 40, 56, 23, -1,
          8, 24, 56, 40, -1,
          8, 41, 55, 24, -1,
          9, 25, 55, 41, -1,
          9, 42, 54, 25, -1,
          10, 26, 54, 42, -1,
          10, 43, 53, 26, -1,
          11, 27, 53, 43, -1,
          11, 44, 52, 27, -1,
          12, 28, 52, 44, -1,
          12, 44, 78, 77, -1,
          12, 45, 51, 28, -1,
          12, 77, 76, 45, -1,
          13, 29, 51, 45, -1,
          13, 46, 50, 29, -1,
          14, 30, 50, 46, -1,
          14, 47, 49, 30, -1,
          15, 31, 49, 47, -1,
          15, 33, 48, 31, -1,
          16, 63, 17, 62, 18, 61, 19, 60, 20, 59, 21, 58, 22, 57, 23, 56, 24, 55, 25, 54, 26, 53, 27, 52, 28, 51, 29, 50, 30, 49, 31, 48, -1,
          36, 69, 73, 72, -1,
          37, 70, 81, 64, -1,
          44, 66, 79, 78, -1,
          45, 76, 75, 67, -1,
          64, 81, 80, 65, -1,
          65, 80, 79, 66, -1,
          67, 75, 74, 68, -1,
          68, 74, 73, 69, -1,
          70, 71, 72, 73, 74, 75, 76, 77, 78, 79, 80, 81, -1 ]
        normal Normal { vector [
          0.8914918652806689 1.8763341957743572e-16 0.4530367028601475,
          0.8236310877331193 -0.3411591669311626 0.4530367028601475,
          0.630379943312605 -0.630379943312605 0.45303670286014763,
          0.3411591669311627 -0.8236310877331193 0.45303670286014763,
          0.0 0.9177235924396043 0.3972195965454713,
          -0.34115916693116316 -0.8236310877331192 0.4530367028601475,
          -0.630379943312605 -0.630379943312605 0.4530367028601475,
          -0.8236310877331195 -0.3411591669311625 0.45303670286014747,
          -0.8914918652806689 0.0 0.45303670286014736,
          -0.8236310877331195 0.34115916693116244 0.45303670286014736,
          -0.6303799433126057 0.6303799433126045 0.45303670286014747,
          -0.3411591669311632 0.8236310877331191 0.45303670286014747,
          0.0 -0.9177235924396113 0.39721959654545536,
          0.3411591669311624 0.8236310877331195 0.4530367028601475,
          0.630379943312605 0.630379943312605 0.4530367028601475,
          0.8236310877331193 0.34115916693116305 0.4530367028601475,
          0.8933913188818184 1.4636514987744046e-16 -0.4492793689305188,
          0.8253859540381762 -0.3418860563548688 -0.4492793689305188,
          0.631723059834527 -0.631723059834527 -0.4492793689305188,
          0.3418860563548688 -0.8253859540381763 -0.4492793689305188,
          4.226713232054097e-18 -0.8933913188818184 -0.44927936893051873,
          -0.34188605635486874 -0.8253859540381763 -0.44927936893051873,
          -0.6317230598345266 -0.6317230598345273 -0.44927936893051873,
          -0.8253859540381762 -0.3418860563548688 -0.4492793689305188,
          -0.8933913188818183 -4.166805010001065e-17 -0.44927936893051895,
          -0.8253859540381762 0.34188605635486863 -0.4492793689305188,
          -0.6317230598345274 0.6317230598345266 -0.44927936893051884,
          -0.3418860563548688 0.8253859540381762 -0.44927936893051884,
          4.226713232054097e-18 0.8933913188818183 -0.44927936893051884,
          0.3418860563548684 0.8253859540381763 -0.4492793689305188,
          0.631723059834527 0.631723059834527 -0.44927936893051884,
          0.825385954038176 0.34188605635486913 -0.44927936893051884,
          0.8761161427049465 -0.1742703360449749 0.4495001162030745,
          0.8761161427049464 0.17427033604497533 0.44950011620307445,
          0.742735401990729 -0.49627992923660824 0.4495001162030745,
          0.49627992923660824 -0.742735401990729 0.4495001162030745,
          -0.45375145574445563 -0.6168584764827775 0.6431137040999312,
          0.453751455744455 -0.6168584764827777 0.6431137040999315,
          -0.49627992923660846 -0.7427354019907287 0.44950011620307434,
          -0.742735401990729 -0.49627992923660835 0.44950011620307434,
          -0.8761161427049465 -0.17427033604497522 0.44950011620307423,
          -0.8761161427049465 0.17427033604497522 0.44950011620307423,
          -0.7427354019907294 0.49627992923660774 0.44950011620307423,
          -0.49627992923660874 0.7427354019907287 0.44950011620307434,
          0.45375145574445497 0.6168584764827779 0.6431137040999313,
          -0.4537514557444559 0.6168584764827777 0.643113704099931,
          0.49627992923660813 0.7427354019907291 0.44950011620307445,
          0.7427354019907287 0.49627992923660846 0.44950011620307445,
          0.8779537141241928 0.1746358517262068 -0.445757327642965,
          0.7442932198190213 0.49732082983124337 -0.44575732764296505,
          0.49732082983124287 0.7442932198190215 -0.445757327642965,
          0.1746358517262066 0.8779537141241927 -0.445757327642965,
          -0.17463585172620685 0.8779537141241927 -0.44575732764296494,
          -0.4973208298312431 0.7442932198190213 -0.44575732764296494,
          -0.7442932198190216 0.49732082983124287 -0.44575732764296505,
          -0.8779537141241928 0.17463585172620674 -0.44575732764296505,
          -0.8779537141241928 -0.17463585172620683 -0.445757327642965,
          -0.7442932198190211 -0.49732082983124337 -0.4457573276429649,
          -0.49732082983124287 -0.7442932198190215 -0.4457573276429649,
          -0.17463585172620638 -0.8779537141241928 -0.44575732764296494,
          0.1746358517262064 -0.8779537141241928 -0.44575732764296494,
          0.497320829831243 -0.7442932198190214 -0.4457573276429649,
          0.7442932198190213 -0.4973208298312431 -0.4457573276429649,
          0.8779537141241927 -0.17463585172620644 -0.4457573276429649,
          0.5780166015441933 0.5770163817562389 0.5770172471635832,
          0.5627254798374539 0.23280287566755067 0.7931852592065906,
          0.8126984070581105 -0.3362188739305095 0.47589722417567215,
          -0.8126984070581106 -0.33621887393050953 0.47589722417567193,
          -0.5627254798374546 0.2328028756675506 0.7931852592065902,
          -0.5780166015441938 0.5770163817562387 0.577017247163583,
          0.6145399785542013 0.5564520695744061 0.5591973793080242,
          1.4953907445962183e-16 0.8935437759727518 0.44897608000912115,
          -0.6145399785542011 0.5564520695744062 0.5591973793080243,
          -0.5780166015441937 0.5770163817562388 0.577017247163583,
          -0.5627254798374544 0.23280287566755084 0.7931852592065902,
          -0.8126984070581105 -0.33621887393050937 0.47589722417567193,
          -0.6145399785542015 -0.5564520695744057 0.5591973793080243,
          1.4953907445962185e-16 -0.8935437759727516 0.44897608000912126,
          0.614539978554202 -0.5564520695744054 0.5591973793080242,
          0.8126984070581108 -0.33621887393050914 0.4758972241756719,
          0.5627254798374549 0.23280287566755076 0.79318525920659,
          0.578016601544194 0.5770163817562388 0.5770172471635828 ] }
        normalIndex [
          0, 16, 48, 33, -1,
          0, 32, 63, 16, -1,
          0, 33, 15, 47, 14, 46, 13, 45, 67, 68, 69, 36, 3, 35, 2, 34, 1, 32, -1,
          1, 17, 63, 32, -1,
          1, 34, 62, 17, -1,
          2, 18, 62, 34, -1,
          2, 35, 61, 18, -1,
          3, 19, 61, 35, -1,
          3, 36, 60, 19, -1,
          4, 20, 60, 36, -1,
          4, 36, 72, 71, -1,
          4, 37, 59, 20, -1,
          4, 71, 70, 37, -1,
          5, 21, 59, 37, -1,
          5, 37, 64, 65, 66, 44, 11, 43, 10, 42, 9, 41, 8, 40, 7, 39, 6, 38, -1,
          5, 38, 58, 21, -1,
          6, 22, 58, 38, -1,
          6, 39, 57, 22, -1,
          7, 23, 57, 39, -1,
          7, 40, 56, 23, -1,
          8, 24, 56, 40, -1,
          8, 41, 55, 24, -1,
          9, 25, 55, 41, -1,
          9, 42, 54, 25, -1,
          10, 26, 54, 42, -1,
          10, 43, 53, 26, -1,
          11, 27, 53, 43, -1,
          11, 44, 52, 27, -1,
          12, 28, 52, 44, -1,
          12, 44, 78, 77, -1,
          12, 45, 51, 28, -1,
          12, 77, 76, 45, -1,
          13, 29, 51, 45, -1,
          13, 46, 50, 29, -1,
          14, 30, 50, 46, -1,
          14, 47, 49, 30, -1,
          15, 31, 49, 47, -1,
          15, 33, 48, 31, -1,
          16, 63, 17, 62, 18, 61, 19, 60, 20, 59, 21, 58, 22, 57, 23, 56, 24, 55, 25, 54, 26, 53, 27, 52, 28, 51, 29, 50, 30, 49, 31, 48, -1,
          36, 69, 73, 72, -1,
          37, 70, 81, 64, -1,
          44, 66, 79, 78, -1,
          45, 76, 75, 67, -1,
          64, 81, 80, 65, -1,
          65, 80, 79, 66, -1,
          67, 75, 74, 68, -1,
          68, 74, 73, 69, -1,
          70, 71, 72, 73, 74, 75, 76, 77, 78, 79, 80, 81, -1 ]
      }
    }
  ]
}

DEF cylinder3 Transform {
  children [
    Shape {
      appearance Appearance {
        material DEF Body2 Material {
          diffuseColor 0.15418 0.15418 0.15418
          emissiveColor 0.0 0.0 0.0
          specularColor 0.85348 0.85348 0.85348
          ambientIntensity 0.3606399999999999
          transparency 0.0
          shininess 1.0
        }
      }
      geometry IndexedFaceSet {
        normalPerVertex TRUE
        coord Coordinate { point [
          0.98425 3.939607612125827e-17 2.3622,
          0.909328429874234 -0.37665616830533954 2.3622,
          0.6959698493828594 -0.6959698493828592 2.3622,
          0.3766561683053397 -0.9093284298742338 2.3622,
          8.8952277167706e-17 -0.9842499999999998 2.3622,
          -0.3766561683053395 -0.9093284298742338 2.3622,
          -0.6959698493828593 -0.6959698493828593 2.3622,
          -0.909328429874234 -0.37665616830533966 2.3622,
          -0.98425 -8.113978508481998e-17 2.3622,
          -0.909328429874234 0.37665616830533954 2.3622,
          -0.6959698493828596 0.6959698493828594 2.3622,
          -0.3766561683053401 0.9093284298742338 2.3622,
          -1.5211944524445044e-16 0.98425 2.3622,
          0.3766561683053399 0.909328429874234 2.3622,
          0.6959698493828592 0.6959698493828597 2.3622,
          0.9093284298742337 0.37665616830534027 2.3622,
          0.98425 -8.113978508481998e-17 0.59055,
          0.909328429874234 -0.37665616830533966 0.59055,
          0.6959698493828594 -0.6959698493828594 0.59055,
          0.3766561683053397 -0.909328429874234 0.5905500000000001,
          8.8952277167706e-17 -0.98425 0.5905500000000001,
          -0.3766561683053395 -0.909328429874234 0.5905500000000001,
          -0.6959698493828593 -0.6959698493828596 0.59055,
          -0.909328429874234 -0.3766561683053398 0.59055,
          -0.98425 -2.0167564629089817e-16 0.59055,
          -0.909328429874234 0.37665616830533943 0.59055,
          -0.6959698493828596 0.6959698493828592 0.59055,
          -0.3766561683053401 0.9093284298742337 0.59055,
          -1.5211944524445044e-16 0.9842499999999998 0.59055,
          0.3766561683053399 0.9093284298742337 0.59055,
          0.6959698493828592 0.6959698493828594 0.59055,
          0.9093284298742337 0.37665616830534016 0.59055,
          -0.4921250000000001 -2.1895656225993636e-17 2.3622,
          -0.45466421493711706 -0.1883280841526698 2.3622,
          -0.3479849246914297 -0.34798492469142966 2.3622,
          -0.18832808415266986 -0.45466421493711684 2.3622,
          -3.990546886064565e-17 -0.4921249999999998 2.3622,
          0.18832808415266977 -0.45466421493711684 2.3622,
          0.34798492469142966 -0.34798492469142955 2.3622,
          0.4546642149371169 -0.1883280841526697 2.3622,
          0.4921249999999999 1.0454751706531993e-16 2.3622,
          0.4546642149371169 0.1883280841526699 2.3622,
          0.3479849246914296 0.34798492469142983 2.3622,
          0.1883280841526699 0.454664214937117 2.3622000000000005,
          -1.0608071154892004e-16 0.4921250000000001 2.3622000000000005,
          -0.1883280841526701 0.45466421493711706 2.3622000000000005,
          -0.3479849246914298 0.3479849246914298 2.3622,
          -0.4546642149371169 0.1883280841526701 2.3622,
          -0.49212499999999976 1.162577105799985e-15 1.0805667642985368,
          -0.45466421493711673 -0.18832808415266863 1.0805667642985368,
          -0.3479849246914293 -0.34798492469142855 1.0805667642985368,
          -0.1883280841526694 -0.4546642149371157 1.0805667642985368,
          3.9718933593427846e-16 -0.4921249999999987 1.0805667642985368,
          0.18832808415267022 -0.4546642149371157 1.0805667642985368,
          0.3479849246914301 -0.34798492469142844 1.0805667642985368,
          0.4546642149371173 -0.18832808415266852 1.0805667642985368,
          0.49212500000000026 1.2890202790912986e-15 1.0805667642985368,
          0.4546642149371173 0.1883280841526711 1.0805667642985368,
          0.34798492469143005 0.347984924691431 1.0805667642985368,
          0.18832808415267033 0.4546642149371181 1.0805667642985368,
          3.310140932460041e-16 0.4921250000000012 1.0805667642985368,
          -0.1883280841526697 0.4546642149371181 1.0805667642985368,
          -0.34798492469142933 0.3479849246914309 1.0805667642985368,
          -0.45466421493711656 0.18832808415267127 1.0805667642985368 ] }
        coordIndex [
          0, 1, 17, 16, -1,
          0, 15, 41, 40, -1,
          0, 16, 31, 15, -1,
          0, 40, 39, 1, -1,
          1, 2, 18, 17, -1,
          1, 39, 38, 2, -1,
          2, 3, 19, 18, -1,
          2, 38, 37, 3, -1,
          3, 4, 20, 19, -1,
          3, 37, 36, 4, -1,
          4, 5, 21, 20, -1,
          4, 36, 35, 5, -1,
          5, 6, 22, 21, -1,
          5, 35, 34, 6, -1,
          6, 7, 23, 22, -1,
          6, 34, 33, 7, -1,
          7, 8, 24, 23, -1,
          7, 33, 32, 8, -1,
          8, 9, 25, 24, -1,
          8, 32, 47, 9, -1,
          9, 10, 26, 25, -1,
          9, 47, 46, 10, -1,
          10, 11, 27, 26, -1,
          10, 46, 45, 11, -1,
          11, 12, 28, 27, -1,
          11, 45, 44, 12, -1,
          12, 13, 29, 28, -1,
          12, 44, 43, 13, -1,
          13, 14, 30, 29, -1,
          13, 43, 42, 14, -1,
          14, 15, 31, 30, -1,
          14, 42, 41, 15, -1,
          16, 17, 18, 19, 20, 21, 22, 23, 24, 25, 26, 27, 28, 29, 30, 31, -1,
          32, 33, 49, 48, -1,
          32, 48, 63, 47, -1,
          33, 34, 50, 49, -1,
          34, 35, 51, 50, -1,
          35, 36, 52, 51, -1,
          36, 37, 53, 52, -1,
          37, 38, 54, 53, -1,
          38, 39, 55, 54, -1,
          39, 40, 56, 55, -1,
          40, 41, 57, 56, -1,
          41, 42, 58, 57, -1,
          42, 43, 59, 58, -1,
          43, 44, 60, 59, -1,
          44, 45, 61, 60, -1,
          45, 46, 62, 61, -1,
          46, 47, 63, 62, -1,
          48, 49, 50, 51, 52, 53, 54, 55, 56, 57, 58, 59, 60, 61, 62, 63, -1 ]
        normal Normal { vector [
          0.7002145072825531 1.78340472508375e-16 0.7139325204744853,
          0.6469138516458262 -0.26796049103871755 0.7139325204744854,
          0.49512642638469045 -0.49512642638469045 0.7139325204744853,
          0.2679604910387176 -0.6469138516458262 0.7139325204744854,
          0.0 -0.7002145072825531 0.7139325204744853,
          -0.2679604910387175 -0.6469138516458263 0.7139325204744854,
          -0.4951264263846903 -0.4951264263846906 0.7139325204744853,
          -0.6469138516458262 -0.26796049103871766 0.7139325204744854,
          -0.7002145072825531 0.0 0.7139325204744853,
          -0.6469138516458263 0.26796049103871744 0.7139325204744854,
          -0.49512642638469084 0.4951264263846903 0.7139325204744853,
          -0.267960491038718 0.6469138516458262 0.7139325204744851,
          -1.1889364833891677e-16 0.7002145072825535 0.713932520474485,
          0.2679604910387179 0.6469138516458264 0.7139325204744851,
          0.49512642638469073 0.49512642638469057 0.7139325204744852,
          0.646913851645826 0.2679604910387178 0.7139325204744853,
          0.8909091543078934 2.1430319519630305e-16 -0.45418154824958923,
          0.8230927329920025 -0.3409361730960241 -0.4541815482495893,
          0.6299679044322837 -0.6299679044322837 -0.4541815482495891,
          0.34093617309602414 -0.8230927329920025 -0.45418154824958923,
          0.0 -0.8909091543078936 -0.45418154824958923,
          -0.340936173096024 -0.8230927329920026 -0.45418154824958923,
          -0.6299679044322836 -0.6299679044322839 -0.4541815482495891,
          -0.8230927329920025 -0.3409361730960242 -0.4541815482495893,
          -0.8909091543078934 -1.2606070305664886e-17 -0.45418154824958923,
          -0.8230927329920026 0.3409361730960239 -0.45418154824958934,
          -0.629967904432284 0.6299679044322837 -0.45418154824958934,
          -0.3409361730960242 0.8230927329920024 -0.45418154824958923,
          -1.5127284366797863e-16 0.8909091543078934 -0.45418154824958934,
          0.34093617309602403 0.8230927329920025 -0.45418154824958945,
          0.6299679044322837 0.6299679044322838 -0.45418154824958934,
          0.8230927329920025 0.34093617309602436 -0.45418154824958934,
          0.7002145072825531 -1.8824827653661808e-16 0.7139325204744854,
          0.6469138516458259 0.2679604910387177 0.7139325204744854,
          0.49512642638469 0.49512642638469057 0.7139325204744856,
          0.2679604910387172 0.646913851645826 0.7139325204744855,
          0.0 0.7002145072825529 0.7139325204744855,
          -0.26796049103871744 0.6469138516458259 0.7139325204744855,
          -0.49512642638469045 0.4951264263846903 0.7139325204744855,
          -0.6469138516458263 0.2679604910387175 0.7139325204744854,
          -0.7002145072825532 1.9815608056486117e-17 0.7139325204744852,
          -0.6469138516458264 -0.26796049103871755 0.713932520474485,
          -0.49512642638469057 -0.4951264263846908 0.7139325204744852,
          -0.2679604910387174 -0.6469138516458264 0.7139325204744852,
          -4.953902014121546e-17 -0.7002145072825531 0.7139325204744853,
          0.26796049103871755 -0.6469138516458262 0.7139325204744853,
          0.4951264263846904 -0.4951264263846906 0.7139325204744853,
          0.646913851645826 -0.26796049103871783 0.7139325204744853,
          0.8909091543078934 -2.3951533580763283e-16 0.45418154824958945,
          0.8230927329920021 0.34093617309602425 0.4541815482495896,
          0.6299679044322832 0.6299679044322839 0.45418154824958984,
          0.34093617309602364 0.8230927329920024 0.45418154824958984,
          0.0 0.8909091543078932 0.45418154824958984,
          -0.3409361730960239 0.8230927329920023 0.45418154824958973,
          -0.6299679044322837 0.6299679044322836 0.4541815482495895,
          -0.8230927329920025 0.3409361730960239 0.45418154824958934,
          -0.8909091543078936 2.5212140611329777e-17 0.45418154824958906,
          -0.8230927329920028 -0.3409361730960241 0.45418154824958884,
          -0.6299679044322841 -0.629967904432284 0.45418154824958873,
          -0.34093617309602425 -0.8230927329920028 0.4541815482495886,
          -6.303035152832446e-17 -0.8909091543078937 0.4541815482495887,
          0.3409361730960244 -0.8230927329920026 0.4541815482495888,
          0.629967904432284 -0.6299679044322839 0.45418154824958906,
          0.8230927329920025 -0.3409361730960245 0.45418154824958923 ] }
        normalIndex [
          0, 1, 17, 16, -1,
          0, 15, 41, 40, -1,
          0, 16, 31, 15, -1,
          0, 40, 39, 1, -1,
          1, 2, 18, 17, -1,
          1, 39, 38, 2, -1,
          2, 3, 19, 18, -1,
          2, 38, 37, 3, -1,
          3, 4, 20, 19, -1,
          3, 37, 36, 4, -1,
          4, 5, 21, 20, -1,
          4, 36, 35, 5, -1,
          5, 6, 22, 21, -1,
          5, 35, 34, 6, -1,
          6, 7, 23, 22, -1,
          6, 34, 33, 7, -1,
          7, 8, 24, 23, -1,
          7, 33, 32, 8, -1,
          8, 9, 25, 24, -1,
          8, 32, 47, 9, -1,
          9, 10, 26, 25, -1,
          9, 47, 46, 10, -1,
          10, 11, 27, 26, -1,
          10, 46, 45, 11, -1,
          11, 12, 28, 27, -1,
          11, 45, 44, 12, -1,
          12, 13, 29, 28, -1,
          12, 44, 43, 13, -1,
          13, 14, 30, 29, -1,
          13, 43, 42, 14, -1,
          14, 15, 31, 30, -1,
          14, 42, 41, 15, -1,
          16, 17, 18, 19, 20, 21, 22, 23, 24, 25, 26, 27, 28, 29, 30, 31, -1,
          32, 33, 49, 48, -1,
          32, 48, 63, 47, -1,
          33, 34, 50, 49, -1,
          34, 35, 51, 50, -1,
          35, 36, 52, 51, -1,
          36, 37, 53, 52, -1,
          37, 38, 54, 53, -1,
          38, 39, 55, 54, -1,
          39, 40, 56, 55, -1,
          40, 41, 57, 56, -1,
          41, 42, 58, 57, -1,
          42, 43, 59, 58, -1,
          43, 44, 60, 59, -1,
          44, 45, 61, 60, -1,
          45, 46, 62, 61, -1,
          46, 47, 63, 62, -1,
          48, 49, 50, 51, 52, 53, 54, 55, 56, 57, 58, 59, 60, 61, 62, 63, -1 ]
      }
    }
  ]
}

DEF cylinder2 Transform {
  children [
    Shape {
      appearance Appearance {
        material DEF default Material {
          diffuseColor 0.7898538076923077 0.8133333333333334 0.6940444444444445
          emissiveColor 0.0 0.0 0.0
          specularColor 1.0 1.0 1.0
          ambientIntensity 0.765743861823362
          transparency 0.0
          shininess 1.0
        }
      }
      geometry IndexedFaceSet {
        normalPerVertex TRUE
        coord Coordinate { point [
          -0.4313533038870836 -1.2221866961129164 1.1400133038870834,
          0.4313533038870836 -1.2221866961129164 1.1400133038870834,
          -0.4313533038870836 -1.2221866961129164 1.7339966961129163,
          0.4313533038870836 -1.2221866961129164 1.7339966961129163,
          -0.4313533038870836 -1.4749644871198253 1.1400133038870834,
          -1.0025244871223615 -0.9037933038870837 1.1400133038870834,
          1.0025244871223615 -0.9037933038870837 1.1400133038870834,
          0.4313533038870836 -1.4749644871198253 1.1400133038870834,
          -0.4313533038870836 -1.4749644871198253 1.7339966961129163,
          -1.0025244871223615 -0.9037933038870837 1.7339966961129163,
          1.0025244871223615 -0.9037933038870837 1.7339966961129163,
          0.4313533038870836 -1.4749644871198253 1.7339966961129163 ] }
        coordIndex [
          0, 1, 7, 6, 5, 4, -1,
          0, 2, 3, 1, -1,
          0, 4, 8, 2, -1,
          1, 3, 11, 7, -1,
          2, 8, 9, 10, 11, 3, -1,
          4, 5, 9, 8, -1,
          5, 6, 10, 9, -1,
          6, 7, 11, 10, -1 ]
        normal Normal { vector [
          -0.5773502691896258 0.5773502691896258 0.5773502691896258,
          0.5773502691896258 0.5773502691896258 0.5773502691896258,
          -0.5773502691896258 0.5773502691896258 -0.5773502691896258,
          0.5773502691896257 0.5773502691896258 -0.5773502691896258,
          -0.23258781949549018 0.5615166682670347 0.7941044877600315,
          0.5615166682656532 -0.2325878194934573 0.7941044877616039,
          -0.5615166682656532 -0.2325878194934573 0.7941044877616039,
          0.23258781949549018 0.5615166682670347 0.7941044877600315,
          -0.23258781949549018 0.5615166682670347 -0.7941044877600315,
          0.5615166682656532 -0.2325878194934573 -0.7941044877616039,
          -0.5615166682656533 -0.2325878194934573 -0.7941044877616039,
          0.2325878194954901 0.5615166682670347 -0.7941044877600315 ] }
        normalIndex [
          0, 1, 7, 6, 5, 4, -1,
          0, 2, 3, 1, -1,
          0, 4, 8, 2, -1,
          1, 3, 11, 7, -1,
          2, 8, 9, 10, 11, 3, -1,
          4, 5, 9, 8, -1,
          5, 6, 10, 9, -1,
          6, 7, 11, 10, -1 ]
      }
    }
  ]
}

