PCBNEW-LibModule-V1  13.5.2012 21:55:28
# encoding utf-8
$INDEX
Jack-3.5
Jack-3.5-SW
$EndINDEX
$MODULE Jack-3.5
Po 0 0 0 15 4FB01184 00000000 ~~
Li Jack-3.5
Cd JACK CONNECTORS ACCORDING TO JISC 6560,
Kw JACK CONNECTORS ACCORDING TO JISC 6560,
Sc 00000000
AR Jack-3.5
Op 0 0 0
At VIRTUAL
T0 -2362 1673 500 500 900 35 N V 21 N "1501_06"
T1 2461 1969 500 500 900 35 N I 21 N ">VALUE"
DS -1929 39 1929 39 80 21
DS 1929 39 1929 3700 80 21
DS 1929 3700 -1929 3700 80 21
DS -1929 3700 -1929 39 80 21
DS -944 0 -944 -944 80 21
DS -944 -944 944 -944 80 21
DS 944 -944 944 0 80 21
DC -787 1377 -944 1534 50 21
DS -1102 1377 -472 1377 50 21
DS -787 1692 -787 1062 50 21
DC -787 2952 -944 3109 50 21
DS -1102 2952 -472 2952 50 21
DS -787 3267 -787 2637 50 21
DC 787 1771 944 1928 50 21
DS 472 1771 1102 1771 50 21
DS 787 2086 787 1456 50 21
$PAD
Sh "1" C 709 709 0 0 0
Dr 354 0 0
At STD N 00E0FFFF
Ne 0 ""
Po 787 984
$EndPAD
$PAD
Sh "2" C 709 709 0 0 0
Dr 354 0 0
At STD N 00E0FFFF
Ne 0 ""
Po 1574 1377
$EndPAD
$PAD
Sh "4" C 709 709 0 0 0
Dr 354 0 0
At STD N 00E0FFFF
Ne 0 ""
Po -1574 1771
$EndPAD
$SHAPE3D
Na "Connectors\\Audio\\lumberg-1501-06.wrl"
Sc 1.000000 1.000000 1.000000
Of 0.000000 0.000000 0.000000
Ro 0.000000 0.000000 0.000000
$EndSHAPE3D
$EndMODULE  Jack-3.5
$MODULE Jack-3.5-SW
Po 0 0 0 15 4FB011AC 00000000 ~~
Li Jack-3.5-SW
Cd JACK CONNECTORS ACCORDING TO JISC 6560,
Kw JACK CONNECTORS ACCORDING TO JISC 6560,
Sc 00000000
AR /4890DA5B
Op 0 0 0
.SolderPasteRatio 9.44317e-317
At VIRTUAL 
T0 -2559 2756 500 500 900 35 N V 21 N "Jack"
T1 2854 2756 500 500 900 35 N I 21 N "CONN_2"
DS 137 669 -137 669 1 21
DS -137 984 137 984 1 21
DS -1633 2263 -1633 1988 1 21
DS -1948 1988 -1948 2263 1 21
DS -1437 5000 -1712 5000 1 21
DS -1712 5314 -1437 5314 1 21
DS 1200 3484 1200 3208 1 21
DS 885 3208 885 3484 1 21
DS 2145 4035 2145 3759 1 21
DS 1830 3759 1830 4035 1 21
DS -2125 39 2322 39 80 21
DS 2322 39 2322 5511 80 21
DS 2322 5511 -2125 5511 80 21
DS -2125 5511 -2125 39 80 21
DS -1141 0 -1141 -1338 80 21
DS -1141 -1338 1141 -1338 80 21
DS 1141 -1338 1141 0 80 21
DA 137 826 137 669 900 1 21
DA -137 826 -295 826 900 1 21
DA -137 826 -137 984 900 1 21
DA 137 826 295 826 900 1 21
DA -1791 2263 -1633 2263 900 1 21
DA -1791 1988 -1791 1830 900 1 21
DA -1791 1988 -1948 1988 900 1 21
DA -1791 2263 -1791 2421 900 1 21
DA -1437 5157 -1437 5000 900 1 21
DA -1712 5157 -1870 5157 900 1 21
DA -1712 5157 -1712 5314 900 1 21
DA -1437 5157 -1279 5157 900 1 21
DA 1043 3484 1200 3484 900 1 21
DA 1043 3208 1043 3051 900 1 21
DA 1043 3208 885 3208 900 1 21
DA 1043 3484 1043 3641 900 1 21
DA 1988 4035 2145 4035 900 1 21
DA 1988 3759 1988 3602 900 1 21
DA 1988 3759 1830 3759 900 1 21
DA 1988 4035 1988 4192 900 1 21
$PAD
Sh "1" O 944 472 0 0 0
Dr 314 0 0
At STD N 00E0FFFF
Ne 1 "N-000007"
Po 0 826
$EndPAD
$PAD
Sh "2" O 472 944 0 0 0
Dr 314 0 0
At STD N 00E0FFFF
Ne 2 "N-000038"
Po -1791 2125
$EndPAD
$PAD
Sh "3" O 472 944 0 0 0
Dr 314 0 0
At STD N 00E0FFFF
Ne 0 ""
Po 1988 3897
$EndPAD
$PAD
Sh "4" O 944 472 0 0 0
Dr 314 0 0
At STD N 00E0FFFF
Ne 0 ""
Po -1574 5157
$EndPAD
$PAD
Sh "5" O 472 944 0 0 0
Dr 314 0 0
At STD N 00E0FFFF
Ne 0 ""
Po 1043 3346
$EndPAD
$SHAPE3D
Na "Connectors\\Audio\\lumberg-1503-09.wrl"
Sc 1.500000 1.500000 1.500000
Of 0.000000 0.000000 0.000000
Ro 0.000000 0.000000 0.000000
$EndSHAPE3D
$EndMODULE  Jack-3.5-SW
$EndLIBRARY
