(module "MEGA PRO CH340G" (layer F.Cu) (tedit 5C8D9280)
  (fp_text reference REF** (at -3.81 -1.27) (layer F.SilkS)
    (effects (font (size 1 1) (thickness 0.15)))
  )
  (fp_text value "MEGA PRO CH340G" (at 6.985 -1.27) (layer F.Fab)
    (effects (font (size 1 1) (thickness 0.15)))
  )
  (fp_circle (center 19.05 52.07) (end 20.32 52.07) (layer F.SilkS) (width 0.15))
  (fp_circle (center 19.05 49.53) (end 20.32 49.53) (layer F.SilkS) (width 0.15))
  (fp_circle (center 16.51 49.53) (end 17.78 49.53) (layer F.SilkS) (width 0.15))
  (fp_circle (center 16.51 52.07) (end 17.78 52.07) (layer F.SilkS) (width 0.15))
  (fp_circle (center 13.97 52.07) (end 15.24 52.07) (layer F.SilkS) (width 0.15))
  (fp_circle (center 13.97 49.53) (end 15.24 49.53) (layer F.SilkS) (width 0.15))
  (fp_line (start 19.05 0) (end 28.575 0) (layer F.SilkS) (width 0.15))
  (fp_line (start 28.575 0) (end 28.575 5.08) (layer F.SilkS) (width 0.15))
  (fp_line (start 28.575 5.08) (end 19.05 5.08) (layer F.SilkS) (width 0.15))
  (fp_line (start 19.05 5.08) (end 19.05 0) (layer F.SilkS) (width 0.15))
  (fp_line (start 31.75 1.905) (end 31.75 6.985) (layer F.SilkS) (width 0.15))
  (fp_line (start 31.75 6.985) (end 36.83 6.985) (layer F.SilkS) (width 0.15))
  (fp_line (start 36.83 6.985) (end 36.83 1.905) (layer F.SilkS) (width 0.15))
  (fp_line (start 36.83 1.905) (end 31.75 1.905) (layer F.SilkS) (width 0.15))
  (fp_circle (center 34.29 4.445) (end 35.56 4.445) (layer F.SilkS) (width 0.15))
  (fp_line (start 19.05 45.72) (end 9.525 36.195) (layer F.SilkS) (width 0.15))
  (fp_line (start 9.525 36.195) (end 19.05 26.67) (layer F.SilkS) (width 0.15))
  (fp_line (start 19.05 26.67) (end 28.575 36.195) (layer F.SilkS) (width 0.15))
  (fp_line (start 28.575 36.195) (end 19.05 45.72) (layer F.SilkS) (width 0.15))
  (fp_line (start 0 0) (end 38.1 0) (layer F.SilkS) (width 0.15))
  (fp_line (start 38.1 0) (end 38.1 53.34) (layer F.SilkS) (width 0.15))
  (fp_line (start 38.1 53.34) (end 0 53.34) (layer F.SilkS) (width 0.15))
  (fp_line (start 0 53.34) (end 0 0) (layer F.SilkS) (width 0.15))
  (fp_text user USB (at 24.13 3.81) (layer F.SilkS)
    (effects (font (size 1 1) (thickness 0.15)))
  )
  (fp_text user Micro (at 24.13 1.27) (layer F.SilkS)
    (effects (font (size 1 1) (thickness 0.15)))
  )
  (fp_text user RESET (at 34.29 8.89) (layer F.SilkS)
    (effects (font (size 1 1) (thickness 0.15)))
  )
  (fp_text user ISP (at 16.51 46.99) (layer F.SilkS)
    (effects (font (size 1 1) (thickness 0.15)))
  )
  (fp_text user 1 (at 20.32 47.625) (layer F.SilkS)
    (effects (font (size 1 1) (thickness 0.15)))
  )
  (fp_text user MEGA2560 (at 19.05 36.195) (layer F.SilkS)
    (effects (font (size 1 1) (thickness 0.15)))
  )
  (pad 1 thru_hole rect (at 3.81 1.27) (size 2 2) (drill 1) (layers *.Cu *.Mask))
  (pad 2 thru_hole oval (at 1.27 1.27) (size 2 1.5) (drill 1) (layers *.Cu *.Mask))
  (pad 3 thru_hole oval (at 3.81 3.81) (size 2 1.5) (drill 1) (layers *.Cu *.Mask))
  (pad 4 thru_hole oval (at 1.27 3.81) (size 2 1.5) (drill 1) (layers *.Cu *.Mask))
  (pad 5 thru_hole oval (at 3.81 6.35) (size 2 1.5) (drill 1) (layers *.Cu *.Mask))
  (pad 6 thru_hole oval (at 1.27 6.35) (size 2 1.5) (drill 1) (layers *.Cu *.Mask))
  (pad 7 thru_hole oval (at 3.81 8.89) (size 2 1.5) (drill 1) (layers *.Cu *.Mask))
  (pad 8 thru_hole oval (at 1.27 8.89) (size 2 1.5) (drill 1) (layers *.Cu *.Mask))
  (pad 9 thru_hole oval (at 3.81 11.43) (size 2 1.5) (drill 1) (layers *.Cu *.Mask))
  (pad 10 thru_hole oval (at 1.27 11.43) (size 2 1.5) (drill 1) (layers *.Cu *.Mask))
  (pad 11 thru_hole oval (at 3.81 13.97) (size 2 1.5) (drill 1) (layers *.Cu *.Mask))
  (pad 12 thru_hole oval (at 1.27 13.97) (size 2 1.5) (drill 1) (layers *.Cu *.Mask))
  (pad 13 thru_hole oval (at 3.81 16.51) (size 2 1.5) (drill 1) (layers *.Cu *.Mask))
  (pad 14 thru_hole oval (at 1.27 16.51) (size 2 1.5) (drill 1) (layers *.Cu *.Mask))
  (pad 15 thru_hole oval (at 3.81 19.05) (size 2 1.5) (drill 1) (layers *.Cu *.Mask))
  (pad 16 thru_hole oval (at 1.27 19.05) (size 2 1.5) (drill 1) (layers *.Cu *.Mask))
  (pad 17 thru_hole oval (at 3.81 21.59) (size 2 1.5) (drill 1) (layers *.Cu *.Mask))
  (pad 18 thru_hole oval (at 1.27 21.59) (size 2 1.5) (drill 1) (layers *.Cu *.Mask))
  (pad 19 thru_hole oval (at 3.81 24.13) (size 2 1.5) (drill 1) (layers *.Cu *.Mask))
  (pad 20 thru_hole oval (at 1.27 24.13) (size 2 1.5) (drill 1) (layers *.Cu *.Mask))
  (pad 21 thru_hole oval (at 3.81 26.67) (size 2 1.5) (drill 1) (layers *.Cu *.Mask))
  (pad 22 thru_hole oval (at 1.27 26.67) (size 2 1.5) (drill 1) (layers *.Cu *.Mask))
  (pad 23 thru_hole oval (at 3.81 29.21) (size 2 1.5) (drill 1) (layers *.Cu *.Mask))
  (pad 24 thru_hole oval (at 1.27 29.21) (size 2 1.5) (drill 1) (layers *.Cu *.Mask))
  (pad 25 thru_hole oval (at 3.81 31.75) (size 2 1.5) (drill 1) (layers *.Cu *.Mask))
  (pad 26 thru_hole oval (at 1.27 31.75) (size 2 1.5) (drill 1) (layers *.Cu *.Mask))
  (pad 27 thru_hole oval (at 3.81 34.29) (size 2 1.5) (drill 1) (layers *.Cu *.Mask))
  (pad 28 thru_hole oval (at 1.27 34.29) (size 2 1.5) (drill 1) (layers *.Cu *.Mask))
  (pad 29 thru_hole oval (at 3.81 36.83) (size 2 1.5) (drill 1) (layers *.Cu *.Mask))
  (pad 30 thru_hole oval (at 1.27 36.83) (size 2 1.5) (drill 1) (layers *.Cu *.Mask))
  (pad 31 thru_hole oval (at 3.81 39.37) (size 2 1.5) (drill 1) (layers *.Cu *.Mask))
  (pad 32 thru_hole oval (at 1.27 39.37) (size 2 1.5) (drill 1) (layers *.Cu *.Mask))
  (pad 33 thru_hole oval (at 3.81 41.91) (size 2 1.5) (drill 1) (layers *.Cu *.Mask))
  (pad 34 thru_hole oval (at 1.27 41.91) (size 2 1.5) (drill 1) (layers *.Cu *.Mask))
  (pad 35 thru_hole oval (at 3.81 44.45) (size 2 1.5) (drill 1) (layers *.Cu *.Mask))
  (pad 36 thru_hole oval (at 1.27 44.45) (size 2 1.5) (drill 1) (layers *.Cu *.Mask))
  (pad 37 thru_hole oval (at 3.81 46.99) (size 2 1.5) (drill 1) (layers *.Cu *.Mask))
  (pad 38 thru_hole oval (at 1.27 46.99) (size 2 1.5) (drill 1) (layers *.Cu *.Mask))
  (pad 39 thru_hole oval (at 3.81 49.53) (size 2 1.5) (drill 1) (layers *.Cu *.Mask))
  (pad 40 thru_hole oval (at 1.27 49.53) (size 2 1.5) (drill 1) (layers *.Cu *.Mask))
  (pad 41 thru_hole oval (at 3.81 52.07) (size 2 1.5) (drill 1) (layers *.Cu *.Mask))
  (pad 42 thru_hole oval (at 1.27 52.07) (size 2 1.5) (drill 1) (layers *.Cu *.Mask))
  (pad 43 thru_hole oval (at 36.83 13.97) (size 2 1.5) (drill 1) (layers *.Cu *.Mask))
  (pad 44 thru_hole oval (at 34.29 13.97) (size 2 1.5) (drill 1) (layers *.Cu *.Mask))
  (pad 45 thru_hole oval (at 36.83 16.51) (size 2 1.5) (drill 1) (layers *.Cu *.Mask))
  (pad 46 thru_hole oval (at 34.29 16.51) (size 2 1.5) (drill 1) (layers *.Cu *.Mask))
  (pad 47 thru_hole oval (at 36.83 19.05) (size 2 1.5) (drill 1) (layers *.Cu *.Mask))
  (pad 48 thru_hole oval (at 34.29 19.05) (size 2 1.5) (drill 1) (layers *.Cu *.Mask))
  (pad 49 thru_hole oval (at 36.83 21.59) (size 2 1.5) (drill 1) (layers *.Cu *.Mask))
  (pad 50 thru_hole oval (at 34.29 21.59) (size 2 1.5) (drill 1) (layers *.Cu *.Mask))
  (pad 51 thru_hole oval (at 36.83 24.13) (size 2 1.5) (drill 1) (layers *.Cu *.Mask))
  (pad 52 thru_hole oval (at 34.29 24.13) (size 2 1.5) (drill 1) (layers *.Cu *.Mask))
  (pad 53 thru_hole oval (at 36.83 26.67) (size 2 1.5) (drill 1) (layers *.Cu *.Mask))
  (pad 54 thru_hole oval (at 34.29 26.67) (size 2 1.5) (drill 1) (layers *.Cu *.Mask))
  (pad 55 thru_hole oval (at 36.83 29.21) (size 2 1.5) (drill 1) (layers *.Cu *.Mask))
  (pad 56 thru_hole oval (at 34.29 29.21) (size 2 1.5) (drill 1) (layers *.Cu *.Mask))
  (pad 57 thru_hole oval (at 36.83 31.75) (size 2 1.5) (drill 1) (layers *.Cu *.Mask))
  (pad 58 thru_hole oval (at 34.29 31.75) (size 2 1.5) (drill 1) (layers *.Cu *.Mask))
  (pad 59 thru_hole oval (at 36.83 34.29) (size 2 1.5) (drill 1) (layers *.Cu *.Mask))
  (pad 60 thru_hole oval (at 34.29 34.29) (size 2 1.5) (drill 1) (layers *.Cu *.Mask))
  (pad 61 thru_hole oval (at 36.83 36.83) (size 2 1.5) (drill 1) (layers *.Cu *.Mask))
  (pad 62 thru_hole oval (at 34.29 36.83) (size 2 1.5) (drill 1) (layers *.Cu *.Mask))
  (pad 63 thru_hole oval (at 36.83 39.37) (size 2 1.5) (drill 1) (layers *.Cu *.Mask))
  (pad 64 thru_hole oval (at 34.29 39.37) (size 2 1.5) (drill 1) (layers *.Cu *.Mask))
  (pad 65 thru_hole oval (at 36.83 41.91) (size 2 1.5) (drill 1) (layers *.Cu *.Mask))
  (pad 66 thru_hole oval (at 34.29 41.91) (size 2 1.5) (drill 1) (layers *.Cu *.Mask))
  (pad 67 thru_hole oval (at 36.83 44.45) (size 2 1.5) (drill 1) (layers *.Cu *.Mask))
  (pad 68 thru_hole oval (at 34.29 44.45) (size 2 1.5) (drill 1) (layers *.Cu *.Mask))
  (pad 69 thru_hole oval (at 36.83 46.99) (size 2 1.5) (drill 1) (layers *.Cu *.Mask))
  (pad 70 thru_hole oval (at 34.29 46.99) (size 2 1.5) (drill 1) (layers *.Cu *.Mask))
  (pad 71 thru_hole oval (at 36.83 49.53) (size 2 1.5) (drill 1) (layers *.Cu *.Mask))
  (pad 72 thru_hole oval (at 34.29 49.53) (size 2 1.5) (drill 1) (layers *.Cu *.Mask))
  (pad 73 thru_hole oval (at 36.83 52.07) (size 2 1.5) (drill 1) (layers *.Cu *.Mask))
  (pad 74 thru_hole oval (at 34.29 52.07) (size 2 1.5) (drill 1) (layers *.Cu *.Mask))
  (pad 75 thru_hole oval (at 31.75 52.07) (size 2 1.5) (drill 1) (layers *.Cu *.Mask))
  (pad 76 thru_hole oval (at 31.75 49.53) (size 2 1.5) (drill 1) (layers *.Cu *.Mask))
  (pad 77 thru_hole oval (at 29.21 52.07) (size 2 1.5) (drill 1) (layers *.Cu *.Mask))
  (pad 78 thru_hole oval (at 29.21 49.53) (size 2 1.5) (drill 1) (layers *.Cu *.Mask))
  (pad 79 thru_hole oval (at 26.67 52.07) (size 2 1.5) (drill 1) (layers *.Cu *.Mask))
  (pad 80 thru_hole oval (at 26.67 49.53) (size 2 1.5) (drill 1) (layers *.Cu *.Mask))
)
