PCBNEW-LibModule-V1  St 20. červen 2012, 18:36:28 CEST
# encoding utf-8
Units deci-mils
$INDEX
BOTAO3
BOTAO4
BOTAO5
Button_rect
TC01
TC01B
TC02
bot_tac_c2
sw_push4p
$EndINDEX
$MODULE BOTAO3
Po 0 0 0 15 4FD795DB 00000000 ~~
Li BOTAO3
Sc 0
AR 
Op 0 0 0
T0 0 -2750 393 393 0 78 N V 21 N "BOTAO3"
T1 0 2500 393 393 0 78 N I 21 N "Value"
DS -1700 1950 -1700 -1950 150 21
DS -1700 -1950 1700 -1950 150 21
DS 1700 -1950 1700 1950 150 21
DS 1700 1950 -1700 1950 150 21
DS -700 -550 -700 600 150 21
DS -700 600 500 600 150 21
DS 500 600 500 -500 150 21
DS 500 -500 -650 -500 150 21
$PAD
Sh "1" C 1181 1181 0 0 0
Dr 787 0 0
At STD N 00E0FFFF
Ne 0 ""
Po -1000 1350
$EndPAD
$PAD
Sh "2" C 1181 1181 0 0 0
Dr 787 0 0
At STD N 00E0FFFF
Ne 0 ""
Po 1000 1350
$EndPAD
$PAD
Sh "3" C 1181 1181 0 0 0
Dr 787 0 0
At STD N 00E0FFFF
Ne 0 ""
Po 1000 -1350
$EndPAD
$PAD
Sh "4" C 1181 1181 0 0 0
Dr 787 0 0
At STD N 00E0FFFF
Ne 0 ""
Po -1000 -1350
$EndPAD
$SHAPE3D
Na "Switch/botao3.wrl"
Sc 1 1 1
Of 0 0 0
Ro 0 0 0
$EndSHAPE3D
$EndMODULE BOTAO3
$MODULE BOTAO4
Po 0 0 0 15 4FD798DF 00000000 ~~
Li BOTAO4
Sc 0
AR 
Op 0 0 0
T0 0 -2250 392 392 0 77 N V 21 N "BOTAO4"
T1 0 2250 393 393 0 78 N I 21 N "Value"
DS -1600 1500 -1600 -1500 150 21
DS -1600 -1500 1650 -1500 150 21
DS 1650 -1500 1650 1500 150 21
DS 1650 1500 -1600 1500 150 21
DS -500 -450 -500 500 150 21
DS -500 500 550 500 150 21
DS 550 500 550 -450 150 21
DS 550 -450 -500 -450 150 21
$PAD
Sh "2" C 787 787 0 0 0
Dr 315 0 0
At STD N 00E0FFFF
Ne 0 ""
Po 0 1200
$EndPAD
$PAD
Sh "5" C 787 787 0 0 0
Dr 315 0 0
At STD N 00E0FFFF
Ne 0 ""
Po 0 -1200
$EndPAD
$PAD
Sh "1" C 787 787 0 0 0
Dr 315 0 0
At STD N 00E0FFFF
Ne 0 ""
Po -1200 1200
$EndPAD
$PAD
Sh "4" C 787 787 0 0 0
Dr 315 0 0
At STD N 00E0FFFF
Ne 0 ""
Po 1200 -1200
$EndPAD
$PAD
Sh "6" C 787 787 0 0 0
Dr 315 0 0
At STD N 00E0FFFF
Ne 0 ""
Po -1200 -1200
$EndPAD
$PAD
Sh "3" C 0 0 0 0 0
Dr 315 0 0
At STD N 00E0FFFF
Ne 0 ""
Po 1200 1200
$EndPAD
$PAD
Sh "10" C 0 0 0 0 0
Dr 315 0 0
At STD N 00E0FFFF
Ne 0 ""
Po 1200 1200
$EndPAD
$PAD
Sh "3" C 787 787 0 0 0
Dr 315 0 0
At STD N 00E0FFFF
Ne 0 ""
Po 1200 1200
$EndPAD
$SHAPE3D
Na "Switch/Zippy-P1.wrl"
Sc 1 1 1
Of 0 0 0
Ro 0 0 0
$EndSHAPE3D
$EndMODULE BOTAO4
$MODULE BOTAO5
Po 0 0 0 15 4FD7991C 00000000 ~~
Li BOTAO5
Sc 0
AR 
Op 0 0 0
T0 0 -3250 393 393 0 78 N V 21 N "BOTAO5"
T1 0 3350 393 393 0 78 N I 21 N "Value"
DC 0 0 1500 -700 150 21
DS -2150 -2400 -2150 2400 150 21
DS -2150 2400 2150 2400 150 21
DS 2150 2400 2150 -2450 150 21
DS 2150 -2450 -2150 -2450 150 21
$PAD
Sh "7" C 787 787 0 0 0
Dr 315 0 0
At STD N 00E0FFFF
Ne 0 ""
Po -1450 2400
$EndPAD
$PAD
Sh "8" C 787 787 0 0 0
Dr 315 0 0
At STD N 00E0FFFF
Ne 0 ""
Po 1500 2400
$EndPAD
$PAD
Sh "10" C 787 787 0 0 0
Dr 315 0 0
At STD N 00E0FFFF
Ne 0 ""
Po 1500 -2450
$EndPAD
$PAD
Sh "11" C 787 787 0 0 0
Dr 315 0 0
At STD N 00E0FFFF
Ne 0 ""
Po -1450 -2400
$EndPAD
$SHAPE3D
Na "Switch/botao5.wrl"
Sc 1.45 1.45 1.45
Of 0 0 0
Ro 0 0 0
$EndSHAPE3D
$EndMODULE BOTAO5
$MODULE Button_rect
Po 0 0 0 15 4FE1FB72 00000000 ~~
Li Button_rect
Cd Bouton poussoir
Kw SWITCH DEV
Sc 0
AR 
Op 0 A 0
T0 0 -3250 393 393 0 78 N V 21 N "Button_rect"
T1 0 0 393 393 0 78 N I 21 N "Value"
DS 2500 -2750 -2500 -2750 150 21
DS -2500 -2750 -2750 -2500 150 21
DS -2750 -2500 -2750 2500 150 21
DS 2750 -2500 2750 2500 150 21
DS 2750 2500 2500 2750 150 21
DS 2500 2750 -2500 2750 150 21
DS -2500 2750 -2750 2500 150 21
DS 2500 -2750 2750 -2500 150 21
$PAD
Sh "2" C 944 944 0 0 0
Dr 320 0 0
At STD N 00E0FFFF
Ne 0 ""
Po 1800 -1800
$EndPAD
$PAD
Sh "3" C 944 944 0 0 0
Dr 320 0 0
At STD N 00E0FFFF
Ne 0 ""
Po -1800 1800
$EndPAD
$PAD
Sh "4" C 944 944 0 0 0
Dr 320 0 0
At STD N 00E0FFFF
Ne 0 ""
Po 1800 1800
$EndPAD
$PAD
Sh "1" C 944 944 0 0 0
Dr 320 0 0
At STD N 00E0FFFF
Ne 0 ""
Po -1800 -1800
$EndPAD
$SHAPE3D
Na "device/switch_push.wrl"
Sc 1 1 1
Of 0 0 0
Ro 0 0 0
$EndSHAPE3D
$EndMODULE Button_rect
$MODULE TC01
Po 0 0 0 15 4FD79227 00000000 ~~
Li TC01
Cd Bouton poussoir KSA
Kw SWITCH DEV
Sc 0
AR 
Op 0 0 0
T0 0 -2000 392 392 0 80 N V 21 N "TC01"
T1 0 2000 392 392 0 80 N I 21 N "Value"
DS -1900 -1500 -1900 1500 150 21
DS -1900 1500 1850 1500 150 21
DS 1850 1500 1850 -1500 150 21
DS 1850 -1500 -1900 -1500 150 21
DC 0 0 750 250 120 21
$PAD
Sh "1" R 700 700 0 0 0
Dr 393 0 0
At STD N 00E0FFFF
Ne 0 ""
Po 1350 -1000
$EndPAD
$PAD
Sh "2" C 700 700 0 0 0
Dr 392 0 0
At STD N 00E0FFFF
Ne 0 ""
Po 1350 1000
$EndPAD
$PAD
Sh "3" C 700 700 0 0 0
Dr 392 0 0
At STD N 00E0FFFF
Ne 0 ""
Po -1400 1000
$EndPAD
$PAD
Sh "4" C 700 700 0 0 0
Dr 392 0 0
At STD N 00E0FFFF
Ne 0 ""
Po -1400 -1000
$EndPAD
$SHAPE3D
Na "Switch/bot_tact_c1.wrl"
Sc 1.2 1.2 1.2
Of 0 0 0
Ro 0 0 0
$EndSHAPE3D
$EndMODULE TC01
$MODULE TC01B
Po 0 0 0 15 4FD794D3 00000000 ~~
Li TC01B
Sc 0
AR 
Op 0 0 0
T0 0 -2000 392 392 0 80 N V 21 N "TC01B"
T1 0 1750 393 393 0 80 N I 21 N "Value"
DC 0 -100 600 200 40 21
DS -1200 -1200 -1200 1100 40 21
DS -1200 1100 1200 1100 40 21
DS 1200 1100 1200 -1200 40 21
DS 1200 -1200 -1200 -1200 40 21
$PAD
Sh "1" C 1000 1000 0 0 0
Dr 450 0 0
At STD N 00E0FFFF
Ne 0 ""
Po -1400 -1000
$EndPAD
$PAD
Sh "2" C 1000 1000 0 0 0
Dr 450 0 0
At STD N 00E0FFFF
Ne 0 ""
Po 1350 -1000
$EndPAD
$PAD
Sh "3" C 1000 1000 0 0 0
Dr 450 0 0
At STD N 00E0FFFF
Ne 0 ""
Po -1400 800
$EndPAD
$PAD
Sh "4" C 1000 1000 0 0 0
Dr 450 0 0
At STD N 00E0FFFF
Ne 0 ""
Po 1400 800
$EndPAD
$SHAPE3D
Na "Switch/bot_tact_c1.wrl"
Sc 1.2 1.2 1.2
Of 0 0 0
Ro 0 0 0
$EndSHAPE3D
$EndMODULE TC01B
$MODULE TC02
Po 0 0 0 15 4FD7947C 00000000 ~~
Li TC02
Cd Resitance 3 pas
Kw R
Sc 0
AR 
Op 0 A 0
T0 0 -500 393 393 0 80 N V 21 N "TC02"
T1 0 2500 393 393 0 80 N I 21 N "Value"
DS -500 1900 600 1900 150 21
DS 600 1900 600 1500 150 21
DS -1300 1500 -1300 600 150 21
DS 1300 1500 1300 500 150 21
DS -1400 600 -1400 -100 150 21
DS 1400 600 1400 -100 150 21
DS -500 1500 -500 1900 150 21
DS 1300 500 -1300 500 120 21
DS -1300 1500 1300 1500 120 21
$PAD
Sh "A" O 629 1181 0 0 3150
Dr 354 0 0
At STD N 00F0FFFF
Ne 0 ""
Po -1500 0
$EndPAD
$PAD
Sh "B" O 629 1181 0 0 450
Dr 354 0 0
At STD N 00F0FFFF
Ne 0 ""
Po 1500 0
$EndPAD
$PAD
Sh "1" O 629 1181 0 0 3150
Dr 354 0 0
At STD N 00E0FFFF
Ne 0 ""
Po -1000 700
$EndPAD
$PAD
Sh "2" O 629 1181 0 0 450
Dr 354 0 0
At STD N 00E0FFFF
Ne 0 ""
Po 1000 700
$EndPAD
$SHAPE3D
Na "Switch/bot_tact_cv1.wrl"
Sc 1.2 1.2 1.2
Of 0 0 0
Ro 0 0 0
$EndSHAPE3D
$EndMODULE TC02
$MODULE bot_tac_c2
Po 0 0 0 15 4FD799BD 00000000 ~~
Li bot_tac_c2
Sc 0
AR 
Op 0 0 0
T0 0 -3500 393 393 0 78 N V 21 N "bot_tac_c2"
T1 2000 0 393 393 900 78 N I 21 N "Value"
DC 0 0 1400 100 150 21
DS -2400 -2500 2400 -2500 150 21
DS 2400 -2500 2400 2400 150 21
DS 2400 2400 -2400 2400 150 21
DS -2400 2400 -2400 -2500 150 21
$PAD
Sh "1" C 1181 1181 0 0 0
Dr 787 0 0
At STD N 00E0FFFF
Ne 0 ""
Po -1000 2400
$EndPAD
$PAD
Sh "2" C 1181 1181 0 0 0
Dr 787 0 0
At STD N 00E0FFFF
Ne 0 ""
Po 1000 2400
$EndPAD
$PAD
Sh "3" C 1181 1181 0 0 0
Dr 787 0 0
At STD N 00E0FFFF
Ne 0 ""
Po -1000 -2400
$EndPAD
$PAD
Sh "4" C 1181 1181 0 0 0
Dr 787 0 0
At STD N 00E0FFFF
Ne 0 ""
Po 1000 -2400
$EndPAD
$SHAPE3D
Na "Switch/bot_tact_c2.wrl"
Sc 1.5 1.5 1.5
Of 0 0 0
Ro 0 0 0
$EndSHAPE3D
$EndMODULE bot_tac_c2
$MODULE sw_push4p
Po 0 0 0 15 4FE1FC03 00000000 ~~
Li sw_push4p
Cd Botao de pressao - 4 pinos
Kw SWITCH DEV
Sc 0
AR 
Op 0 A 0
T0 0 -3000 393 393 0 78 N V 21 N "SW_PUSH4P"
T1 0 0 393 393 0 78 N I 21 N "Value"
DS 2500 -2250 2500 2250 80 21
DS 2500 2250 2250 2500 80 21
DS 2250 2500 -2250 2500 80 21
DS -2250 2500 -2500 2250 80 21
DS -2500 2250 -2500 -2250 80 21
DS -2250 -2500 2250 -2500 80 21
DS 2250 -2500 2500 -2250 80 21
DS -2500 -2250 -2250 -2500 80 21
$PAD
Sh "2" C 944 944 0 0 0
Dr 320 0 0
At STD N 00E0FFFF
Ne 0 ""
Po 1800 -1800
$EndPAD
$PAD
Sh "3" C 944 944 0 0 0
Dr 320 0 0
At STD N 00E0FFFF
Ne 0 ""
Po -1800 1800
$EndPAD
$PAD
Sh "4" C 944 944 0 0 0
Dr 320 0 0
At STD N 00E0FFFF
Ne 0 ""
Po 1800 1800
$EndPAD
$PAD
Sh "1" C 944 944 0 0 0
Dr 320 0 0
At STD N 00E0FFFF
Ne 0 ""
Po -1800 -1800
$EndPAD
$SHAPE3D
Na "Switch/switch_push4pins.wrl"
Sc 1 1 1
Of 0 0 0
Ro 0 0 0
$EndSHAPE3D
$EndMODULE sw_push4p
$EndLIBRARY
