PCBNEW-LibModule-V1  Ne 24. červen 2012, 09:37:51 CEST
# encoding utf-8
Units deci-mils
$INDEX
DF14-2P-1.25H
DF14-5P-1.25H
DF14-9P-1.25H
FCP_ZIF_18
MOLEX-52435-2672
MOLEX-52435-3072
SM CON26 0.5MM
$EndINDEX
$MODULE DF14-2P-1.25H
Po 0 0 0 15 4FD65337 00000000 ~~
Li DF14-2P-1.25H
Sc 0
AR 
Op 0 0 0
T0 0 -3250 393 393 0 78 N V 21 N "DF14-2P-1.25H"
T1 0 1600 393 393 0 78 N I 21 N "Value"
DS -1000 400 -700 700 60 21
DS -1200 500 -1000 700 60 21
DS -1500 500 -1300 700 60 21
DS 1500 -1000 1500 -500 60 21
DS 500 750 1500 750 60 21
DS 1500 750 1500 500 60 21
DS -1500 500 -1500 750 60 21
DS -1500 750 -500 750 60 21
DS -1500 -1000 -1500 -500 60 21
DS -1400 -2400 -1400 -2800 60 21
DS -1400 -2800 1400 -2800 60 21
DS 1400 -2800 1400 -2400 60 21
$PAD
Sh "1" R 275 709 0 0 0
Dr 0 0 0
At SMD N 00888000
Ne 0 ""
Po -260 440
$EndPAD
$PAD
Sh "2" R 275 709 0 0 0
Dr 0 0 0
At SMD N 00888000
Ne 0 ""
Po 260 440
$EndPAD
$PAD
Sh "3" R 787 1024 0 0 0
Dr 0 0 0
At SMD N 00888000
Ne 0 ""
Po -1192 -1697
$EndPAD
$PAD
Sh "4" R 787 1024 0 0 0
Dr 0 0 0
At SMD N 00888000
Ne 0 ""
Po 1192 -1697
$EndPAD
$PAD
Sh "" C 432 432 0 0 0
Dr 275 0 0
At HOLE N 00E0FFFF
Ne 0 ""
Po -1272 0
$EndPAD
$PAD
Sh "" C 432 432 0 0 0
Dr 275 0 0
At HOLE N 00E0FFFF
Ne 0 ""
Po 1272 0
$EndPAD
$EndMODULE DF14-2P-1.25H
$MODULE DF14-5P-1.25H
Po 0 0 0 15 4FD65390 00000000 ~~
Li DF14-5P-1.25H
Sc 0
AR 
Op 0 0 0
T0 0 -3400 393 393 0 78 N V 21 N "DF14-5P-1.25H"
T1 0 1600 393 393 0 78 N I 21 N "Value"
DS -1800 400 -1600 600 60 21
DS -1800 200 -1400 600 60 21
DS -2200 200 -1800 600 60 21
DS -2200 200 -2200 600 60 21
DS -2200 -1000 -2200 -200 60 21
DS -2200 400 -2000 600 60 21
DS 1400 600 2200 600 60 21
DS 2200 600 2200 -1000 60 21
DS -2200 600 -1400 600 60 21
DS -2200 -2400 -2200 -2800 60 21
DS -2200 -2800 2200 -2800 60 21
DS 2200 -2800 2200 -2400 60 21
$PAD
Sh "1" R 276 709 0 0 0
Dr 0 0 0
At SMD N 00888000
Ne 0 ""
Po -1000 440
$EndPAD
$PAD
Sh "2" R 276 709 0 0 0
Dr 0 0 0
At SMD N 00888000
Ne 0 ""
Po -500 440
$EndPAD
$PAD
Sh "8" R 787 1024 0 0 0
Dr 0 0 0
At SMD N 00888000
Ne 0 ""
Po -1940 -1700
$EndPAD
$PAD
Sh "9" R 787 1024 0 0 0
Dr 0 0 0
At SMD N 00888000
Ne 0 ""
Po 1940 -1700
$EndPAD
$PAD
Sh "3" R 276 709 0 0 0
Dr 0 0 0
At SMD N 00888000
Ne 0 ""
Po 0 440
$EndPAD
$PAD
Sh "4" R 276 709 0 0 0
Dr 0 0 0
At SMD N 00888000
Ne 0 ""
Po 500 440
$EndPAD
$PAD
Sh "5" R 276 709 0 0 0
Dr 0 0 0
At SMD N 00888000
Ne 0 ""
Po 1000 440
$EndPAD
$PAD
Sh "" C 432 432 0 0 0
Dr 275 0 0
At HOLE N 00E0FFFF
Ne 0 ""
Po -2007 0
$EndPAD
$PAD
Sh "" C 432 432 0 0 0
Dr 275 0 0
At HOLE N 00F0FFFF
Ne 0 ""
Po 2007 0
$EndPAD
$EndMODULE DF14-5P-1.25H
$MODULE DF14-9P-1.25H
Po 0 0 0 15 4FD653D4 00000000 ~~
Li DF14-9P-1.25H
Sc 0
AR 
Op 0 0 0
T0 0 -3400 393 393 0 78 N V 21 N "DF14-9P-1.25H"
T1 0 1600 393 393 0 78 N I 21 N "Value"
DS -3300 150 -3650 -200 60 21
DS -3500 200 -3650 50 60 21
DS 2300 600 2850 600 60 21
DS -2900 600 -2400 600 60 21
DS -3650 -200 -3650 200 60 21
DS 750 -2800 3650 -2800 60 21
DS -3300 150 -2900 550 60 21
DS -3500 200 -3100 600 60 21
DS -3650 200 -3650 600 60 21
DS -3650 -1000 -3650 -200 60 21
DS -3600 350 -3400 550 60 21
DS 2800 600 3600 600 60 21
DS 3650 600 3650 -1000 60 21
DS -3650 600 -2850 600 60 21
DS -3650 -2350 -3650 -2750 60 21
DS -3650 -2800 750 -2800 60 21
DS 3650 -2750 3650 -2350 60 21
$PAD
Sh "3" R 276 709 0 0 0
Dr 0 0 0
At SMD N 00888000
Ne 0 ""
Po -1000 440
$EndPAD
$PAD
Sh "4" R 276 709 0 0 0
Dr 0 0 0
At SMD N 00888000
Ne 0 ""
Po -500 440
$EndPAD
$PAD
Sh "" R 787 1024 0 0 0
Dr 0 0 0
At SMD N 00888000
Ne 0 ""
Po -3300 -1700
$EndPAD
$PAD
Sh "" R 787 1024 0 0 0
Dr 0 0 0
At SMD N 00888000
Ne 0 ""
Po 3300 -1700
$EndPAD
$PAD
Sh "5" R 276 709 0 0 0
Dr 0 0 0
At SMD N 00888000
Ne 0 ""
Po 0 440
$EndPAD
$PAD
Sh "6" R 276 709 0 0 0
Dr 0 0 0
At SMD N 00888000
Ne 0 ""
Po 500 440
$EndPAD
$PAD
Sh "7" R 276 709 0 0 0
Dr 0 0 0
At SMD N 00888000
Ne 0 ""
Po 1000 440
$EndPAD
$PAD
Sh "" C 432 432 0 0 0
Dr 275 0 0
At HOLE N 00F0FFFF
Ne 0 ""
Po -3000 0
$EndPAD
$PAD
Sh "" C 432 432 0 0 0
Dr 275 0 0
At HOLE N 00F0FFFF
Ne 0 ""
Po 3000 0
$EndPAD
$PAD
Sh "2" R 276 709 0 0 0
Dr 0 0 0
At SMD N 00888000
Ne 0 ""
Po -1500 440
$EndPAD
$PAD
Sh "1" R 276 709 0 0 0
Dr 0 0 0
At SMD N 00888000
Ne 0 ""
Po -2010 440
$EndPAD
$PAD
Sh "8" R 276 709 0 0 0
Dr 0 0 0
At SMD N 00888000
Ne 0 ""
Po 1500 440
$EndPAD
$PAD
Sh "9" R 276 709 0 0 0
Dr 0 0 0
At SMD N 00888000
Ne 0 ""
Po 2000 440
$EndPAD
$EndMODULE DF14-9P-1.25H
$MODULE FCP_ZIF_18
Po 0 0 0 15 4FD7729A 00000000 ~~
Li FCP_ZIF_18
Sc 0
AR 
Op 0 0 0
T0 0 -1250 393 393 0 78 N V 21 N "FCP_ZIF_18"
T1 0 1000 393 393 0 78 N I 21 N "Value"
DS -3465 2441 -3740 2047 150 21
DS -3740 2047 -3189 2047 150 21
DS -3189 2047 -3465 2441 150 21
DS 4685 1693 -4685 1693 150 21
DS 3346 4331 2402 4803 150 21
DS 2402 4803 1614 4528 150 21
DS 1614 4528 315 5039 150 21
DS 315 5039 -591 4606 150 21
DS -591 4606 -1496 4961 150 21
DS -1496 4961 -2559 4488 150 21
DS -2559 4488 -3425 4803 150 21
DS -3425 4803 -3740 4055 150 21
DS 3346 2835 3346 4331 150 21
DS -3740 2835 -3740 4016 150 21
DS 3346 0 4685 0 150 21
DS 4685 0 4685 2835 150 21
DS 4685 2835 -4685 2835 150 21
DS -4685 2835 -4685 0 150 21
DS -4685 0 3346 0 150 21
$PAD
Sh "1" R 236 750 0 0 0
Dr 0 0 0
At CONN N 00808000
Ne 0 ""
Po -3346 -394
$EndPAD
$PAD
Sh "2" R 236 750 0 0 0
Dr 0 0 0
At CONN N 00808000
Ne 0 ""
Po -2953 -394
$EndPAD
$PAD
Sh "3" R 236 750 0 0 0
Dr 0 0 0
At CONN N 00808000
Ne 0 ""
Po -2559 -394
$EndPAD
$PAD
Sh "4" R 236 750 0 0 0
Dr 0 0 0
At CONN N 00808000
Ne 0 ""
Po -2165 -394
$EndPAD
$PAD
Sh "5" R 236 750 0 0 0
Dr 0 0 0
At CONN N 00808000
Ne 0 ""
Po -1772 -394
$EndPAD
$PAD
Sh "6" R 236 750 0 0 0
Dr 0 0 0
At CONN N 00808000
Ne 0 ""
Po -1378 -394
$EndPAD
$PAD
Sh "7" R 236 750 0 0 0
Dr 0 0 0
At CONN N 00808000
Ne 0 ""
Po -984 -394
$EndPAD
$PAD
Sh "8" R 236 750 0 0 0
Dr 0 0 0
At CONN N 00808000
Ne 0 ""
Po -591 -394
$EndPAD
$PAD
Sh "9" R 236 750 0 0 0
Dr 0 0 0
At CONN N 00808000
Ne 0 ""
Po -197 -394
$EndPAD
$PAD
Sh "10" R 236 750 0 0 0
Dr 0 0 0
At CONN N 00808000
Ne 0 ""
Po 197 -394
$EndPAD
$PAD
Sh "11" R 236 750 0 0 0
Dr 0 0 0
At CONN N 00808000
Ne 0 ""
Po 591 -394
$EndPAD
$PAD
Sh "12" R 236 750 0 0 0
Dr 0 0 0
At CONN N 00808000
Ne 0 ""
Po 984 -394
$EndPAD
$PAD
Sh "13" R 236 750 0 0 0
Dr 0 0 0
At CONN N 00808000
Ne 0 ""
Po 1378 -394
$EndPAD
$PAD
Sh "14" R 236 750 0 0 0
Dr 0 0 0
At CONN N 00808000
Ne 0 ""
Po 1772 -394
$EndPAD
$PAD
Sh "15" R 236 750 0 0 0
Dr 0 0 0
At CONN N 00808000
Ne 0 ""
Po 2165 -394
$EndPAD
$PAD
Sh "16" R 236 750 0 0 0
Dr 0 0 0
At CONN N 00808000
Ne 0 ""
Po 2559 -394
$EndPAD
$PAD
Sh "17" R 236 750 0 0 0
Dr 0 0 0
At CONN N 00808000
Ne 0 ""
Po 2953 -394
$EndPAD
$PAD
Sh "18" R 236 750 0 0 0
Dr 0 0 0
At CONN N 00808000
Ne 0 ""
Po 3346 -394
$EndPAD
$PAD
Sh "0" R 827 1102 0 0 0
Dr 0 0 0
At CONN N 00808000
Ne 0 ""
Po 4685 551
$EndPAD
$PAD
Sh "0" R 827 1102 0 0 0
Dr 0 0 0
At CONN N 00808000
Ne 0 ""
Po -4685 551
$EndPAD
$SHAPE3D
Na "connectors/FPC/fpc_conn_zif_smt_18.wrl"
Sc 0.393701 0.393701 0.393701
Of 0 -0.015748 0
Ro -90 0 0
$EndSHAPE3D
$EndMODULE FCP_ZIF_18
$MODULE MOLEX-52435-2672
Po 0 0 0 15 4FE6C154 00000000 ~~
Li MOLEX-52435-2672
Sc 0
AR 
Op 0 0 0
T0 0 -1870 393 393 0 78 N V 21 N "MOLEX-52435-2672"
T1 0 117 392 392 0 77 N I 21 N "Value"
DS 3869 789 -3411 789 70 21
DS 3479 354 3479 789 70 21
DS 3479 789 3869 789 70 21
DS 3869 789 3869 1339 70 21
DS 3869 1339 -3881 1339 70 21
DS -3881 1339 -3881 789 70 21
DS -3881 789 -3411 789 70 21
DS -3410 789 -3410 354 70 21
DS 2749 -781 -2781 -781 70 21
DS -3921 -1041 -2941 -1041 10 23
DS -2941 -1041 -2941 49 10 23
DS -2941 49 -3411 49 10 23
DS -3411 49 -3411 -291 10 23
DS -3411 -291 -3921 -291 10 23
DS -3921 -291 -3921 -1041 10 23
$PAD
Sh "1" O 100 380 0 0 0
Dr 0 0 0
At STD N 04808000
Ne 0 ""
Po -2461 -1181
$EndPAD
$PAD
Sh "2" O 100 380 0 0 0
Dr 0 0 0
At STD N 04808000
Ne 0 ""
Po -2271 -1181
$EndPAD
$PAD
Sh "3" O 100 380 0 0 0
Dr 0 0 0
At STD N 04808000
Ne 0 ""
Po -2071 -1181
$EndPAD
$PAD
Sh "4" O 100 380 0 0 0
Dr 0 0 0
At STD N 04808000
Ne 0 ""
Po -1871 -1181
$EndPAD
$PAD
Sh "5" O 100 380 0 0 0
Dr 0 0 0
At STD N 04808000
Ne 0 ""
Po -1681 -1181
$EndPAD
$PAD
Sh "6" O 100 380 0 0 0
Dr 0 0 0
At STD N 04808000
Ne 0 ""
Po -1481 -1181
$EndPAD
$PAD
Sh "7" O 100 380 0 0 0
Dr 0 0 0
At STD N 04808000
Ne 0 ""
Po -1281 -1181
$EndPAD
$PAD
Sh "8" O 100 380 0 0 0
Dr 0 0 0
At STD N 04808000
Ne 0 ""
Po -1091 -1181
$EndPAD
$PAD
Sh "9" O 100 380 0 0 0
Dr 0 0 0
At STD N 04808000
Ne 0 ""
Po -891 -1181
$EndPAD
$PAD
Sh "10" O 100 380 0 0 0
Dr 0 0 0
At STD N 04808000
Ne 0 ""
Po -691 -1181
$EndPAD
$PAD
Sh "11" O 100 380 0 0 0
Dr 0 0 0
At STD N 04808000
Ne 0 ""
Po -501 -1181
$EndPAD
$PAD
Sh "12" O 100 380 0 0 0
Dr 0 0 0
At STD N 04808000
Ne 0 ""
Po -301 -1181
$EndPAD
$PAD
Sh "13" O 100 380 0 0 0
Dr 0 0 0
At STD N 04808000
Ne 0 ""
Po -101 -1181
$EndPAD
$PAD
Sh "14" O 100 380 0 0 0
Dr 0 0 0
At STD N 04808000
Ne 0 ""
Po 89 -1181
$EndPAD
$PAD
Sh "15" O 100 380 0 0 0
Dr 0 0 0
At STD N 04808000
Ne 0 ""
Po 289 -1181
$EndPAD
$PAD
Sh "16" O 100 380 0 0 0
Dr 0 0 0
At STD N 04808000
Ne 0 ""
Po 489 -1181
$EndPAD
$PAD
Sh "17" O 100 380 0 0 0
Dr 0 0 0
At STD N 04808000
Ne 0 ""
Po 679 -1181
$EndPAD
$PAD
Sh "18" O 100 380 0 0 0
Dr 0 0 0
At STD N 04808000
Ne 0 ""
Po 879 -1181
$EndPAD
$PAD
Sh "19" O 100 380 0 0 0
Dr 0 0 0
At STD N 04808000
Ne 0 ""
Po 1079 -1181
$EndPAD
$PAD
Sh "20" O 100 380 0 0 0
Dr 0 0 0
At STD N 04808000
Ne 0 ""
Po 1279 -1181
$EndPAD
$PAD
Sh "21" O 100 380 0 0 0
Dr 0 0 0
At STD N 04808000
Ne 0 ""
Po 1469 -1181
$EndPAD
$PAD
Sh "22" O 100 380 0 0 0
Dr 0 0 0
At STD N 04808000
Ne 0 ""
Po 1669 -1181
$EndPAD
$PAD
Sh "23" O 100 380 0 0 0
Dr 0 0 0
At STD N 04808000
Ne 0 ""
Po 1869 -1181
$EndPAD
$PAD
Sh "24" O 100 380 0 0 0
Dr 0 0 0
At STD N 04808000
Ne 0 ""
Po 2059 -1181
$EndPAD
$PAD
Sh "25" O 100 380 0 0 0
Dr 0 0 0
At STD N 04808000
Ne 0 ""
Po 2259 -1181
$EndPAD
$PAD
Sh "26" O 100 380 0 0 0
Dr 0 0 0
At STD N 04808000
Ne 0 ""
Po 2459 -1181
$EndPAD
$PAD
Sh "SH1" R 944 865 0 0 0
Dr 0 0 0
At SMD N 00888000
Ne 0 ""
Po -3425 -591
$EndPAD
$PAD
Sh "SH1" R 510 334 0 0 0
Dr 0 0 0
At SMD N 00888000
Ne 0 ""
Po -3207 9
$EndPAD
$PAD
Sh "SH2" R 944 865 0 0 0
Dr 0 0 0
At SMD N 00888000
Ne 0 ""
Po 3425 -590
$EndPAD
$PAD
Sh "SH2" R 510 334 0 0 0
Dr 0 0 0
At SMD N 00888000
Ne 0 ""
Po 3207 9
$EndPAD
$EndMODULE MOLEX-52435-2672
$MODULE MOLEX-52435-3072
Po 0 0 0 15 4FE6C3BF 00000000 ~~
Li MOLEX-52435-3072
Sc 0
AR 
Op 0 0 0
.LocalClearance 78
T0 0 -1772 393 393 0 78 N V 21 N "MOLEX-52435-3072"
T1 0 0 392 392 0 77 N I 21 N "Value"
DS -3804 789 3836 789 70 21
DS 3835 354 3835 789 70 21
DS 3836 789 4226 789 70 21
DS 4226 789 4226 1339 70 21
DS 4226 1339 -4274 1339 70 21
DS -4274 1339 -4274 789 70 21
DS -4274 789 -3804 789 70 21
DS -3804 789 -3804 354 70 21
DS -3174 -781 3206 -781 70 21
DS 3326 -1041 3326 49 10 23
$PAD
Sh "1" O 100 380 0 0 0
Dr 0 0 0
At STD N 04808000
Ne 0 ""
Po -2854 -1181
$EndPAD
$PAD
Sh "2" O 100 380 0 0 0
Dr 0 0 0
At STD N 04808000
Ne 0 ""
Po -2664 -1181
$EndPAD
$PAD
Sh "3" O 100 380 0 0 0
Dr 0 0 0
At STD N 04808000
Ne 0 ""
Po -2464 -1181
$EndPAD
$PAD
Sh "4" O 100 380 0 0 0
Dr 0 0 0
At STD N 04808000
Ne 0 ""
Po -2264 -1181
$EndPAD
$PAD
Sh "5" O 100 380 0 0 0
Dr 0 0 0
At STD N 04808000
Ne 0 ""
Po -2074 -1181
$EndPAD
$PAD
Sh "6" O 100 380 0 0 0
Dr 0 0 0
At STD N 04808000
Ne 0 ""
Po -1874 -1181
$EndPAD
$PAD
Sh "7" O 100 380 0 0 0
Dr 0 0 0
At STD N 04808000
Ne 0 ""
Po -1674 -1181
$EndPAD
$PAD
Sh "8" O 100 380 0 0 0
Dr 0 0 0
At STD N 04808000
Ne 0 ""
Po -1484 -1181
$EndPAD
$PAD
Sh "9" O 100 380 0 0 0
Dr 0 0 0
At STD N 04808000
Ne 0 ""
Po -1284 -1181
$EndPAD
$PAD
Sh "10" O 100 380 0 0 0
Dr 0 0 0
At STD N 04808000
Ne 0 ""
Po -1084 -1181
$EndPAD
$PAD
Sh "11" O 100 380 0 0 0
Dr 0 0 0
At STD N 04808000
Ne 0 ""
Po -894 -1181
$EndPAD
$PAD
Sh "12" O 100 380 0 0 0
Dr 0 0 0
At STD N 04808000
Ne 0 ""
Po -694 -1181
$EndPAD
$PAD
Sh "13" O 100 380 0 0 0
Dr 0 0 0
At STD N 04808000
Ne 0 ""
Po -494 -1181
$EndPAD
$PAD
Sh "14" O 100 380 0 0 0
Dr 0 0 0
At STD N 04808000
Ne 0 ""
Po -304 -1181
$EndPAD
$PAD
Sh "15" O 100 380 0 0 0
Dr 0 0 0
At STD N 04808000
Ne 0 ""
Po -104 -1181
$EndPAD
$PAD
Sh "16" O 100 380 0 0 0
Dr 0 0 0
At STD N 04808000
Ne 0 ""
Po 96 -1181
$EndPAD
$PAD
Sh "17" O 100 380 0 0 0
Dr 0 0 0
At STD N 04808000
Ne 0 ""
Po 286 -1181
$EndPAD
$PAD
Sh "18" O 100 380 0 0 0
Dr 0 0 0
At STD N 04808000
Ne 0 ""
Po 486 -1181
$EndPAD
$PAD
Sh "19" O 100 380 0 0 0
Dr 0 0 0
At STD N 04808000
Ne 0 ""
Po 686 -1181
$EndPAD
$PAD
Sh "20" O 100 380 0 0 0
Dr 0 0 0
At STD N 04808000
Ne 0 ""
Po 886 -1181
$EndPAD
$PAD
Sh "21" O 100 380 0 0 0
Dr 0 0 0
At STD N 04808000
Ne 0 ""
Po 1076 -1181
$EndPAD
$PAD
Sh "22" O 100 380 0 0 0
Dr 0 0 0
At STD N 04808000
Ne 0 ""
Po 1276 -1181
$EndPAD
$PAD
Sh "23" O 100 380 0 0 0
Dr 0 0 0
At STD N 04808000
Ne 0 ""
Po 1476 -1181
$EndPAD
$PAD
Sh "24" O 100 380 0 0 0
Dr 0 0 0
At STD N 04808000
Ne 0 ""
Po 1666 -1181
$EndPAD
$PAD
Sh "25" O 100 380 0 0 0
Dr 0 0 0
At STD N 04808000
Ne 0 ""
Po 1866 -1181
$EndPAD
$PAD
Sh "26" O 100 380 0 0 0
Dr 0 0 0
At STD N 04808000
Ne 0 ""
Po 2066 -1181
$EndPAD
$PAD
Sh "27" O 100 380 0 0 0
Dr 0 0 0
At STD N 04808000
Ne 0 ""
Po 2256 -1181
$EndPAD
$PAD
Sh "28" O 100 380 0 0 0
Dr 0 0 0
At STD N 04808000
Ne 0 ""
Po 2456 -1181
$EndPAD
$PAD
Sh "29" O 100 380 0 0 0
Dr 0 0 0
At STD N 04808000
Ne 0 ""
Po 2656 -1181
$EndPAD
$PAD
Sh "30" O 100 380 0 0 0
Dr 0 0 0
At STD N 04808000
Ne 0 ""
Po 2846 -1181
$EndPAD
$PAD
Sh "SH1" R 510 334 0 0 0
Dr 0 0 0
At SMD N 00888000
Ne 0 ""
Po -3600 9
$EndPAD
$PAD
Sh "SH2" R 510 334 0 0 0
Dr 0 0 0
At SMD N 00888000
Ne 0 ""
Po 3602 9
$EndPAD
$PAD
Sh "SH1" R 944 866 0 0 0
Dr 0 0 0
At SMD N 00888000
Ne 0 ""
Po -3818 -590
$EndPAD
$PAD
Sh "SH2" R 944 865 0 0 0
Dr 0 0 0
At SMD N 00888000
Ne 0 ""
Po 3818 -590
$EndPAD
$EndMODULE MOLEX-52435-3072
$MODULE SM CON26 0.5MM
Po 0 0 0 15 4FE6C1F4 00000000 ~~
Li SM CON26 0.5MM
Sc 0
AR 
Op 0 0 0
.LocalClearance 77
T0 0 -1476 393 393 0 78 N V 21 N "SM CON26 0.5MM"
T1 0 117 392 392 0 77 N I 21 N "Value"
DS 2459 894 2459 1084 110 21
DS 2459 1084 2849 1084 110 21
DS 2849 1084 2849 894 110 21
DS 2849 894 3239 894 110 21
DS 3239 894 3239 1084 110 21
DS 3239 1084 3639 1084 110 21
DS 3639 1084 3639 1384 110 21
DS 3639 1384 3539 1484 110 21
DS 3539 1484 -3551 1484 110 21
DS -3551 1484 -3651 1384 110 21
DS -3651 1384 -3651 1084 110 21
DS -3651 1084 -3251 1084 110 21
DS -3251 1084 -3251 894 110 21
DS -3251 894 -2861 894 110 21
DS -2861 894 -2861 1084 110 21
DS -2861 1084 -2461 1084 110 21
DS -2461 1084 -2461 894 110 21
DS -2461 -486 -2461 694 110 21
DS -2461 694 2459 694 110 21
DS 2459 694 2459 -486 110 21
DS 2459 -486 -2461 -486 110 21
$PAD
Sh "1" R 80 380 0 0 0
Dr 0 0 0
At STD N 00808000
Ne 0 ""
Po -2461 -886
$EndPAD
$PAD
Sh "2" R 80 380 0 0 0
Dr 0 0 0
At STD N 00808000
Ne 0 ""
Po -2271 -886
$EndPAD
$PAD
Sh "3" R 80 380 0 0 0
Dr 0 0 0
At STD N 00808000
Ne 0 ""
Po -2071 -886
$EndPAD
$PAD
Sh "4" R 80 380 0 0 0
Dr 0 0 0
At STD N 00808000
Ne 0 ""
Po -1871 -886
$EndPAD
$PAD
Sh "5" R 80 380 0 0 0
Dr 0 0 0
At STD N 00808000
Ne 0 ""
Po -1681 -886
$EndPAD
$PAD
Sh "6" R 80 380 0 0 0
Dr 0 0 0
At STD N 00808000
Ne 0 ""
Po -1481 -886
$EndPAD
$PAD
Sh "7" R 80 380 0 0 0
Dr 0 0 0
At STD N 00808000
Ne 0 ""
Po -1281 -886
$EndPAD
$PAD
Sh "8" R 80 380 0 0 0
Dr 0 0 0
At STD N 00808000
Ne 0 ""
Po -1091 -886
$EndPAD
$PAD
Sh "9" R 80 380 0 0 0
Dr 0 0 0
At STD N 00808000
Ne 0 ""
Po -891 -886
$EndPAD
$PAD
Sh "10" R 80 380 0 0 0
Dr 0 0 0
At STD N 00808000
Ne 0 ""
Po -691 -886
$EndPAD
$PAD
Sh "11" R 80 380 0 0 0
Dr 0 0 0
At STD N 00808000
Ne 0 ""
Po -501 -886
$EndPAD
$PAD
Sh "12" R 80 380 0 0 0
Dr 0 0 0
At STD N 00808000
Ne 0 ""
Po -301 -886
$EndPAD
$PAD
Sh "13" R 80 380 0 0 0
Dr 0 0 0
At STD N 00808000
Ne 0 ""
Po -101 -886
$EndPAD
$PAD
Sh "14" R 80 380 0 0 0
Dr 0 0 0
At STD N 00808000
Ne 0 ""
Po 89 -886
$EndPAD
$PAD
Sh "15" R 80 380 0 0 0
Dr 0 0 0
At STD N 00808000
Ne 0 ""
Po 289 -886
$EndPAD
$PAD
Sh "16" R 80 380 0 0 0
Dr 0 0 0
At STD N 00808000
Ne 0 ""
Po 489 -886
$EndPAD
$PAD
Sh "17" R 80 380 0 0 0
Dr 0 0 0
At STD N 00808000
Ne 0 ""
Po 679 -886
$EndPAD
$PAD
Sh "18" R 80 380 0 0 0
Dr 0 0 0
At STD N 00808000
Ne 0 ""
Po 879 -886
$EndPAD
$PAD
Sh "19" R 80 380 0 0 0
Dr 0 0 0
At STD N 00808000
Ne 0 ""
Po 1079 -886
$EndPAD
$PAD
Sh "20" R 80 380 0 0 0
Dr 0 0 0
At STD N 00808000
Ne 0 ""
Po 1279 -886
$EndPAD
$PAD
Sh "21" R 80 380 0 0 0
Dr 0 0 0
At STD N 00808000
Ne 0 ""
Po 1469 -886
$EndPAD
$PAD
Sh "22" R 80 380 0 0 0
Dr 0 0 0
At STD N 00808000
Ne 0 ""
Po 1669 -886
$EndPAD
$PAD
Sh "23" R 80 380 0 0 0
Dr 0 0 0
At STD N 00808000
Ne 0 ""
Po 1869 -886
$EndPAD
$PAD
Sh "24" R 80 380 0 0 0
Dr 0 0 0
At STD N 00808000
Ne 0 ""
Po 2059 -886
$EndPAD
$PAD
Sh "25" R 80 380 0 0 0
Dr 0 0 0
At STD N 00808000
Ne 0 ""
Po 2259 -886
$EndPAD
$PAD
Sh "26" R 80 380 0 0 0
Dr 0 0 0
At STD N 00808000
Ne 0 ""
Po 2459 -886
$EndPAD
$PAD
Sh "S1" R 1180 1360 0 0 0
Dr 0 0 0
At STD N 00808000
Ne 0 ""
Po -3251 4
$EndPAD
$PAD
Sh "S2" R 1180 1360 0 0 0
Dr 0 0 0
At STD N 00808000
Ne 0 ""
Po 3239 4
$EndPAD
$EndMODULE SM CON26 0.5MM
$EndLIBRARY
