PCBNEW-LibModule-V1  Ne 24. červen 2012, 17:19:28 CEST
# encoding utf-8
Units deci-mils
$INDEX
C2H13
C2V13
SuperCap-0.1F/5.5V
$EndINDEX
$MODULE C2H13
Po 0 0 0 15 4FAFCEE0 48A9514F ~~
Li C2H13
Kw CP
Sc 48A9514F
AR 
Op 0 0 0
T0 -3051 6398 500 500 900 100 N V 21 N "C2H13"
T1 -492 6496 500 500 900 100 N I 21 N "C***"
T2 984 6496 600 600 900 120 N I 21 N "(13x21)"
DS -1000 500 -1000 2000 150 21
DS 1000 500 1000 2000 150 21
DS 2550 2000 2600 2000 150 21
DS 2600 2000 2600 10300 150 21
DS 2600 10300 -2600 10300 150 21
DS -2600 10300 -2600 2000 150 21
DS -2600 2000 -2350 2000 150 21
DS -2550 2000 2550 2000 150 21
$PAD
Sh "1" R 700 700 0 0 0
Dr 400 0 0
At STD N 00E0FFFF
Ne 0 ""
Po -1000 0
$EndPAD
$PAD
Sh "2" C 700 700 0 0 0
Dr 400 0 0
At STD N 00E0FFFF
Ne 0 ""
Po 1000 0
$EndPAD
$SHAPE3D
Na "Capacitor\\c_hor_c2v13.wrl"
Sc 1 1 1
Of 0 0 0
Ro 0 0 0
$EndSHAPE3D
$EndMODULE C2H13
$MODULE C2V13
Po 0 0 0 15 4FAFCFA3 00000000 ~~
Li C2V13
Cd Condensateur polarise
Kw CP
Sc 0
AR 
Op 0 0 0
T0 0 -3051 500 500 0 100 N V 21 N "C2V13"
T1 0 -1000 500 500 0 100 N I 21 N "C***"
DC 0 0 2560 0 150 21
$PAD
Sh "1" R 700 700 0 0 0
Dr 400 0 0
At STD N 00E0FFFF
Ne 0 ""
Po -1000 0
$EndPAD
$PAD
Sh "2" C 700 700 0 0 0
Dr 400 0 0
At STD N 00E0FFFF
Ne 0 ""
Po 1000 0
$EndPAD
$SHAPE3D
Na "Capacitor\\c_vert_c2v13.wrl"
Sc 1 1 1
Of 0 0 0
Ro 0 0 0
$EndSHAPE3D
$EndMODULE C2V13
$MODULE SuperCap-0.1F/5.5V
Po 0 0 0 15 4FE72FEB 00000000 ~~
Li SuperCap-0.1F/5.5V
Sc 0
AR 
Op 0 0 0
T0 0 -3000 393 393 0 78 N V 21 N "SuperCap-0.1F/5.5V"
T1 0 1300 393 393 0 78 N I 21 N "Value"
DC 0 0 2500 0 150 21
$PAD
Sh "1" R 984 984 0 0 0
Dr 590 0 0
At STD N 00E0FFFF
Ne 0 ""
Po -1000 0
$EndPAD
$PAD
Sh "2" C 984 984 0 0 0
Dr 590 0 0
At STD N 00E0FFFF
Ne 0 ""
Po 1000 0
$EndPAD
$EndMODULE SuperCap-0.1F/5.5V
$EndLIBRARY
