PCBNEW-LibModule-V1  Ne 14. říjen 2012, 10:27:24 CEST
# encoding utf-8
Units deci-mils
$INDEX
Multiwatt11
SC64
SOT186
SOT32
SOT32-LAYING
SOT93
SOT93B
SOT93C
TO126
TO126B
TO220
TO220-5
TO220-5/L875
TO220AA/L875
TO220AA/L975
TO220AA/RF2
TO220AB
TO220AB/VF1
TO220AC
$EndINDEX
$MODULE Multiwatt11
Po 0 0 0 15 4FDA3694 00000000 ~~
Li Multiwatt11
Cd Multiwatt11
Kw Multiwatt11 L6203
Sc 0
AR 
Op 0 0 0
T0 0 -3250 392 392 0 77 N V 21 N "Multiwatt11"
T1 0 0 393 393 0 78 N I 21 N "Value"
DS -4000 -2000 4000 -2000 150 21
DS -4000 1500 -4000 -2700 150 21
DS 4000 -2700 4000 1500 150 21
DS 4000 -2700 -4000 -2700 150 21
DS -4000 1500 4000 1500 150 21
$PAD
Sh "1" R 600 600 0 0 0
Dr 400 0 0
At STD N 00E0FFFF
Ne 0 ""
Po -3346 1000
$EndPAD
$PAD
Sh "3" C 600 600 0 0 0
Dr 400 0 0
At STD N 00E0FFFF
Ne 0 ""
Po -2008 1000
$EndPAD
$PAD
Sh "5" C 600 600 0 0 0
Dr 400 0 0
At STD N 00E0FFFF
Ne 0 ""
Po -669 1000
$EndPAD
$PAD
Sh "7" C 600 600 0 0 0
Dr 400 0 0
At STD N 00E0FFFF
Ne 0 ""
Po 669 1000
$EndPAD
$PAD
Sh "9" C 600 600 0 0 0
Dr 400 0 0
At STD N 00E0FFFF
Ne 0 ""
Po 2008 1000
$EndPAD
$PAD
Sh "11" C 600 600 0 0 0
Dr 400 0 0
At STD N 00E0FFFF
Ne 0 ""
Po 3346 1000
$EndPAD
$PAD
Sh "2" C 600 600 0 0 0
Dr 400 0 0
At STD N 00E0FFFF
Ne 0 ""
Po -2677 -1000
$EndPAD
$PAD
Sh "4" C 600 600 0 0 0
Dr 400 0 0
At STD N 00E0FFFF
Ne 0 ""
Po -1339 -1000
$EndPAD
$PAD
Sh "6" C 600 600 0 0 0
Dr 400 0 0
At STD N 00E0FFFF
Ne 0 ""
Po 0 -1000
$EndPAD
$PAD
Sh "8" C 600 600 0 0 0
Dr 400 0 0
At STD N 00E0FFFF
Ne 0 ""
Po 1339 -1000
$EndPAD
$PAD
Sh "10" C 600 600 0 0 0
Dr 400 0 0
At STD N 00E0FFFF
Ne 0 ""
Po 2500 -1000
$EndPAD
$EndMODULE Multiwatt11
$MODULE SC64
Po 0 0 0 15 507A6B82 00000000 ~~
Li SC64
Sc 0
AR 
Op 0 0 0
T0 0 -800 394 394 0 79 N V 21 N "SC64"
T1 0 900 394 394 0 79 N I 21 N "Value"
DS 1490 -390 -1570 -390 30 21
DS -1530 520 -1610 -510 30 21
DS -1610 -510 1530 -510 30 21
DS 1530 -510 1460 520 30 21
DS 1460 520 -1530 520 30 21
$PAD
Sh "1" R 591 591 0 0 0
Dr 354 0 0
At STD N 00E0FFFF
Ne 0 ""
Po -900 0
$EndPAD
$PAD
Sh "2" C 591 591 0 0 0
Dr 354 0 0
At STD N 00E0FFFF
Ne 0 ""
Po 0 0
$EndPAD
$PAD
Sh "3" C 591 591 0 0 0
Dr 354 0 0
At STD N 00E0FFFF
Ne 0 ""
Po 910 0
$EndPAD
$EndMODULE SC64
$MODULE SOT186
Po 0 0 0 15 507A6BDF 00000000 ~~
Li SOT186
Sc 0
AR 
Op 0 0 0
T0 0 -800 394 394 0 79 N V 21 N "SOT186"
T1 0 900 394 394 0 79 N I 21 N "Value"
DS -1960 -480 1970 -480 30 21
DS 1970 -480 1970 1170 30 21
DS 1970 1170 -1960 1170 30 21
DS -1960 1170 -1960 -480 30 21
$PAD
Sh "1" R 630 630 0 0 0
Dr 394 0 0
At STD N 00E0FFFF
Ne 0 ""
Po -1000 0
$EndPAD
$PAD
Sh "2" C 630 630 0 0 0
Dr 394 0 0
At STD N 00E0FFFF
Ne 0 ""
Po 0 0
$EndPAD
$PAD
Sh "3" C 630 630 0 0 0
Dr 394 0 0
At STD N 00E0FFFF
Ne 0 ""
Po 1000 0
$EndPAD
$EndMODULE SOT186
$MODULE SOT32
Po 0 0 0 15 507A6C2C 00000000 ~~
Li SOT32
Sc 0
AR 
Op 0 0 0
T0 0 -900 394 394 0 79 N V 21 N "SOT32"
T1 0 900 394 394 0 79 N I 21 N "Value"
DS -1400 -500 -1400 500 80 21
DS -1400 500 1400 500 80 21
DS 1400 500 1400 -500 80 21
DS 1400 -500 -1400 -500 80 21
$PAD
Sh "1" R 669 669 0 0 0
Dr 433 0 0
At STD N 00E0FFFF
Ne 0 ""
Po -900 0
$EndPAD
$PAD
Sh "2" C 669 669 0 0 0
Dr 433 0 0
At STD N 00E0FFFF
Ne 0 ""
Po 0 0
$EndPAD
$PAD
Sh "3" C 669 669 0 0 0
Dr 433 0 0
At STD N 00E0FFFF
Ne 0 ""
Po 900 0
$EndPAD
$EndMODULE SOT32
$MODULE SOT32-LAYING
Po 0 0 0 15 507A6D2F 00000000 ~~
Li SOT32-LAYING
Sc 0
AR 
Op 0 0 0
T0 -1800 -4700 394 394 900 79 N V 21 N "SOT32-LAYING"
T1 1900 -4800 394 394 900 79 N I 21 N "Value"
DC 0 -5350 -200 -5950 80 21
DS 750 -500 750 -1450 80 21
DS 750 -1450 600 -1450 80 21
DS 600 -1450 600 -1950 80 21
DS 600 -1950 750 -1950 80 21
DS 750 -1950 750 -2450 80 21
DS 750 -2450 1050 -2450 80 21
DS 1050 -2450 1050 -1950 80 21
DS 1050 -1950 1200 -1950 80 21
DS 1200 -1950 1200 -1450 80 21
DS 1200 -1450 1050 -1450 80 21
DS 1050 -1450 1050 -500 80 21
DS 1050 -500 750 -500 80 21
DS -150 -500 -150 -1450 80 21
DS -150 -1450 -350 -1450 80 21
DS -350 -1450 -350 -1950 80 21
DS -350 -1950 -200 -1950 80 21
DS -200 -1950 -200 -2450 80 21
DS -200 -2450 200 -2450 80 21
DS 200 -2450 200 -1950 80 21
DS 200 -1950 350 -1950 80 21
DS 350 -1950 350 -1450 80 21
DS 350 -1450 150 -1450 80 21
DS 150 -1450 150 -500 80 21
DS 150 -500 -150 -500 80 21
DS -1050 -500 -1050 -1450 80 21
DS -1050 -1450 -1200 -1450 80 21
DS -1200 -1450 -1200 -1950 80 21
DS -1200 -1950 -1050 -1950 80 21
DS -1050 -1950 -1050 -2450 80 21
DS -1050 -2450 -750 -2450 80 21
DS -750 -2450 -750 -1950 80 21
DS -750 -1950 -600 -1950 80 21
DS -600 -1950 -600 -1450 80 21
DS -600 -1450 -750 -1450 80 21
DS -750 -1450 -750 -500 80 21
DS -750 -500 -1050 -500 80 21
DS -1400 -6850 1400 -6850 80 21
DS 1400 -6850 1400 -2450 80 21
DS 1400 -2450 -1400 -2450 80 21
DS -1400 -2450 -1400 -6850 80 21
$PAD
Sh "1" R 640 640 0 0 0
Dr 440 0 0
At STD N 0CC08001
Ne 0 ""
Po -900 0
$EndPAD
$PAD
Sh "2" C 640 640 0 0 0
Dr 440 0 0
At STD N 0CC08001
Ne 0 ""
Po 0 0
$EndPAD
$PAD
Sh "3" C 640 640 0 0 0
Dr 440 0 0
At STD N 0CC08001
Ne 0 ""
Po 900 0
$EndPAD
$EndMODULE SOT32-LAYING
$MODULE SOT93
Po 0 0 0 15 507A6FFB 00000000 ~~
Li SOT93
Sc 0
AR 
Op 0 0 0
T0 0 -1800 394 394 0 79 N V 21 N "SOT93"
T1 0 1400 394 394 0 79 N I 21 N "Value"
DS 3100 -750 -3100 -750 80 21
DS 3100 950 -3100 950 80 21
DS -3100 950 -3100 950 80 21
DS -3100 950 -3100 -1350 80 21
DS -3100 -1350 3100 -1350 80 21
DS 3100 -1350 3100 950 80 21
$PAD
Sh "1" R 1378 1378 0 0 0
Dr 669 0 0
At STD N 00E0FFFF
Ne 0 ""
Po -2150 0
$EndPAD
$PAD
Sh "2" C 1378 1378 0 0 0
Dr 669 0 0
At STD N 00E0FFFF
Ne 0 ""
Po 0 0
$EndPAD
$PAD
Sh "3" C 1378 1378 0 0 0
Dr 669 0 0
At STD N 00E0FFFF
Ne 0 ""
Po 2150 0
$EndPAD
$EndMODULE SOT93
$MODULE SOT93B
Po 0 0 0 15 507A71B3 00000000 ~~
Li SOT93B
Sc 0
AR 
Op 0 0 0
T0 -9400 0 394 394 900 79 N V 21 N "SOT93B"
T1 -3400 0 394 394 900 79 N I 21 N "Value"
DS -5750 -3100 -5750 3100 80 21
DS -950 -3100 -950 3100 80 21
DS -950 3100 -9000 3100 80 21
DS -9000 3100 -9000 -3100 80 21
DS -9000 -3100 -950 -3100 80 21
$PAD
Sh "1" R 1378 1378 0 0 900
Dr 669 0 0
At STD N 00E0FFFF
Ne 0 ""
Po 0 2150
$EndPAD
$PAD
Sh "2" C 1378 1378 0 0 0
Dr 669 0 0
At STD N 00E0FFFF
Ne 0 ""
Po 0 0
$EndPAD
$PAD
Sh "3" C 1378 1378 0 0 0
Dr 669 0 0
At STD N 00E0FFFF
Ne 0 ""
Po 0 -2150
$EndPAD
$PAD
Sh "" C 1575 1575 0 0 0
Dr 1575 0 0
At HOLE N 00E0FFFF
Ne 0 ""
Po -7380 0
$EndPAD
$EndMODULE SOT93B
$MODULE SOT93C
Po 0 0 0 15 507A727F 00000000 ~~
Li SOT93C
Sc 0
AR 
Op 0 0 0
T0 -12400 0 394 394 900 79 N V 21 N "SOT93C"
T1 -6450 0 394 394 900 79 N I 21 N "Value"
DS -8750 -3100 -8750 3100 80 21
DS -3950 -3100 -3950 3100 80 21
DS -3950 3100 -12000 3100 80 21
DS -12000 3100 -12000 -3100 80 21
DS -12000 -3100 -3950 -3100 80 21
DS -3900 -2350 -3900 -1950 50 21
DS -3900 -1950 -800 -1950 50 21
DS -800 -1950 -800 -2350 50 21
DS -800 -2350 -3900 -2350 50 21
DS -3900 -200 -3900 200 50 21
DS -3900 200 -800 200 50 21
DS -800 200 -800 -200 50 21
DS -800 -200 -3900 -200 50 21
DS -3900 1950 -3900 2350 50 21
DS -3900 2350 -800 2350 50 21
DS -800 2350 -800 1950 50 21
DS -800 1950 -3900 1950 50 21
$PAD
Sh "1" R 1378 1378 0 0 900
Dr 669 0 0
At STD N 00E0FFFF
Ne 0 ""
Po 0 2150
$EndPAD
$PAD
Sh "2" C 1378 1378 0 0 0
Dr 669 0 0
At STD N 00E0FFFF
Ne 0 ""
Po 0 0
$EndPAD
$PAD
Sh "3" C 1378 1378 0 0 0
Dr 669 0 0
At STD N 00E0FFFF
Ne 0 ""
Po 0 -2150
$EndPAD
$PAD
Sh "" C 1575 1575 0 0 0
Dr 1575 0 0
At HOLE N 00E0FFFF
Ne 0 ""
Po -10380 0
$EndPAD
$EndMODULE SOT93C
$MODULE TO126
Po 0 0 0 15 507A7366 00000000 ~~
Li TO126
Sc 0
AR 
Op 0 0 0
T0 0 -1000 394 394 0 79 N V 21 N "TO126"
T1 0 1000 394 394 0 79 N I 21 N "Value"
DS -1650 600 -1700 650 80 21
DS 1650 600 -1650 600 80 21
DS -1650 600 -1650 -600 80 21
DS -1650 -600 1650 -600 80 21
DS 1650 -600 1650 600 80 21
$PAD
Sh "1" R 740 984 0 0 0
Dr 540 0 0
At STD N 00E0FFFF
Ne 0 ""
Po -900 0
$EndPAD
$PAD
Sh "2" O 740 984 0 0 0
Dr 540 0 0
At STD N 00E0FFFF
Ne 0 ""
Po 0 0
$EndPAD
$PAD
Sh "3" O 740 984 0 0 0
Dr 540 0 0
At STD N 00E0FFFF
Ne 0 ""
Po 900 0
$EndPAD
$EndMODULE TO126
$MODULE TO126B
Po 0 0 0 15 507A73EB 00000000 ~~
Li TO126B
Sc 0
AR 
Op 0 0 0
T0 0 -6300 394 394 0 79 N V 21 N "TO126B"
T1 0 -2700 394 394 0 79 N I 21 N "Value"
DS 890 -740 890 -1360 320 21
DS 10 -750 10 -1370 320 21
DS -900 -1370 -900 -750 320 21
DS 1650 -1500 1650 -6000 80 21
DS 1650 -6000 -1650 -6000 80 21
DS -1650 -6000 -1650 -1500 80 21
DS -1650 -1500 1650 -1500 80 21
$PAD
Sh "1" R 740 984 0 0 0
Dr 540 0 0
At STD N 00E0FFFF
Ne 0 ""
Po -900 0
$EndPAD
$PAD
Sh "2" O 740 984 0 0 0
Dr 540 0 0
At STD N 00E0FFFF
Ne 0 ""
Po 0 0
$EndPAD
$PAD
Sh "3" O 740 984 0 0 0
Dr 540 0 0
At STD N 00E0FFFF
Ne 0 ""
Po 900 0
$EndPAD
$PAD
Sh "" C 1400 1400 0 0 0
Dr 1400 0 0
At HOLE N 00E0FFFF
Ne 0 ""
Po 0 -4750
$EndPAD
$EndMODULE TO126B
$MODULE TO220
Po 0 0 0 15 4FDA1AC8 00000000 ~~
Li TO220
Sc 0
AR 
Op 0 0 0
T0 -1000 0 393 393 900 78 N V 21 N "TO220"
T1 1500 0 393 393 900 78 N I 21 N "Value"
DS -500 -1500 0 -1500 150 21
DS 1000 -1500 1000 1500 150 21
DS 0 1500 -500 1500 150 21
DS 0 -1500 1000 -1500 150 21
DS -500 -1500 -500 1500 150 21
DS 1000 1500 0 1500 150 21
DS 0 1500 0 -1500 150 21
$PAD
Sh "1" R 600 600 0 0 0
Dr 314 0 0
At STD N 00F0FFFF
Ne 0 ""
Po 500 1000
$EndPAD
$PAD
Sh "2" C 600 600 0 0 0
Dr 314 0 0
At STD N 00F0FFFF
Ne 0 ""
Po 500 -1000
$EndPAD
$PAD
Sh "3" C 600 600 0 0 0
Dr 314 0 0
At STD N 00F0FFFF
Ne 0 ""
Po 500 0
$EndPAD
$SHAPE3D
Na "to-xxx-packages/to220_verti.wrl"
Sc 1 1 1
Of 0 0 0
Ro 0 0 0
$EndSHAPE3D
$EndMODULE TO220
$MODULE TO220-5
Po 0 0 0 15 507A7498 00000000 ~~
Li TO220-5
Sc 0
AR 
Op 0 0 0
T0 0 -3200 394 394 0 79 N V 21 N "TO220-5"
T1 0 -1800 394 394 0 79 N I 21 N "Value"
DS -2000 -2500 2000 -2500 80 21
DS 1500 -1000 1500 250 80 21
DS 750 -750 750 -1000 80 21
DS 0 250 0 -1000 80 21
DS -750 -750 -750 -1000 80 21
DS -1500 -1000 -1500 250 80 21
DS -2000 -1000 2000 -1000 80 21
DS 2000 -1000 2000 -2750 80 21
DS 2000 -2750 -2000 -2750 80 21
DS -2000 -2750 -2000 -1000 80 21
$PAD
Sh "1" R 787 787 0 0 0
Dr 472 0 0
At STD N 00E0FFFF
Ne 0 ""
Po -1500 1000
$EndPAD
$PAD
Sh "2" C 787 787 0 0 0
Dr 472 0 0
At STD N 00E0FFFF
Ne 0 ""
Po -750 0
$EndPAD
$PAD
Sh "3" C 787 787 0 0 0
Dr 472 0 0
At STD N 00E0FFFF
Ne 0 ""
Po 0 1000
$EndPAD
$PAD
Sh "4" C 787 787 0 0 0
Dr 472 0 0
At STD N 00E0FFFF
Ne 0 ""
Po 750 0
$EndPAD
$PAD
Sh "5" C 787 787 0 0 0
Dr 472 0 0
At STD N 00E0FFFF
Ne 0 ""
Po 1500 1000
$EndPAD
$EndMODULE TO220-5
$MODULE TO220-5/L875
Po 0 0 0 15 507A750B 00000000 ~~
Li TO220-5/L875
Sc 0
AR 
Op 0 0 0
T0 -8600 0 394 394 900 79 N V 21 N "TO220-5/L875"
T1 -3200 0 394 394 900 79 N I 21 N "Value"
DS -1630 -790 -750 -790 80 21
DS -750 -790 -750 -540 80 21
DS -750 -540 -1630 -540 80 21
DS -1630 -1470 -750 -1470 80 21
DS -750 -1470 -750 -1220 80 21
DS -750 -1220 -1630 -1220 80 21
DS -1630 1190 -750 1190 80 21
DS -750 1190 -750 1440 80 21
DS -750 1440 -1630 1440 80 21
DS -1630 550 -750 550 80 21
DS -750 550 -750 800 80 21
DS -750 800 -1630 800 80 21
DS -1630 -140 -750 -140 80 21
DS -750 -140 -750 110 80 21
DS -750 110 -1630 110 80 21
DS -4650 -2100 -4650 2100 80 21
DS -1700 -2100 -8150 -2100 80 21
DS -8150 -2100 -8150 2100 80 21
DS -8150 2100 -1700 2100 80 21
DS -1700 2100 -1700 -2100 80 21
$PAD
Sh "" C 1460 1460 0 0 0
Dr 1460 0 0
At HOLE N 00E0FFFF
Ne 0 ""
Po -6950 0
$EndPAD
$PAD
Sh "3" O 1180 500 0 0 0
Dr 380 0 0
At STD N 00E0FFFF
Ne 0 ""
Po 0 0
$EndPAD
$PAD
Sh "4" O 1180 500 0 0 0
Dr 380 0 0
At STD N 00E0FFFF
Ne 0 ""
Po 0 -660
$EndPAD
$PAD
Sh "5" O 1180 500 0 0 0
Dr 380 0 0
At STD N 00E0FFFF
Ne 0 ""
Po 0 -1330
$EndPAD
$PAD
Sh "2" O 1180 500 0 0 0
Dr 380 0 0
At STD N 00E0FFFF
Ne 0 ""
Po 0 670
$EndPAD
$PAD
Sh "1" O 1180 500 0 0 0
Dr 380 0 0
At STD N 00E0FFFF
Ne 0 ""
Po 0 1340
$EndPAD
$EndMODULE TO220-5/L875
$MODULE TO220AA/L875
Po 0 0 0 15 507A75BB 00000000 ~~
Li TO220AA/L875
Sc 0
AR 
Op 0 0 0
T0 -8600 0 394 394 900 79 N V 21 N "TO220AA/L875"
T1 -3200 0 394 394 900 79 N I 21 N "Value"
DS -1630 880 -750 880 80 21
DS -750 880 -750 1130 80 21
DS -750 1130 -1630 1130 80 21
DS -1630 -120 -750 -120 80 21
DS -750 -120 -750 130 80 21
DS -750 130 -1630 130 80 21
DS -1630 -1120 -750 -1120 80 21
DS -750 -1120 -750 -870 80 21
DS -750 -870 -1630 -870 80 21
DS -4650 -2100 -4650 2100 80 21
DS -1700 -2100 -8150 -2100 80 21
DS -8150 -2100 -8150 2100 80 21
DS -8150 2100 -1700 2100 80 21
DS -1700 2100 -1700 -2100 80 21
$PAD
Sh "1" R 748 748 0 0 900
Dr 512 0 0
At STD N 00E0FFFF
Ne 0 ""
Po 0 1000
$EndPAD
$PAD
Sh "2" C 748 748 0 0 0
Dr 512 0 0
At STD N 00E0FFFF
Ne 0 ""
Po 0 0
$EndPAD
$PAD
Sh "3" C 748 748 0 0 0
Dr 512 0 0
At STD N 00E0FFFF
Ne 0 ""
Po 0 -1000
$EndPAD
$PAD
Sh "" C 1460 1460 0 0 0
Dr 1460 0 0
At HOLE N 00E0FFFF
Ne 0 ""
Po -6950 0
$EndPAD
$EndMODULE TO220AA/L875
$MODULE TO220AA/L975
Po 0 0 0 15 507A7638 00000000 ~~
Li TO220AA/L975
Sc 0
AR 
Op 0 0 0
T0 -9600 0 394 394 900 79 N V 21 N "TO220AA/L975"
T1 -4200 0 394 394 900 79 N I 21 N "Value"
DS -2700 -2100 -9150 -2100 80 21
DS -9150 -2100 -9150 2100 80 21
DS -9150 2100 -2700 2100 80 21
DS -2700 2100 -2700 -2100 80 21
DS -2630 880 -750 880 80 21
DS -750 880 -750 1130 80 21
DS -750 1130 -2630 1130 80 21
DS -2630 -120 -750 -120 80 21
DS -750 -120 -750 130 80 21
DS -750 130 -2630 130 80 21
DS -2630 -1120 -750 -1120 80 21
DS -750 -1120 -750 -870 80 21
DS -750 -870 -2630 -870 80 21
DS -5650 -2100 -5650 2100 80 21
$PAD
Sh "1" R 748 748 0 0 900
Dr 512 0 0
At STD N 00E0FFFF
Ne 0 ""
Po 0 1000
$EndPAD
$PAD
Sh "2" C 748 748 0 0 0
Dr 512 0 0
At STD N 00E0FFFF
Ne 0 ""
Po 0 0
$EndPAD
$PAD
Sh "3" C 748 748 0 0 0
Dr 512 0 0
At STD N 00E0FFFF
Ne 0 ""
Po 0 -1000
$EndPAD
$PAD
Sh "" C 1457 1457 0 0 0
Dr 1457 0 0
At HOLE N 00E0FFFF
Ne 0 ""
Po -7950 0
$EndPAD
$EndMODULE TO220AA/L975
$MODULE TO220AA/RF2
Po 0 0 0 15 507A768F 00000000 ~~
Li TO220AA/RF2
Sc 0
AR 
Op 0 0 0
T0 -8600 0 394 394 900 79 N V 21 N "TO220AA/RF2"
T1 -3200 0 394 394 900 79 N I 21 N "Value"
DS -4650 2100 -4650 -2100 80 21
DS -1700 -2100 -8150 -2100 80 21
DS -8150 -2100 -8150 2100 80 21
DS -8150 2100 -1700 2100 80 21
DS -1700 2100 -1700 -2100 80 21
$PAD
Sh "1" R 748 748 0 0 900
Dr 512 0 0
At STD N 00E0FFFF
Ne 0 ""
Po -1000 1000
$EndPAD
$PAD
Sh "2" C 748 748 0 0 0
Dr 512 0 0
At STD N 00E0FFFF
Ne 0 ""
Po 0 0
$EndPAD
$PAD
Sh "3" C 748 748 0 0 0
Dr 512 0 0
At STD N 00E0FFFF
Ne 0 ""
Po -1000 -1000
$EndPAD
$PAD
Sh "" C 1457 1457 0 0 0
Dr 1457 0 0
At HOLE N 00E0FFFF
Ne 0 ""
Po -6950 0
$EndPAD
$EndMODULE TO220AA/RF2
$MODULE TO220AB
Po 0 0 0 15 507A770C 00000000 ~~
Li TO220AB
Sc 0
AR 
Op 0 0 0
T0 0 -1600 394 394 0 79 N V 21 N "TO220AB"
T1 0 1600 394 394 0 79 N I 21 N "Value"
DS -2100 -600 2100 -600 80 21
DS -2100 -1150 -2100 1100 80 21
DS -2100 1100 2100 1100 80 21
DS 2100 1100 2100 -1150 80 21
DS 2100 -1150 -2100 -1150 80 21
$PAD
Sh "1" R 748 748 0 0 0
Dr 512 0 0
At STD N 00E0FFFF
Ne 0 ""
Po -1000 0
$EndPAD
$PAD
Sh "2" C 748 748 0 0 0
Dr 512 0 0
At STD N 00E0FFFF
Ne 0 ""
Po 0 0
$EndPAD
$PAD
Sh "3" C 748 748 0 0 0
Dr 512 0 0
At STD N 00E0FFFF
Ne 0 ""
Po 1000 0
$EndPAD
$EndMODULE TO220AB
$MODULE TO220AB/VF1
Po 0 0 0 15 507A775A 00000000 ~~
Li TO220AB/VF1
Sc 0
AR 
Op 0 0 0
T0 0 -1600 394 394 0 79 N V 21 N "TO220AB/VF1"
T1 0 2000 394 394 0 79 N I 21 N "Value"
DS -2100 -600 2100 -600 80 21
DS 650 1100 2100 1100 80 21
DS 2100 1100 2100 -1150 80 21
DS 2100 -1150 -2100 -1150 80 21
DS -2100 -1150 -2100 -1150 80 21
DS -2100 -1150 -2100 1100 80 21
DS -2100 1100 -650 1100 80 21
$PAD
Sh "1" R 748 748 0 0 0
Dr 512 0 0
At STD N 00E0FFFF
Ne 0 ""
Po -1000 0
$EndPAD
$PAD
Sh "2" C 748 748 0 0 0
Dr 512 0 0
At STD N 00E0FFFF
Ne 0 ""
Po 0 1000
$EndPAD
$PAD
Sh "3" C 748 748 0 0 0
Dr 512 0 0
At STD N 00E0FFFF
Ne 0 ""
Po 1000 0
$EndPAD
$EndMODULE TO220AB/VF1
$MODULE TO220AC
Po 0 0 0 15 507A6E1D 00000000 ~~
Li TO220AC
Sc 0
AR 
Op 0 0 0
T0 0 -1600 394 394 0 79 N V 21 N "TO220AC"
T1 0 800 394 394 0 79 N I 21 N "Value"
DS -2100 -600 2100 -600 80 21
DS -2100 -1150 -2100 1100 80 21
DS -2100 1100 2100 1100 80 21
DS 2100 1100 2100 -1150 80 21
DS 2100 -1150 -2100 -1150 80 21
$PAD
Sh "1" R 740 740 0 0 0
Dr 540 0 0
At STD N 0CC08001
Ne 0 ""
Po -1000 0
$EndPAD
$PAD
Sh "3" C 740 740 0 0 0
Dr 540 0 0
At STD N 0CC08001
Ne 0 ""
Po 1000 0
$EndPAD
$EndMODULE TO220AC
$EndLIBRARY
