PCBNEW-LibModule-V1  Čt 21. červen 2012, 21:45:28 CEST
# encoding utf-8
Units deci-mils
$INDEX
LMX9838_LTCC
LMX9838_LTCC_V2
LMX9838_LTCC_V3
$EndINDEX
$MODULE LMX9838_LTCC
Po 0 0 0 15 4FE37946 00000000 ~~
Li LMX9838_LTCC
Sc 0
AR 
Op 0 0 0
T0 0 -4860 393 393 0 78 N V 21 N "LMX9838_LTCC"
T1 0 3100 393 393 0 78 N I 21 N "Value"
DS -2028 2540 2028 2540 39 21
DS 2028 2540 2028 -4448 39 21
DS 2028 -4448 -2028 -4448 39 21
DS -2028 -4448 -2028 2540 39 21
$PAD
Sh "32" R 354 236 0 0 0
Dr 0 0 0
At SMD N 00888000
Ne 0 ""
Po 1791 -2362
$EndPAD
$PAD
Sh "31" R 354 236 0 0 0
Dr 0 0 0
At SMD N 00888000
Ne 0 ""
Po 1791 -1969
$EndPAD
$PAD
Sh "30" R 354 236 0 0 0
Dr 0 0 0
At SMD N 00888000
Ne 0 ""
Po 1791 -1575
$EndPAD
$PAD
Sh "29" R 354 236 0 0 0
Dr 0 0 0
At SMD N 00888000
Ne 0 ""
Po 1791 -1181
$EndPAD
$PAD
Sh "28" R 354 236 0 0 0
Dr 0 0 0
At SMD N 00888000
Ne 0 ""
Po 1791 -787
$EndPAD
$PAD
Sh "27" R 354 236 0 0 0
Dr 0 0 0
At SMD N 00888000
Ne 0 ""
Po 1791 -394
$EndPAD
$PAD
Sh "26" R 354 236 0 0 0
Dr 0 0 0
At SMD N 00888000
Ne 0 ""
Po 1791 0
$EndPAD
$PAD
Sh "25" R 354 236 0 0 0
Dr 0 0 0
At SMD N 00888000
Ne 0 ""
Po 1791 394
$EndPAD
$PAD
Sh "24" R 354 236 0 0 0
Dr 0 0 0
At SMD N 00888000
Ne 0 ""
Po 1791 787
$EndPAD
$PAD
Sh "23" R 354 236 0 0 0
Dr 0 0 0
At SMD N 00888000
Ne 0 ""
Po 1791 1181
$EndPAD
$PAD
Sh "22" R 354 236 0 0 0
Dr 0 0 0
At SMD N 00888000
Ne 0 ""
Po 1791 1575
$EndPAD
$PAD
Sh "21" R 354 236 0 0 0
Dr 0 0 0
At SMD N 00888000
Ne 0 ""
Po 1791 1969
$EndPAD
$PAD
Sh "12" R 354 236 0 0 0
Dr 0 0 0
At SMD N 00888000
Ne 0 ""
Po -1791 1969
$EndPAD
$PAD
Sh "11" R 354 236 0 0 0
Dr 0 0 0
At SMD N 00888000
Ne 0 ""
Po -1791 1575
$EndPAD
$PAD
Sh "10" R 354 236 0 0 0
Dr 0 0 0
At SMD N 00888000
Ne 0 ""
Po -1791 1181
$EndPAD
$PAD
Sh "9" R 354 236 0 0 0
Dr 0 0 0
At SMD N 00888000
Ne 0 ""
Po -1791 787
$EndPAD
$PAD
Sh "8" R 354 236 0 0 0
Dr 0 0 0
At SMD N 00888000
Ne 0 ""
Po -1791 394
$EndPAD
$PAD
Sh "7" R 354 236 0 0 0
Dr 0 0 0
At SMD N 00888000
Ne 0 ""
Po -1791 0
$EndPAD
$PAD
Sh "6" R 354 236 0 0 0
Dr 0 0 0
At SMD N 00888000
Ne 0 ""
Po -1791 -394
$EndPAD
$PAD
Sh "5" R 354 236 0 0 0
Dr 0 0 0
At SMD N 00888000
Ne 0 ""
Po -1791 -787
$EndPAD
$PAD
Sh "4" R 354 236 0 0 0
Dr 0 0 0
At SMD N 00888000
Ne 0 ""
Po -1791 -1181
$EndPAD
$PAD
Sh "3" R 354 236 0 0 0
Dr 0 0 0
At SMD N 00888000
Ne 0 ""
Po -1791 -1575
$EndPAD
$PAD
Sh "2" R 354 236 0 0 0
Dr 0 0 0
At SMD N 00888000
Ne 0 ""
Po -1791 -1969
$EndPAD
$PAD
Sh "1" R 354 236 0 0 0
Dr 0 0 0
At SMD N 00888000
Ne 0 ""
Po -1791 -2362
$EndPAD
$PAD
Sh "20" R 236 354 0 0 0
Dr 0 0 0
At SMD N 00888000
Ne 0 ""
Po 1378 2303
$EndPAD
$PAD
Sh "19" R 236 354 0 0 0
Dr 0 0 0
At SMD N 00888000
Ne 0 ""
Po 984 2303
$EndPAD
$PAD
Sh "18" R 236 354 0 0 0
Dr 0 0 0
At SMD N 00888000
Ne 0 ""
Po 591 2303
$EndPAD
$PAD
Sh "17" R 236 354 0 0 0
Dr 0 0 0
At SMD N 00888000
Ne 0 ""
Po 197 2303
$EndPAD
$PAD
Sh "16" R 236 354 0 0 0
Dr 0 0 0
At SMD N 00888000
Ne 0 ""
Po -197 2303
$EndPAD
$PAD
Sh "15" R 236 354 0 0 0
Dr 0 0 0
At SMD N 00888000
Ne 0 ""
Po -591 2303
$EndPAD
$PAD
Sh "14" R 236 354 0 0 0
Dr 0 0 0
At SMD N 00888000
Ne 0 ""
Po -984 2303
$EndPAD
$PAD
Sh "13" R 236 354 0 0 0
Dr 0 0 0
At SMD N 00888000
Ne 0 ""
Po -1378 2303
$EndPAD
$PAD
Sh "40" R 236 354 0 0 0
Dr 0 0 0
At SMD N 00888000
Ne 0 ""
Po -1378 -2303
$EndPAD
$PAD
Sh "39" R 236 354 0 0 0
Dr 0 0 0
At SMD N 00888000
Ne 0 ""
Po -984 -2303
$EndPAD
$PAD
Sh "38" R 236 354 0 0 0
Dr 0 0 0
At SMD N 00888000
Ne 0 ""
Po -591 -2303
$EndPAD
$PAD
Sh "37" R 236 354 0 0 0
Dr 0 0 0
At SMD N 00888000
Ne 0 ""
Po -197 -2303
$EndPAD
$PAD
Sh "36" R 236 354 0 0 0
Dr 0 0 0
At SMD N 00888000
Ne 0 ""
Po 197 -2303
$EndPAD
$PAD
Sh "35" R 236 354 0 0 0
Dr 0 0 0
At SMD N 00888000
Ne 0 ""
Po 591 -2303
$EndPAD
$PAD
Sh "34" R 236 354 0 0 0
Dr 0 0 0
At SMD N 00888000
Ne 0 ""
Po 984 -2303
$EndPAD
$PAD
Sh "33" R 236 354 0 0 0
Dr 0 0 0
At SMD N 00888000
Ne 0 ""
Po 1378 -2303
$EndPAD
$EndMODULE LMX9838_LTCC
$MODULE LMX9838_LTCC_V2
Po 0 0 0 15 4FE379AD 00000000 ~~
Li LMX9838_LTCC_V2
Sc 0
AR /4A4507A5
Op 0 0 0
T0 0 -4840 393 393 0 78 N V 21 N "LMX9838_LTCC_V2"
T1 0 3300 393 393 0 78 N I 21 N "Value"
DS -2272 -4450 2256 -4452 39 21
DS 2258 2546 2258 2752 39 21
DS 2258 2752 -2272 2754 39 21
DS -2272 2754 -2272 -4446 39 21
DS 2258 -4448 2258 2540 39 21
$PAD
Sh "32" R 551 236 0 0 0
Dr 0 0 0
At SMD N 00888000
Ne 3 "GND"
Po 1889 -2362
$EndPAD
$PAD
Sh "31" R 551 236 0 0 0
Dr 0 0 0
At SMD N 00888000
Ne 3 "GND"
Po 1889 -1969
$EndPAD
$PAD
Sh "30" R 551 236 0 0 0
Dr 0 0 0
At SMD N 00888000
Ne 3 "GND"
Po 1889 -1575
$EndPAD
$PAD
Sh "29" R 551 236 0 0 0
Dr 0 0 0
At SMD N 00888000
Ne 3 "GND"
Po 1889 -1181
$EndPAD
$PAD
Sh "28" R 551 236 0 0 0
Dr 0 0 0
At SMD N 00808000
Ne 0 ""
Po 1889 -787
$EndPAD
$PAD
Sh "27" R 551 236 0 0 0
Dr 0 0 0
At SMD N 00808000
Ne 0 ""
Po 1889 -394
$EndPAD
$PAD
Sh "26" R 551 236 0 0 0
Dr 0 0 0
At SMD N 00888000
Ne 6 "N-000006"
Po 1889 0
$EndPAD
$PAD
Sh "25" R 551 236 0 0 0
Dr 0 0 0
At SMD N 00888000
Ne 7 "N-000014"
Po 1889 394
$EndPAD
$PAD
Sh "24" R 551 236 0 0 0
Dr 0 0 0
At SMD N 00888000
Ne 3 "GND"
Po 1889 787
$EndPAD
$PAD
Sh "23" R 551 236 0 0 0
Dr 0 0 0
At SMD N 00808000
Ne 0 ""
Po 1889 1181
$EndPAD
$PAD
Sh "22" R 551 236 0 0 0
Dr 0 0 0
At SMD N 00808000
Ne 0 ""
Po 1889 1575
$EndPAD
$PAD
Sh "21" R 551 236 0 0 0
Dr 0 0 0
At SMD N 00808000
Ne 0 ""
Po 1889 1969
$EndPAD
$PAD
Sh "12" R 551 236 0 0 0
Dr 0 0 0
At SMD N 00888000
Ne 9 "N-000016"
Po -1889 1969
$EndPAD
$PAD
Sh "11" R 551 236 0 0 0
Dr 0 0 0
At SMD N 00888000
Ne 1 "+3.3V"
Po -1889 1575
$EndPAD
$PAD
Sh "10" R 551 236 0 0 0
Dr 0 0 0
At SMD N 00888000
Ne 1 "+3.3V"
Po -1889 1181
$EndPAD
$PAD
Sh "9" R 551 236 0 0 0
Dr 0 0 0
At SMD N 00888000
Ne 2 "/VCC_CORE"
Po -1889 787
$EndPAD
$PAD
Sh "8" R 551 236 0 0 0
Dr 0 0 0
At SMD N 00808000
Ne 0 ""
Po -1889 394
$EndPAD
$PAD
Sh "7" R 551 236 0 0 0
Dr 0 0 0
At SMD N 00808000
Ne 0 ""
Po -1889 0
$EndPAD
$PAD
Sh "6" R 551 236 0 0 0
Dr 0 0 0
At SMD N 00888000
Ne 1 "+3.3V"
Po -1889 -394
$EndPAD
$PAD
Sh "5" R 551 236 0 0 0
Dr 0 0 0
At SMD N 00808000
Ne 0 ""
Po -1889 -787
$EndPAD
$PAD
Sh "4" R 551 236 0 0 0
Dr 0 0 0
At SMD N 00888000
Ne 3 "GND"
Po -1889 -1181
$EndPAD
$PAD
Sh "3" R 551 236 0 0 0
Dr 0 0 0
At SMD N 00888000
Ne 3 "GND"
Po -1889 -1575
$EndPAD
$PAD
Sh "2" R 551 236 0 0 0
Dr 0 0 0
At SMD N 00888000
Ne 4 "N-000004"
Po -1889 -1969
$EndPAD
$PAD
Sh "1" R 551 236 0 0 0
Dr 0 0 0
At SMD N 00808000
Ne 0 ""
Po -1889 -2362
$EndPAD
$PAD
Sh "20" R 236 551 0 0 0
Dr 0 0 0
At SMD N 00808000
Ne 0 ""
Po 1378 2401
$EndPAD
$PAD
Sh "19" R 236 551 0 0 0
Dr 0 0 0
At SMD N 00808000
Ne 0 ""
Po 984 2401
$EndPAD
$PAD
Sh "18" R 236 551 0 0 0
Dr 0 0 0
At SMD N 00888000
Ne 3 "GND"
Po 591 2401
$EndPAD
$PAD
Sh "17" R 236 551 0 0 0
Dr 0 0 0
At SMD N 00888000
Ne 3 "GND"
Po 197 2401
$EndPAD
$PAD
Sh "16" R 236 551 0 0 0
Dr 0 0 0
At SMD N 00888000
Ne 8 "N-000015"
Po -197 2401
$EndPAD
$PAD
Sh "15" R 236 551 0 0 0
Dr 0 0 0
At SMD N 00888000
Ne 3 "GND"
Po -591 2401
$EndPAD
$PAD
Sh "14" R 236 551 0 0 0
Dr 0 0 0
At SMD N 00808000
Ne 0 ""
Po -984 2401
$EndPAD
$PAD
Sh "13" R 236 551 0 0 0
Dr 0 0 0
At SMD N 00888000
Ne 5 "N-000005"
Po -1378 2401
$EndPAD
$PAD
Sh "40" R 236 354 0 0 0
Dr 0 0 0
At SMD N 00808000
Ne 0 ""
Po -1378 -2303
$EndPAD
$PAD
Sh "39" R 236 354 0 0 0
Dr 0 0 0
At SMD N 00808000
Ne 0 ""
Po -984 -2303
$EndPAD
$PAD
Sh "38" R 236 354 0 0 0
Dr 0 0 0
At SMD N 00808000
Ne 0 ""
Po -591 -2303
$EndPAD
$PAD
Sh "37" R 236 354 0 0 0
Dr 0 0 0
At SMD N 00808000
Ne 0 ""
Po -197 -2303
$EndPAD
$PAD
Sh "36" R 236 354 0 0 0
Dr 0 0 0
At SMD N 00808000
Ne 0 ""
Po 197 -2303
$EndPAD
$PAD
Sh "35" R 236 354 0 0 0
Dr 0 0 0
At SMD N 00808000
Ne 0 ""
Po 591 -2303
$EndPAD
$PAD
Sh "34" R 236 354 0 0 0
Dr 0 0 0
At SMD N 00808000
Ne 0 ""
Po 984 -2303
$EndPAD
$PAD
Sh "33" R 236 354 0 0 0
Dr 0 0 0
At SMD N 00808000
Ne 0 ""
Po 1378 -2303
$EndPAD
$EndMODULE LMX9838_LTCC_V2
$MODULE LMX9838_LTCC_V3
Po 0 0 0 15 4FE379D2 00000000 ~~
Li LMX9838_LTCC_V3
Sc 0
AR /4A4507A5
Op 0 0 0
T0 0 -4840 393 393 0 78 N V 21 N "LMX9838_LTCC_V2"
T1 0 3300 393 393 0 78 N I 21 N "Value"
DS 1800 -4180 1800 -3840 50 27
DS 1800 -3840 -1820 -3840 50 27
DS -1820 -3840 -1820 -3500 50 27
DS -1820 -3500 1800 -3500 50 27
DS 1800 -3500 1800 -3160 50 27
DS 1800 -3160 -1800 -3160 50 27
DS -1800 -3160 -1800 -2840 50 27
DS -1800 -2840 1800 -2840 50 27
DS -1840 -4180 1800 -4180 50 27
DS -1980 2580 1980 2580 50 27
DS 1980 2580 1980 -4320 50 27
DS 1980 -4320 -1980 -4320 50 27
DS -1980 -4320 -1980 2580 50 27
DS -2260 -4460 2260 -4460 50 21
DS 2260 -4460 2260 2760 50 21
DS 2260 2760 -2280 2760 50 21
DS -2280 2760 -2280 -4460 50 21
DS -2272 -4450 2256 -4452 50 26
DS 2258 2546 2258 2752 50 26
DS 2258 2752 -2272 2754 50 26
DS -2272 2754 -2272 -4446 50 26
DS 2258 -4448 2258 2540 50 26
$PAD
Sh "32" R 551 236 0 0 0
Dr 0 0 0
At SMD N 00888000
Ne 0 ""
Po 1889 -2362
$EndPAD
$PAD
Sh "31" R 551 236 0 0 0
Dr 0 0 0
At SMD N 00888000
Ne 0 ""
Po 1889 -1969
$EndPAD
$PAD
Sh "30" R 551 236 0 0 0
Dr 0 0 0
At SMD N 00888000
Ne 0 ""
Po 1889 -1575
$EndPAD
$PAD
Sh "29" R 551 236 0 0 0
Dr 0 0 0
At SMD N 00888000
Ne 0 ""
Po 1889 -1181
$EndPAD
$PAD
Sh "28" R 551 236 0 0 0
Dr 0 0 0
At SMD N 00888000
Ne 0 ""
Po 1889 -787
$EndPAD
$PAD
Sh "27" R 551 236 0 0 0
Dr 0 0 0
At SMD N 00888000
Ne 0 ""
Po 1889 -394
$EndPAD
$PAD
Sh "26" R 551 236 0 0 0
Dr 0 0 0
At SMD N 00888000
Ne 0 ""
Po 1889 0
$EndPAD
$PAD
Sh "25" R 551 236 0 0 0
Dr 0 0 0
At SMD N 00888000
Ne 0 ""
Po 1889 394
$EndPAD
$PAD
Sh "24" R 551 236 0 0 0
Dr 0 0 0
At SMD N 00888000
Ne 0 ""
Po 1889 787
$EndPAD
$PAD
Sh "23" R 551 236 0 0 0
Dr 0 0 0
At SMD N 00888000
Ne 0 ""
Po 1889 1181
$EndPAD
$PAD
Sh "22" R 551 236 0 0 0
Dr 0 0 0
At SMD N 00888000
Ne 0 ""
Po 1889 1575
$EndPAD
$PAD
Sh "21" R 551 236 0 0 0
Dr 0 0 0
At SMD N 00888000
Ne 0 ""
Po 1889 1969
$EndPAD
$PAD
Sh "12" R 551 236 0 0 0
Dr 0 0 0
At SMD N 00888000
Ne 0 ""
Po -1889 1969
$EndPAD
$PAD
Sh "11" R 551 236 0 0 0
Dr 0 0 0
At SMD N 00888000
Ne 0 ""
Po -1889 1575
$EndPAD
$PAD
Sh "10" R 551 236 0 0 0
Dr 0 0 0
At SMD N 00888000
Ne 0 ""
Po -1889 1181
$EndPAD
$PAD
Sh "9" R 551 236 0 0 0
Dr 0 0 0
At SMD N 00888000
Ne 0 ""
Po -1889 787
$EndPAD
$PAD
Sh "8" R 551 236 0 0 0
Dr 0 0 0
At SMD N 00888000
Ne 0 ""
Po -1889 394
$EndPAD
$PAD
Sh "7" R 551 236 0 0 0
Dr 0 0 0
At SMD N 00888000
Ne 0 ""
Po -1889 0
$EndPAD
$PAD
Sh "6" R 551 236 0 0 0
Dr 0 0 0
At SMD N 00888000
Ne 0 ""
Po -1889 -394
$EndPAD
$PAD
Sh "5" R 551 236 0 0 0
Dr 0 0 0
At SMD N 00888000
Ne 0 ""
Po -1889 -787
$EndPAD
$PAD
Sh "4" R 551 236 0 0 0
Dr 0 0 0
At SMD N 00888000
Ne 0 ""
Po -1889 -1181
$EndPAD
$PAD
Sh "3" R 551 236 0 0 0
Dr 0 0 0
At SMD N 00888000
Ne 0 ""
Po -1889 -1575
$EndPAD
$PAD
Sh "2" R 551 236 0 0 0
Dr 0 0 0
At SMD N 00888000
Ne 0 ""
Po -1889 -1969
$EndPAD
$PAD
Sh "1" R 551 236 0 0 0
Dr 0 0 0
At SMD N 00888000
Ne 0 ""
Po -1889 -2362
$EndPAD
$PAD
Sh "20" R 236 551 0 0 0
Dr 0 0 0
At SMD N 00888000
Ne 0 ""
Po 1378 2401
$EndPAD
$PAD
Sh "19" R 236 551 0 0 0
Dr 0 0 0
At SMD N 00888000
Ne 0 ""
Po 984 2401
$EndPAD
$PAD
Sh "18" R 236 551 0 0 0
Dr 0 0 0
At SMD N 00888000
Ne 0 ""
Po 591 2401
$EndPAD
$PAD
Sh "17" R 236 551 0 0 0
Dr 0 0 0
At SMD N 00888000
Ne 0 ""
Po 197 2401
$EndPAD
$PAD
Sh "16" R 236 551 0 0 0
Dr 0 0 0
At SMD N 00888000
Ne 0 ""
Po -197 2401
$EndPAD
$PAD
Sh "15" R 236 551 0 0 0
Dr 0 0 0
At SMD N 00888000
Ne 0 ""
Po -591 2401
$EndPAD
$PAD
Sh "14" R 236 551 0 0 0
Dr 0 0 0
At SMD N 00888000
Ne 0 ""
Po -984 2401
$EndPAD
$PAD
Sh "13" R 236 551 0 0 0
Dr 0 0 0
At SMD N 00888000
Ne 0 ""
Po -1378 2401
$EndPAD
$PAD
Sh "40" R 236 354 0 0 0
Dr 0 0 0
At SMD N 00808000
Ne 0 ""
Po -1378 -2303
$EndPAD
$PAD
Sh "39" R 236 354 0 0 0
Dr 0 0 0
At SMD N 00808000
Ne 0 ""
Po -984 -2303
$EndPAD
$PAD
Sh "38" R 236 354 0 0 0
Dr 0 0 0
At SMD N 00808000
Ne 0 ""
Po -591 -2303
$EndPAD
$PAD
Sh "37" R 236 354 0 0 0
Dr 0 0 0
At SMD N 00808000
Ne 0 ""
Po -197 -2303
$EndPAD
$PAD
Sh "36" R 236 354 0 0 0
Dr 0 0 0
At SMD N 00808000
Ne 0 ""
Po 197 -2303
$EndPAD
$PAD
Sh "35" R 236 354 0 0 0
Dr 0 0 0
At SMD N 00808000
Ne 0 ""
Po 591 -2303
$EndPAD
$PAD
Sh "34" R 236 354 0 0 0
Dr 0 0 0
At SMD N 00808000
Ne 0 ""
Po 984 -2303
$EndPAD
$PAD
Sh "33" R 236 354 0 0 0
Dr 0 0 0
At SMD N 00808000
Ne 0 ""
Po 1378 -2303
$EndPAD
$EndMODULE LMX9838_LTCC_V3
$EndLIBRARY
