PCBNEW-LibModule-V1  Út 12. červen 2012, 22:00:02 CEST
# encoding utf-8
Units deci-mils
$INDEX
SW_BCD
SW_BCD_5PIN
switch-CK101X12
switch-CK102X06
switch-CK103X04
switch-CK104X03
switch-ITT-RT
$EndINDEX
$MODULE SW_BCD
Po 0 0 0 15 4FD79F27 00000000 ~~
Li SW_BCD
Sc 0
AR 
Op 0 0 0
T0 0 -4500 393 393 0 78 N V 21 N "SW_BCD"
T1 0 4600 393 393 0 78 N I 21 N "Value"
DC 0 0 1700 300 150 21
DS -4000 3950 3950 3950 150 21
DS 3950 3950 3950 -3950 150 21
DS 3950 -3950 -3950 -3950 150 21
DS -3950 -3950 -3950 3950 150 21
$PAD
Sh "1" C 591 591 0 0 0
Dr 394 0 0
At STD N 00E0FFFF
Ne 0 ""
Po -2800 2950
$EndPAD
$PAD
Sh "2" C 591 591 0 0 0
Dr 394 0 0
At STD N 00E0FFFF
Ne 0 ""
Po -1850 2950
$EndPAD
$PAD
Sh "3" C 591 591 0 0 0
Dr 394 0 0
At STD N 00E0FFFF
Ne 0 ""
Po -850 2950
$EndPAD
$PAD
Sh "4" C 591 591 0 0 0
Dr 394 0 0
At STD N 00E0FFFF
Ne 0 ""
Po 100 2950
$EndPAD
$PAD
Sh "5" C 591 591 0 0 0
Dr 394 0 0
At STD N 00E0FFFF
Ne 0 ""
Po 1150 2950
$EndPAD
$PAD
Sh "6" C 591 591 0 0 0
Dr 394 0 0
At STD N 00E0FFFF
Ne 0 ""
Po 2100 2950
$EndPAD
$PAD
Sh "12" C 591 591 0 0 0
Dr 394 0 0
At STD N 00E0FFFF
Ne 0 ""
Po 2650 -2950
$EndPAD
$PAD
Sh "11" C 591 591 0 0 0
Dr 394 0 0
At STD N 00E0FFFF
Ne 0 ""
Po 1600 -2950
$EndPAD
$PAD
Sh "10" C 591 591 0 0 0
Dr 394 0 0
At STD N 00E0FFFF
Ne 0 ""
Po 600 -2950
$EndPAD
$PAD
Sh "9" C 591 591 0 0 0
Dr 394 0 0
At STD N 00E0FFFF
Ne 0 ""
Po -350 -2950
$EndPAD
$PAD
Sh "8" C 591 591 0 0 0
Dr 394 0 0
At STD N 00E0FFFF
Ne 0 ""
Po -1350 -2950
$EndPAD
$PAD
Sh "7" C 591 591 0 0 0
Dr 394 0 0
At STD N 00E0FFFF
Ne 0 ""
Po -2350 -2950
$EndPAD
$SHAPE3D
Na "Switch/sw_bcd1.wrl"
Sc 1.6 1.6 1.6
Of 0 0 0
Ro 0 0 0
$EndSHAPE3D
$EndMODULE SW_BCD
$MODULE SW_BCD_5PIN
Po 0 0 0 15 4FD79F6F 00000000 ~~
Li SW_BCD_5PIN
Sc 0
AR 
Op 0 0 0
T0 0 -4500 393 393 0 78 N V 21 N "SW_BCD_5PIN"
T1 0 4600 393 393 0 78 N I 21 N "Value"
DC 0 0 1700 300 150 21
DS -4000 3950 3950 3950 150 21
DS 3950 3950 3950 -3950 150 21
DS 3950 -3950 -3950 -3950 150 21
DS -3950 -3950 -3950 3950 150 21
$PAD
Sh "1" C 591 591 0 0 0
Dr 394 0 0
At STD N 00E0FFFF
Ne 0 ""
Po -2100 2800
$EndPAD
$PAD
Sh "2" C 591 591 0 0 0
Dr 394 0 0
At STD N 00E0FFFF
Ne 0 ""
Po -700 2800
$EndPAD
$PAD
Sh "3" C 591 591 0 0 0
Dr 394 0 0
At STD N 00E0FFFF
Ne 0 ""
Po 750 2800
$EndPAD
$PAD
Sh "4" C 591 591 0 0 0
Dr 394 0 0
At STD N 00E0FFFF
Ne 0 ""
Po 2200 2800
$EndPAD
$PAD
Sh "5" C 591 591 0 0 0
Dr 394 0 0
At STD N 00E0FFFF
Ne 0 ""
Po 0 -2700
$EndPAD
$SHAPE3D
Na "Switch/sw_bcd_5pin.wrl"
Sc 1.6 1.6 1.6
Of 0 0 0
Ro 0 0 0
$EndSHAPE3D
$EndMODULE SW_BCD_5PIN
$MODULE switch-CK101X12
Po 0 0 0 15 4FBA76A7 00000000 ~~
Li switch-CK101X12
Cd ROTARY SWITCH
Kw ROTARY SWITCH
Sc 0
AR switch-CK101X12
Op 0 0 0
At VIRTUAL
T0 0 -5700 394 394 0 79 N V 21 N "switch-CK101X12"
T1 100 5649 394 394 0 79 N I 21 N "Value"
DS -1550 -2680 1550 -2680 60 21
DS 3100 0 1550 2680 60 21
DS 1550 2680 -1550 2680 60 21
DS -1550 2680 -3100 0 60 21
DS -3100 0 -1550 -2680 60 21
DS -500 0 550 0 60 21
DS 0 550 0 -550 60 21
DS 1550 -2680 3100 0 60 21
DS -250 3750 250 3750 60 21
DS 0 3500 0 4000 60 21
DC 0 3750 -300 4050 30 21
DC 0 0 -2575 2575 30 21
DC 0 0 -1300 1300 30 21
DA 2449 4250 2948 4220 1261 60 21
DA -2450 4250 -2179 4671 1261 60 21
DA -2449 -4250 -2948 -4220 1261 60 21
DA 0 0 -460 3370 3444 60 21
DA 0 0 1050 -590 586 60 21
DA 0 0 1670 -1010 623 60 21
DA 0 0 -590 -1050 586 60 21
DA 0 0 -1010 -1670 623 60 21
DA 0 0 -1670 1010 623 60 21
DA 0 0 -1050 590 586 60 21
DA 0 0 590 1050 586 60 21
DA 0 0 1010 1670 623 60 21
DA 2450 -4250 2179 -4671 1261 60 21
DA 0 0 1010 -1670 276 60 21
DA 0 0 590 -1050 313 60 21
DA 0 0 -1050 -590 313 60 21
DA 0 0 -1670 -1010 276 60 21
DA 0 0 -590 1050 313 60 21
DA 0 0 -1010 1670 276 60 21
DA 0 0 1050 590 313 60 21
DA 0 0 1670 1010 276 60 21
T2 -1750 3500 500 500 0 35 N V 21 N "1"
T2 -3500 2250 500 500 0 35 N V 21 N "2"
T2 -4250 250 500 500 0 35 N V 21 N "3"
T2 -4000 -2000 500 500 0 35 N V 21 N "4"
T2 -2250 -3250 500 500 0 35 N V 21 N "5"
T2 -250 -4000 500 500 0 35 N V 21 N "6"
T2 2000 -3500 500 500 0 35 N V 21 N "7"
T2 3500 -2250 500 500 0 35 N V 21 N "8"
T2 4000 -250 500 500 0 35 N V 21 N "9"
T2 4000 2000 500 500 0 35 N V 21 N "10"
T2 2250 3500 500 500 0 35 N V 21 N "11"
T2 250 4750 500 500 0 35 N V 21 N "12"
$PAD
Sh "1" C 780 780 0 0 0
Dr 520 0 0
At STD N 00E0FFFF
Ne 0 ""
Po -1120 4180
$EndPAD
$PAD
Sh "2" C 780 780 0 0 0
Dr 520 0 0
At STD N 00E0FFFF
Ne 0 ""
Po -3060 3060
$EndPAD
$PAD
Sh "3" C 780 780 0 0 0
Dr 520 0 0
At STD N 00E0FFFF
Ne 0 ""
Po -4180 1120
$EndPAD
$PAD
Sh "4" C 780 780 0 0 0
Dr 520 0 0
At STD N 00E0FFFF
Ne 0 ""
Po -4180 -1120
$EndPAD
$PAD
Sh "5" C 780 780 0 0 0
Dr 520 0 0
At STD N 00E0FFFF
Ne 0 ""
Po -3060 -3060
$EndPAD
$PAD
Sh "6" C 780 780 0 0 0
Dr 520 0 0
At STD N 00E0FFFF
Ne 0 ""
Po -1120 -4180
$EndPAD
$PAD
Sh "7" C 780 780 0 0 0
Dr 520 0 0
At STD N 00E0FFFF
Ne 0 ""
Po 1120 -4180
$EndPAD
$PAD
Sh "8" C 780 780 0 0 0
Dr 520 0 0
At STD N 00E0FFFF
Ne 0 ""
Po 3060 -3060
$EndPAD
$PAD
Sh "9" C 780 780 0 0 0
Dr 520 0 0
At STD N 00E0FFFF
Ne 0 ""
Po 4180 -1120
$EndPAD
$PAD
Sh "10" C 780 780 0 0 0
Dr 520 0 0
At STD N 00E0FFFF
Ne 0 ""
Po 4180 1120
$EndPAD
$PAD
Sh "11" C 780 780 0 0 0
Dr 520 0 0
At STD N 00E0FFFF
Ne 0 ""
Po 3060 3060
$EndPAD
$PAD
Sh "12" C 780 780 0 0 0
Dr 520 0 0
At STD N 00E0FFFF
Ne 0 ""
Po 1120 4180
$EndPAD
$PAD
Sh "A" C 780 780 0 0 0
Dr 520 0 0
At STD N 00E0FFFF
Ne 0 ""
Po -1130 1130
$EndPAD
$SHAPE3D
Na "Switch\\switch-ck101x12.wrl"
Sc 1.6 1.6 1.6
Of 0 0 0
Ro 0 0 0
$EndSHAPE3D
$EndMODULE switch-CK101X12
$MODULE switch-CK102X06
Po 0 0 0 15 4FBA7739 00000000 ~~
Li switch-CK102X06
Cd ROTARY SWITCH
Kw ROTARY SWITCH
Sc 0
AR 
Op 0 0 0
At VIRTUAL
T0 0 -5500 394 394 0 79 N V 21 N "switch-CK102X06"
T1 100 5649 394 394 0 79 N I 21 N "Value"
DS -1550 -2680 1550 -2680 60 21
DS 3100 0 1550 2680 60 21
DS 1550 2680 -1550 2680 60 21
DS -1550 2680 -3100 0 60 21
DS -3100 0 -1550 -2680 60 21
DS -500 0 550 0 60 21
DS 0 550 0 -550 60 21
DS 1550 -2680 3100 0 60 21
DS -250 3750 250 3750 60 21
DS 0 3500 0 4000 60 21
DC 0 3750 -300 4050 30 21
DC 0 0 -2575 2575 30 21
DC 0 0 -1300 1300 30 21
DA 2449 4250 2948 4220 1261 60 21
DA -2450 4250 -2179 4671 1261 60 21
DA -2449 -4250 -2948 -4220 1261 60 21
DA 0 0 -460 3370 3444 60 21
DA 0 0 1050 -590 586 60 21
DA 0 0 1670 -1010 623 60 21
DA 0 0 -590 -1050 586 60 21
DA 0 0 -1010 -1670 623 60 21
DA 0 0 -1670 1010 623 60 21
DA 0 0 -1050 590 586 60 21
DA 0 0 590 1050 586 60 21
DA 0 0 1010 1670 623 60 21
DA 2450 -4250 2179 -4671 1261 60 21
DA 0 0 1010 -1670 276 60 21
DA 0 0 590 -1050 313 60 21
DA 0 0 -1050 -590 313 60 21
DA 0 0 -1670 -1010 276 60 21
DA 0 0 -590 1050 313 60 21
DA 0 0 -1010 1670 276 60 21
DA 0 0 1050 590 313 60 21
DA 0 0 1670 1010 276 60 21
T2 -2000 3750 500 500 0 35 N V 21 N "A1"
T2 -3500 2250 500 500 0 35 N V 21 N "A2"
T2 -4250 250 500 500 0 35 N V 21 N "A3"
T2 -3750 -2000 500 500 0 35 N V 21 N "A4"
T2 -2250 -3750 500 500 0 35 N V 21 N "A5"
T2 0 -4250 500 500 0 35 N V 21 N "A6"
T2 2250 -3750 500 500 0 35 N V 21 N "C1"
T2 3500 -2250 500 500 0 35 N V 21 N "C2"
T2 4250 -250 500 500 0 35 N V 21 N "C3"
T2 4000 2000 500 500 0 35 N V 21 N "C4"
T2 2250 3750 500 500 0 35 N V 21 N "C5"
T2 250 4750 500 500 0 35 N V 21 N "C6"
$PAD
Sh "A" C 780 780 0 0 0
Dr 520 0 0
At STD N 00E0FFFF
Ne 0 ""
Po -1130 1130
$EndPAD
$PAD
Sh "A1" C 780 780 0 0 0
Dr 520 0 0
At STD N 00E0FFFF
Ne 0 ""
Po -1120 4180
$EndPAD
$PAD
Sh "A2" C 780 780 0 0 0
Dr 520 0 0
At STD N 00E0FFFF
Ne 0 ""
Po -3060 3060
$EndPAD
$PAD
Sh "A3" C 780 780 0 0 0
Dr 520 0 0
At STD N 00E0FFFF
Ne 0 ""
Po -4180 1120
$EndPAD
$PAD
Sh "A4" C 780 780 0 0 0
Dr 520 0 0
At STD N 00E0FFFF
Ne 0 ""
Po -4180 -1120
$EndPAD
$PAD
Sh "A5" C 780 780 0 0 0
Dr 520 0 0
At STD N 00E0FFFF
Ne 0 ""
Po -3060 -3060
$EndPAD
$PAD
Sh "A6" C 780 780 0 0 0
Dr 520 0 0
At STD N 00E0FFFF
Ne 0 ""
Po -1120 -4180
$EndPAD
$PAD
Sh "C" C 780 780 0 0 0
Dr 520 0 0
At STD N 00E0FFFF
Ne 0 ""
Po 1130 -1130
$EndPAD
$PAD
Sh "C1" C 780 780 0 0 0
Dr 520 0 0
At STD N 00E0FFFF
Ne 0 ""
Po 1120 -4180
$EndPAD
$PAD
Sh "C2" C 780 780 0 0 0
Dr 520 0 0
At STD N 00E0FFFF
Ne 0 ""
Po 3060 -3060
$EndPAD
$PAD
Sh "C3" C 780 780 0 0 0
Dr 520 0 0
At STD N 00E0FFFF
Ne 0 ""
Po 4180 -1120
$EndPAD
$PAD
Sh "C4" C 780 780 0 0 0
Dr 520 0 0
At STD N 00E0FFFF
Ne 0 ""
Po 4180 1120
$EndPAD
$PAD
Sh "C5" C 780 780 0 0 0
Dr 520 0 0
At STD N 00E0FFFF
Ne 0 ""
Po 3060 3060
$EndPAD
$PAD
Sh "C6" C 780 780 0 0 0
Dr 520 0 0
At STD N 00E0FFFF
Ne 0 ""
Po 1120 4180
$EndPAD
$SHAPE3D
Na "Switch\\switch-ck102x06.wrl"
Sc 1.6 1.6 1.6
Of 0 0 0
Ro 0 0 0
$EndSHAPE3D
$EndMODULE switch-CK102X06
$MODULE switch-CK103X04
Po 0 0 0 15 4FBA7786 00000000 ~~
Li switch-CK103X04
Cd ROTARY SWITCH
Kw ROTARY SWITCH
Sc 0
AR 
Op 0 0 0
At VIRTUAL
T0 0 -5450 394 394 0 79 N V 21 N "switch-CK103X04"
T1 100 5649 394 394 0 79 N I 21 N "VALUE"
DS -1550 -2680 1550 -2680 60 21
DS 3100 0 1550 2680 60 21
DS 1550 2680 -1550 2680 60 21
DS -1550 2680 -3100 0 60 21
DS -3100 0 -1550 -2680 60 21
DS -500 0 550 0 60 21
DS 0 550 0 -550 60 21
DS 1550 -2680 3100 0 60 21
DS -250 3750 250 3750 60 21
DS 0 3500 0 4000 60 21
DC 0 3750 -300 4050 30 21
DC 0 0 -2575 2575 30 21
DC 0 0 -1300 1300 30 21
DA 2449 4250 2948 4220 1261 60 21
DA -2450 4250 -2179 4671 1261 60 21
DA -2449 -4250 -2948 -4220 1261 60 21
DA 0 0 -460 3370 3444 60 21
DA 0 0 1050 -590 586 60 21
DA 0 0 1670 -1010 623 60 21
DA 0 0 -590 -1050 586 60 21
DA 0 0 -1010 -1670 623 60 21
DA 0 0 -1670 1010 623 60 21
DA 0 0 -1050 590 586 60 21
DA 0 0 590 1050 586 60 21
DA 0 0 1010 1670 623 60 21
DA 2450 -4250 2179 -4671 1261 60 21
DA 0 0 1010 -1670 276 60 21
DA 0 0 590 -1050 313 60 21
DA 0 0 -1050 -590 313 60 21
DA 0 0 -1670 -1010 276 60 21
DA 0 0 -590 1050 313 60 21
DA 0 0 -1010 1670 276 60 21
DA 0 0 1050 590 313 60 21
DA 0 0 1670 1010 276 60 21
T2 -2000 3750 500 500 0 35 N V 21 N "A1"
T2 -3500 2250 500 500 0 35 N V 21 N "A2"
T2 -4250 250 500 500 0 35 N V 21 N "A3"
T2 -3750 -2000 500 500 0 35 N V 21 N "A4"
T2 -2250 -3750 500 500 0 35 N V 21 N "B1"
T2 0 -4250 500 500 0 35 N V 21 N "B2"
T2 2000 -3500 500 500 0 35 N V 21 N "B3"
T2 3750 -2250 500 500 0 35 N V 21 N "B4"
T2 4250 -250 500 500 0 35 N V 21 N "C1"
T2 4000 2000 500 500 0 35 N V 21 N "C2"
T2 2250 3750 500 500 0 35 N V 21 N "C3"
T2 250 4750 500 500 0 35 N V 21 N "C4"
$PAD
Sh "A" C 780 780 0 0 0
Dr 520 0 0
At STD N 00E0FFFF
Ne 0 ""
Po -1130 1130
$EndPAD
$PAD
Sh "A1" C 780 780 0 0 0
Dr 520 0 0
At STD N 00E0FFFF
Ne 0 ""
Po -1120 4180
$EndPAD
$PAD
Sh "A2" C 780 780 0 0 0
Dr 520 0 0
At STD N 00E0FFFF
Ne 0 ""
Po -3060 3060
$EndPAD
$PAD
Sh "A3" C 780 780 0 0 0
Dr 520 0 0
At STD N 00E0FFFF
Ne 0 ""
Po -4180 1120
$EndPAD
$PAD
Sh "A4" C 780 780 0 0 0
Dr 520 0 0
At STD N 00E0FFFF
Ne 0 ""
Po -4180 -1120
$EndPAD
$PAD
Sh "B" C 780 780 0 0 0
Dr 520 0 0
At STD N 00E0FFFF
Ne 0 ""
Po 0 -1598
$EndPAD
$PAD
Sh "B1" C 780 780 0 0 0
Dr 520 0 0
At STD N 00E0FFFF
Ne 0 ""
Po -3060 -3060
$EndPAD
$PAD
Sh "B2" C 780 780 0 0 0
Dr 520 0 0
At STD N 00E0FFFF
Ne 0 ""
Po -1120 -4180
$EndPAD
$PAD
Sh "B3" C 780 780 0 0 0
Dr 520 0 0
At STD N 00E0FFFF
Ne 0 ""
Po 1120 -4180
$EndPAD
$PAD
Sh "B4" C 780 780 0 0 0
Dr 520 0 0
At STD N 00E0FFFF
Ne 0 ""
Po 3060 -3060
$EndPAD
$PAD
Sh "C" C 780 780 0 0 0
Dr 520 0 0
At STD N 00E0FFFF
Ne 0 ""
Po 1130 1130
$EndPAD
$PAD
Sh "C1" C 780 780 0 0 0
Dr 520 0 0
At STD N 00E0FFFF
Ne 0 ""
Po 4180 -1120
$EndPAD
$PAD
Sh "C2" C 780 780 0 0 0
Dr 520 0 0
At STD N 00E0FFFF
Ne 0 ""
Po 4180 1120
$EndPAD
$PAD
Sh "C3" C 780 780 0 0 0
Dr 520 0 0
At STD N 00E0FFFF
Ne 0 ""
Po 3060 3060
$EndPAD
$PAD
Sh "C4" C 780 780 0 0 0
Dr 520 0 0
At STD N 00E0FFFF
Ne 0 ""
Po 1120 4180
$EndPAD
$SHAPE3D
Na "Switch\\switch-ck103x04.wrl"
Sc 1.6 1.6 1.6
Of 0 0 0
Ro 0 0 0
$EndSHAPE3D
$EndMODULE switch-CK103X04
$MODULE switch-CK104X03
Po 0 0 0 15 4FBA77D6 00000000 ~~
Li switch-CK104X03
Cd ROTARY SWITCH
Kw ROTARY SWITCH
Sc 0
AR 
Op 0 0 0
At VIRTUAL
T0 0 -5350 394 394 0 79 N V 21 N "switch-CK104X03"
T1 0 5650 394 394 0 79 N I 21 N "VALUE"
DS -1550 -2680 1550 -2680 60 21
DS 3100 0 1550 2680 60 21
DS 1550 2680 -1550 2680 60 21
DS -1550 2680 -3100 0 60 21
DS -3100 0 -1550 -2680 60 21
DS -500 0 550 0 60 21
DS 0 550 0 -550 60 21
DS 1550 -2680 3100 0 60 21
DS -250 3750 250 3750 60 21
DS 0 3500 0 4000 60 21
DC 0 3750 -300 4050 30 21
DC 0 0 -2575 2575 30 21
DC 0 0 -1300 1300 30 21
DA 2449 4250 2948 4220 1261 60 21
DA -2450 4250 -2179 4671 1261 60 21
DA -2449 -4250 -2948 -4220 1261 60 21
DA 0 0 -460 3370 3444 60 21
DA 0 0 1050 -590 586 60 21
DA 0 0 1670 -1010 623 60 21
DA 0 0 -590 -1050 586 60 21
DA 0 0 -1010 -1670 623 60 21
DA 0 0 -1670 1010 623 60 21
DA 0 0 -1050 590 586 60 21
DA 0 0 590 1050 586 60 21
DA 0 0 1010 1670 623 60 21
DA 2450 -4250 2179 -4671 1261 60 21
DA 0 0 1010 -1670 276 60 21
DA 0 0 590 -1050 313 60 21
DA 0 0 -1050 -590 313 60 21
DA 0 0 -1670 -1010 276 60 21
DA 0 0 -590 1050 313 60 21
DA 0 0 -1010 1670 276 60 21
DA 0 0 1050 590 313 60 21
DA 0 0 1670 1010 276 60 21
T2 -2000 4000 500 500 0 35 N V 21 N "A1"
T2 -3500 2250 500 500 0 35 N V 21 N "A2"
T2 -4250 250 500 500 0 35 N V 21 N "A3"
T2 -3750 -2000 500 500 0 35 N V 21 N "B1"
T2 -2000 -3500 500 500 0 35 N V 21 N "B2"
T2 0 -4250 500 500 0 35 N V 21 N "B3"
T2 2250 -3750 500 500 0 35 N V 21 N "C1"
T2 3750 -2250 500 500 0 35 N V 21 N "C2"
T2 4500 -250 500 500 0 35 N V 21 N "C3"
T2 4000 2000 500 500 0 35 N V 21 N "D1"
T2 2250 3750 500 500 0 35 N V 21 N "D2"
T2 0 4750 500 500 0 35 N V 21 N "D3"
$PAD
Sh "A" C 780 780 0 0 0
Dr 520 0 0
At STD N 00E0FFFF
Ne 0 ""
Po -1130 1130
$EndPAD
$PAD
Sh "A1" C 780 780 0 0 0
Dr 520 0 0
At STD N 00E0FFFF
Ne 0 ""
Po -1120 4180
$EndPAD
$PAD
Sh "A2" C 780 780 0 0 0
Dr 520 0 0
At STD N 00E0FFFF
Ne 0 ""
Po -3060 3060
$EndPAD
$PAD
Sh "A3" C 780 780 0 0 0
Dr 520 0 0
At STD N 00E0FFFF
Ne 0 ""
Po -4180 1120
$EndPAD
$PAD
Sh "B" C 780 780 0 0 0
Dr 520 0 0
At STD N 00E0FFFF
Ne 0 ""
Po -1130 -1130
$EndPAD
$PAD
Sh "B1" C 780 780 0 0 0
Dr 520 0 0
At STD N 00E0FFFF
Ne 0 ""
Po -4180 -1120
$EndPAD
$PAD
Sh "B2" C 780 780 0 0 0
Dr 520 0 0
At STD N 00E0FFFF
Ne 0 ""
Po -3060 -3060
$EndPAD
$PAD
Sh "B3" C 780 780 0 0 0
Dr 520 0 0
At STD N 00E0FFFF
Ne 0 ""
Po -1120 -4180
$EndPAD
$PAD
Sh "C" C 780 780 0 0 0
Dr 520 0 0
At STD N 00E0FFFF
Ne 0 ""
Po 1130 -1130
$EndPAD
$PAD
Sh "C1" C 780 780 0 0 0
Dr 520 0 0
At STD N 00E0FFFF
Ne 0 ""
Po 1120 -4180
$EndPAD
$PAD
Sh "C2" C 780 780 0 0 0
Dr 520 0 0
At STD N 00E0FFFF
Ne 0 ""
Po 3060 -3060
$EndPAD
$PAD
Sh "C3" C 780 780 0 0 0
Dr 520 0 0
At STD N 00E0FFFF
Ne 0 ""
Po 4180 -1120
$EndPAD
$PAD
Sh "D" C 780 780 0 0 0
Dr 520 0 0
At STD N 00E0FFFF
Ne 0 ""
Po 1130 1130
$EndPAD
$PAD
Sh "D1" C 780 780 0 0 0
Dr 520 0 0
At STD N 00E0FFFF
Ne 0 ""
Po 4180 1120
$EndPAD
$PAD
Sh "D2" C 780 780 0 0 0
Dr 520 0 0
At STD N 00E0FFFF
Ne 0 ""
Po 3060 3060
$EndPAD
$PAD
Sh "D3" C 780 780 0 0 0
Dr 520 0 0
At STD N 00E0FFFF
Ne 0 ""
Po 1120 4180
$EndPAD
$SHAPE3D
Na "Switch\\switch-ck104x03.wrl"
Sc 1.6 1.6 1.6
Of 0 0 0
Ro 0 0 0
$EndSHAPE3D
$EndMODULE switch-CK104X03
$MODULE switch-ITT-RT
Po 0 0 0 15 4FBA78CD 00000000 ~~
Li switch-ITT-RT
Cd ROTARY SWITCH
Kw ROTARY SWITCH
Sc 0
AR 
Op 0 0 0
At VIRTUAL
T0 -3000 -6050 600 600 0 35 N V 21 N "H"
T1 -3000 6250 600 600 0 35 N V 21 N "A"
T2 0 6250 600 600 0 35 N V 21 N "D"
DS -200 900 200 900 26 21
DS 200 900 200 -900 26 21
DS -200 -900 200 -900 26 21
DS -200 900 -200 -900 26 21
DS -630 3900 -3300 3900 60 21
DS -3900 3300 -3900 -3300 60 21
DS -3300 -3900 3300 -3900 60 21
DS 3900 -3300 3900 3300 60 21
DS 3300 3900 630 3900 60 21
DS -4350 4550 -4350 -4550 60 21
DS 4350 -4550 4350 4550 60 21
DS 3350 5150 2650 5150 60 21
DS 2350 5150 1650 5150 60 21
DS 1350 5150 650 5150 60 21
DS 350 5150 -350 5150 60 21
DS -650 5150 -1350 5150 60 21
DS -1650 5150 -2350 5150 60 21
DS -2650 5150 -3350 5150 60 21
DS -3350 5150 -3750 5150 60 21
DS -2350 5150 -2650 5150 60 21
DS -1350 5150 -1650 5150 60 21
DS -350 5150 -650 5150 60 21
DS 650 5150 350 5150 60 21
DS 1650 5150 1350 5150 60 21
DS 2350 5150 2650 5150 60 21
DS 3350 5150 3750 5150 60 21
DS 3350 -5150 3750 -5150 60 21
DS 2350 -5150 2650 -5150 60 21
DS 3350 -5150 2650 -5150 60 21
DS 1350 -5150 1650 -5150 60 21
DS 2350 -5150 1650 -5150 60 21
DS 1350 -5150 650 -5150 60 21
DS 350 -5150 650 -5150 60 21
DS 350 -5150 -350 -5150 60 21
DS -650 -5150 -350 -5150 60 21
DS -1650 -5150 -1350 -5150 60 21
DS -650 -5150 -1350 -5150 60 21
DS -1650 -5150 -2350 -5150 60 21
DS -2650 -5150 -2350 -5150 60 21
DS -2650 -5150 -3350 -5150 60 21
DS -3350 -5150 -3750 -5150 60 21
DS -400 3750 400 3750 60 21
DS 0 4150 0 3350 60 21
DS -2849 0 -1429 2470 60 21
DS -1429 2470 1429 2470 60 21
DS 1429 2470 2849 0 60 21
DS -200 900 -200 -900 60 21
DS -200 -900 200 -900 60 21
DS 200 -900 200 900 60 21
DS 200 900 -200 900 60 21
DS 2849 0 1429 -2470 60 21
DS 1429 -2470 -1429 -2470 60 21
DS -1429 -2470 -2849 0 60 21
DS -2600 0 -1295 -2239 460 21
DS -1295 -2239 1295 -2239 460 21
DS 1295 -2239 2579 0 460 21
DS 2579 0 1295 2250 460 21
DS 1295 2250 -1284 2250 460 21
DS -1284 2250 -2547 74 460 21
DC 0 3750 -325 4075 30 21
DC 0 0 -975 975 30 21
DC 0 0 -1424 1424 30 21
DC 0 0 -600 600 30 21
DC 0 0 -1104 1104 250 21
DA 0 0 -550 3410 3416 60 21
DA -3300 3300 -3300 3900 900 60 21
DA 3300 -3300 3300 -3900 900 60 21
DA 3300 3300 3900 3300 900 60 21
DA -3750 4550 -3750 5150 900 60 21
DA -3750 -4550 -4350 -4550 900 60 21
DA 3750 -4550 3750 -5150 900 60 21
DA 3750 4550 4350 4550 900 60 21
T2 -2000 6250 600 600 0 35 N V 21 N "B"
T2 -1000 6250 600 600 0 35 N V 21 N "C"
T2 1000 6250 600 600 0 35 N V 21 N "E"
T2 2000 6250 600 600 0 35 N V 21 N "F"
T2 3000 6250 600 600 0 35 N V 21 N "G"
T2 -2000 -6050 600 600 0 35 N V 21 N "I"
T2 -1000 -6050 600 600 0 35 N V 21 N "J"
T2 0 -6050 600 600 0 35 N V 21 N "K"
T2 1000 -6050 600 600 0 35 N V 21 N "L"
T2 2000 -6050 600 600 0 35 N V 21 N "M"
T2 3000 -6050 600 600 0 35 N V 21 N "N"
T2 -4900 0 394 394 900 79 N V 21 N "switch-ITT-RT"
T2 5000 0 394 394 900 79 N I 21 N ">VALUE"
$PAD
Sh "A" O 600 1200 0 0 0
Dr 400 0 0
At STD N 00E0FFFF
Ne 0 ""
Po -3000 5000
$EndPAD
$PAD
Sh "B" O 600 1200 0 0 0
Dr 400 0 0
At STD N 00E0FFFF
Ne 0 ""
Po -2000 5000
$EndPAD
$PAD
Sh "C" O 600 1200 0 0 0
Dr 400 0 0
At STD N 00E0FFFF
Ne 0 ""
Po -1000 5000
$EndPAD
$PAD
Sh "D" O 600 1200 0 0 0
Dr 400 0 0
At STD N 00E0FFFF
Ne 0 ""
Po 0 5000
$EndPAD
$PAD
Sh "E" O 600 1200 0 0 0
Dr 400 0 0
At STD N 00E0FFFF
Ne 0 ""
Po 1000 5000
$EndPAD
$PAD
Sh "F" O 600 1200 0 0 0
Dr 400 0 0
At STD N 00E0FFFF
Ne 0 ""
Po 2000 5000
$EndPAD
$PAD
Sh "G" O 600 1200 0 0 0
Dr 400 0 0
At STD N 00E0FFFF
Ne 0 ""
Po 3000 5000
$EndPAD
$PAD
Sh "H" O 600 1200 0 0 0
Dr 400 0 0
At STD N 00E0FFFF
Ne 0 ""
Po -3000 -5000
$EndPAD
$PAD
Sh "I" O 600 1200 0 0 0
Dr 400 0 0
At STD N 00E0FFFF
Ne 0 ""
Po -2000 -5000
$EndPAD
$PAD
Sh "J" O 600 1200 0 0 0
Dr 400 0 0
At STD N 00E0FFFF
Ne 0 ""
Po -1000 -5000
$EndPAD
$PAD
Sh "K" O 600 1200 0 0 0
Dr 400 0 0
At STD N 00E0FFFF
Ne 0 ""
Po 0 -5000
$EndPAD
$PAD
Sh "L" O 600 1200 0 0 0
Dr 400 0 0
At STD N 00E0FFFF
Ne 0 ""
Po 1000 -5000
$EndPAD
$PAD
Sh "M" O 600 1200 0 0 0
Dr 400 0 0
At STD N 00E0FFFF
Ne 0 ""
Po 2000 -5000
$EndPAD
$PAD
Sh "N" O 600 1200 0 0 0
Dr 400 0 0
At STD N 00E0FFFF
Ne 0 ""
Po 3000 -5000
$EndPAD
$SHAPE3D
Na "Switch\\switch-ITT-RT.wrl"
Sc 1.6 1.6 1.6
Of 0 0 0
Ro 0 0 0
$EndSHAPE3D
$EndMODULE switch-ITT-RT
$EndLIBRARY
