PCBNEW-LibModule-V1  Čt 21. červen 2012, 22:33:53 CEST
# encoding utf-8
Units deci-mils
$INDEX
D2PAK
SOT89
$EndINDEX
$MODULE D2PAK
Po 0 0 0 15 42B2A79C 00000000 ~~
Li D2PAK
Sc 0
AR 
Op 0 0 0
T0 60 -4290 500 500 0 80 N V 21 N "D2PAK"
T1 100 4000 500 500 0 80 N V 21 N "VAL**"
DS -820 1860 -820 3010 120 21
DS -1170 1850 -1170 3010 120 21
DS 810 1830 1150 1830 120 21
DS 1150 1850 1150 3010 120 21
DS 820 1830 820 3000 120 21
DS 840 3020 1130 3020 120 21
DS -1160 3020 -830 3020 120 21
DS 550 -3560 2150 -3410 120 21
DS -140 1180 130 1180 120 21
DS 1190 1830 1210 1820 120 21
DS 1210 730 1210 1810 120 21
DS 760 720 760 1820 120 21
DS -1210 1830 -800 1830 120 21
DS -770 1820 -770 700 120 21
DS -770 700 -780 700 120 21
DS -1240 1840 -1240 720 120 21
DS -140 710 -140 1180 120 21
DS 130 1180 130 740 120 21
DS -2140 -3410 -580 -3580 120 21
DS -2140 -3130 2140 -3140 120 21
DS -610 -3580 540 -3570 120 21
DS 2160 -3350 2160 680 120 21
DS 2160 680 -2140 690 120 21
DS -2140 690 -2140 -3420 120 21
$PAD
Sh "1" R 591 1260 0 0 0
Dr 0 0 0
At SMD N 00888000
Ne 0 ""
Po -990 2500
$EndPAD
$PAD
Sh "3" R 591 1260 0 0 0
Dr 0 0 0
At SMD N 00888000
Ne 0 ""
Po 990 2500
$EndPAD
$PAD
Sh "2" R 4331 4331 0 0 0
Dr 0 0 0
At SMD N 00888000
Ne 0 ""
Po 0 -1460
$EndPAD
$EndMODULE D2PAK
$MODULE SOT89
Po 0 0 0 15 4FE38489 00000000 ~~
Li SOT89
Sc 0
AR 
Op 0 0 0
T0 0 -1400 394 394 0 78 N V 21 N "SOT89"
T1 0 1500 393 393 0 78 N I 21 N "Value"
DS 787 512 906 512 75 21
DS 157 512 394 512 75 21
DS -394 512 -197 512 75 21
DS -906 512 -787 512 75 21
DS -472 -512 -906 -512 75 21
DS 472 -512 906 -512 75 21
DS 906 512 906 -512 75 21
DS -906 -512 -906 512 75 21
$PAD
Sh "1" R 276 472 0 0 0
Dr 0 0 0
At SMD N 00888000
Ne 0 ""
Po -591 748
$EndPAD
$PAD
Sh "2" R 276 787 0 0 0
Dr 0 0 0
At SMD N 00888000
Ne 0 ""
Po 0 591
$EndPAD
$PAD
Sh "3" R 276 472 0 0 0
Dr 0 0 0
At SMD N 00888000
Ne 0 ""
Po 591 748
$EndPAD
$PAD
Sh "2" O 865 1181 0 0 0
Dr 0 0 0
At SMD N 00888000
Ne 0 ""
Po 0 -354
$EndPAD
$SHAPE3D
Na "smd/SOT89.wrl"
Sc 1 1 1
Of 0 0 0
Ro 0 0 0
$EndSHAPE3D
$EndMODULE SOT89
$EndLIBRARY
