PCBNEW-LibModule-V1  27/5/2007-23:01:12
$INDEX
USB_B
$EndINDEX
$MODULE USB_B
Po 0 0 0 15 465A0DA7 00000000 ~~
Li USB_B
Sc 00000000
Op 0 0 0
T0 60 -3680 600 600 0 120 N V 21 "USB_B"
T1 0 2280 600 600 0 120 N V 21 "VAL**"
DS -2380 3280 2380 3280 150 21
DS 2380 3280 2380 -2980 150 21
DS 2380 -2980 -2360 -2980 150 21
DS -2360 -2980 -2360 3260 150 21
$PAD
Sh "A" O 800 800 0 0 0
Dr 800 0 0
At MECA N 00F0FFFF
Ne 0 ""
Po -2360 -760
$EndPAD
$PAD
Sh "A1" C 800 800 0 0 0
Dr 800 0 0
At MECA N 00F0FFFF
Ne 0 ""
Po 2380 -760
$EndPAD
$PAD
Sh "3" C 362 362 0 0 0
Dr 256 0 0
At MECA N 00F0FFFF
Ne 0 "3"
Po -480 -1840
$EndPAD
$PAD
Sh "4" C 362 362 0 0 0
Dr 256 0 0
At MECA N 00F0FFFF
Ne 0 ""
Po 520 -1840
$EndPAD
$PAD
Sh "2" C 362 362 0 0 0
Dr 256 0 0
At MECA N 00F0FFFF
Ne 0 "2"
Po -480 -2660
$EndPAD
$PAD
Sh "1" C 362 362 0 0 0
Dr 256 0 0
At MECA N 00F0FFFF
Ne 0 "1"
Po 520 -2660
$EndPAD
$EndMODULE  USB_B
$EndLIBRARY
