PCBNEW-LibModule-V1  gio 18 ago 2011 14:24:39 CEST
$INDEX
7segdisp
led_3mm_clear
led_3mm_green
led_3mm_red
led_3mm_yellow
led_5mm_clear
led_5mm_green
led_5mm_red
led_5mm_yellow
7segdisp_HDSP
7segdisp_sa52
7segdisp_sa05
$EndINDEX
$MODULE led_3mm_clear
Po 0 0 0 15 4B90DAC9 00000000 ~~
Li led_3mm_clear
Cd 3mm clear led
Kw led
Sc 00000000
AR
Op 0 0 0
T0 0 1500 600 600 0 120 N V 21 N"led_3mm_clear"
T1 0 -1500 600 600 0 120 N V 21 N"VAL**"
DS 410 460 -440 460 120 21
DS -350 530 -340 540 120 21
DS -470 430 -350 530 120 21
DS -580 270 -470 430 120 21
DS -630 100 -580 270 120 21
DS -630 -140 -630 100 120 21
DS -560 -320 -630 -140 120 21
DS -410 -490 -560 -320 120 21
DS -210 -600 -410 -490 120 21
DS -10 -630 -210 -600 120 21
DS 0 -630 200 -600 120 21
DS 200 -600 400 -490 120 21
DS 400 -490 550 -320 120 21
DS 550 -320 620 -140 120 21
DS 620 -140 620 100 120 21
DS 620 100 570 270 120 21
DS 570 270 460 430 120 21
DS 460 430 340 530 120 21
DS 340 530 330 540 120 21
DS 330 540 -320 540 120 21
$PAD
Sh "1" C 787 787 0 0 0
Dr 315 0 0
At STD N 00E0FFFF
Ne 0 ""
Po 0 -500
$EndPAD
$PAD
Sh "2" C 787 787 0 0 0
Dr 315 0 0
At STD N 00E0FFFF
Ne 0 ""
Po 0 500
$EndPAD
$SHAPE3D
Na "walter\indicators\led_3mm_clear.wrl"
Sc 1.000000 1.000000 1.000000
Of 0.000000 0.000000 0.000000
Ro 0.000000 0.000000 0.000000
$EndSHAPE3D
$EndMODULE  led_3mm_clear
$MODULE led_5mm_yellow
Po 0 0 0 15 4B90DAD2 00000000 ~~
Li led_5mm_yellow
Cd 5mm yellow led
Kw led
Sc 00000000
AR
Op 0 0 0
T0 0 1500 600 600 0 120 N V 21 N"led_5mm_yellow"
T1 0 -1500 600 600 0 120 N V 21 N"VAL**"
DS -780 650 -550 850 120 21
DS -930 410 -780 650 120 21
DS -1010 110 -930 410 120 21
DS -1000 -150 -1010 110 120 21
DS -930 -410 -1000 -150 120 21
DS -750 -700 -930 -410 120 21
DS -530 -880 -750 -700 120 21
DS -280 -1000 -530 -880 120 21
DS 20 -1040 -280 -1000 120 21
DS 0 -1040 300 -1000 120 21
DS 300 -1000 550 -880 120 21
DS 550 -880 770 -700 120 21
DS 770 -700 950 -410 120 21
DS 950 -410 1020 -150 120 21
DS 1020 -150 1030 110 120 21
DS 1030 110 950 410 120 21
DS 950 410 800 650 120 21
DS 800 650 570 850 120 21
DS 570 850 -550 850 120 21
$PAD
Sh "1" C 787 787 0 0 0
Dr 315 0 0
At STD N 00E0FFFF
Ne 0 ""
Po 0 -500
$EndPAD
$PAD
Sh "2" C 787 787 0 0 0
Dr 315 0 0
At STD N 00E0FFFF
Ne 0 ""
Po 0 500
$EndPAD
$SHAPE3D
Na "walter\indicators\led_5mm_yellow.wrl"
Sc 1.000000 1.000000 1.000000
Of 0.000000 0.000000 0.000000
Ro 0.000000 0.000000 0.000000
$EndSHAPE3D
$EndMODULE  led_5mm_yellow
$MODULE led_5mm_red
Po 0 0 0 15 4B90DAD9 00000000 ~~
Li led_5mm_red
Cd 5mm red led
Kw led
Sc 00000000
AR
Op 0 0 0
T0 0 1500 600 600 0 120 N V 21 N"led_5mm_red"
T1 0 -1500 600 600 0 120 N V 21 N"VAL**"
DS -780 650 -550 850 120 21
DS -930 410 -780 650 120 21
DS -1010 110 -930 410 120 21
DS -1000 -150 -1010 110 120 21
DS -930 -410 -1000 -150 120 21
DS -750 -700 -930 -410 120 21
DS -530 -880 -750 -700 120 21
DS -280 -1000 -530 -880 120 21
DS 20 -1040 -280 -1000 120 21
DS 0 -1040 300 -1000 120 21
DS 300 -1000 550 -880 120 21
DS 550 -880 770 -700 120 21
DS 770 -700 950 -410 120 21
DS 950 -410 1020 -150 120 21
DS 1020 -150 1030 110 120 21
DS 1030 110 950 410 120 21
DS 950 410 800 650 120 21
DS 800 650 570 850 120 21
DS 570 850 -550 850 120 21
$PAD
Sh "1" C 787 787 0 0 0
Dr 315 0 0
At STD N 00E0FFFF
Ne 0 ""
Po 0 -500
$EndPAD
$PAD
Sh "2" C 787 787 0 0 0
Dr 315 0 0
At STD N 00E0FFFF
Ne 0 ""
Po 0 500
$EndPAD
$SHAPE3D
Na "walter\indicators\led_5mm_red.wrl"
Sc 1.000000 1.000000 1.000000
Of 0.000000 0.000000 0.000000
Ro 0.000000 0.000000 0.000000
$EndSHAPE3D
$EndMODULE  led_5mm_red
$MODULE led_5mm_green
Po 0 0 0 15 4B90DAE1 00000000 ~~
Li led_5mm_green
Cd 5mm green led
Kw led
Sc 00000000
AR
Op 0 0 0
T0 0 1500 600 600 0 120 N V 21 N"led_5mm_green"
T1 0 -1500 600 600 0 120 N V 21 N"VAL**"
DS -780 650 -550 850 120 21
DS -930 410 -780 650 120 21
DS -1010 110 -930 410 120 21
DS -1000 -150 -1010 110 120 21
DS -930 -410 -1000 -150 120 21
DS -750 -700 -930 -410 120 21
DS -530 -880 -750 -700 120 21
DS -280 -1000 -530 -880 120 21
DS 20 -1040 -280 -1000 120 21
DS 0 -1040 300 -1000 120 21
DS 300 -1000 550 -880 120 21
DS 550 -880 770 -700 120 21
DS 770 -700 950 -410 120 21
DS 950 -410 1020 -150 120 21
DS 1020 -150 1030 110 120 21
DS 1030 110 950 410 120 21
DS 950 410 800 650 120 21
DS 800 650 570 850 120 21
DS 570 850 -550 850 120 21
$PAD
Sh "1" C 787 787 0 0 0
Dr 315 0 0
At STD N 00E0FFFF
Ne 0 ""
Po 0 -500
$EndPAD
$PAD
Sh "2" C 787 787 0 0 0
Dr 315 0 0
At STD N 00E0FFFF
Ne 0 ""
Po 0 500
$EndPAD
$SHAPE3D
Na "walter\indicators\led_5mm_green.wrl"
Sc 1.000000 1.000000 1.000000
Of 0.000000 0.000000 0.000000
Ro 0.000000 0.000000 0.000000
$EndSHAPE3D
$EndMODULE  led_5mm_green
$MODULE led_5mm_clear
Po 0 0 0 15 4B90DAE9 00000000 ~~
Li led_5mm_clear
Cd 5mm clear led
Kw led
Sc 00000000
AR
Op 0 0 0
T0 0 1500 600 600 0 120 N V 21 N"led_5mm_clear"
T1 0 -1500 600 600 0 120 N V 21 N"VAL**"
DS -780 650 -550 850 120 21
DS -930 410 -780 650 120 21
DS -1010 110 -930 410 120 21
DS -1000 -150 -1010 110 120 21
DS -930 -410 -1000 -150 120 21
DS -750 -700 -930 -410 120 21
DS -530 -880 -750 -700 120 21
DS -280 -1000 -530 -880 120 21
DS 20 -1040 -280 -1000 120 21
DS 0 -1040 300 -1000 120 21
DS 300 -1000 550 -880 120 21
DS 550 -880 770 -700 120 21
DS 770 -700 950 -410 120 21
DS 950 -410 1020 -150 120 21
DS 1020 -150 1030 110 120 21
DS 1030 110 950 410 120 21
DS 950 410 800 650 120 21
DS 800 650 570 850 120 21
DS 570 850 -550 850 120 21
$PAD
Sh "1" C 787 787 0 0 0
Dr 315 0 0
At STD N 00E0FFFF
Ne 0 ""
Po 0 -500
$EndPAD
$PAD
Sh "2" C 787 787 0 0 0
Dr 315 0 0
At STD N 00E0FFFF
Ne 0 ""
Po 0 500
$EndPAD
$SHAPE3D
Na "walter\indicators\led_5mm_clear.wrl"
Sc 1.000000 1.000000 1.000000
Of 0.000000 0.000000 0.000000
Ro 0.000000 0.000000 0.000000
$EndSHAPE3D
$EndMODULE  led_5mm_clear
$MODULE led_3mm_yellow
Po 0 0 0 15 4B90DAF1 00000000 ~~
Li led_3mm_yellow
Cd 3mm yellow led
Kw led
Sc 00000000
AR
Op 0 0 0
T0 0 1500 600 600 0 120 N V 21 N"led_3mm_yellow"
T1 0 -1500 600 600 0 120 N V 21 N"VAL**"
DS 410 460 -440 460 120 21
DS -350 530 -340 540 120 21
DS -470 430 -350 530 120 21
DS -580 270 -470 430 120 21
DS -630 100 -580 270 120 21
DS -630 -140 -630 100 120 21
DS -560 -320 -630 -140 120 21
DS -410 -490 -560 -320 120 21
DS -210 -600 -410 -490 120 21
DS -10 -630 -210 -600 120 21
DS 0 -630 200 -600 120 21
DS 200 -600 400 -490 120 21
DS 400 -490 550 -320 120 21
DS 550 -320 620 -140 120 21
DS 620 -140 620 100 120 21
DS 620 100 570 270 120 21
DS 570 270 460 430 120 21
DS 460 430 340 530 120 21
DS 340 530 330 540 120 21
DS 330 540 -320 540 120 21
$PAD
Sh "1" C 787 787 0 0 0
Dr 315 0 0
At STD N 00E0FFFF
Ne 0 ""
Po 0 -500
$EndPAD
$PAD
Sh "2" C 787 787 0 0 0
Dr 315 0 0
At STD N 00E0FFFF
Ne 0 ""
Po 0 500
$EndPAD
$SHAPE3D
Na "walter\indicators\led_3mm_yellow.wrl"
Sc 1.000000 1.000000 1.000000
Of 0.000000 0.000000 0.000000
Ro 0.000000 0.000000 0.000000
$EndSHAPE3D
$EndMODULE  led_3mm_yellow
$MODULE led_3mm_red
Po 0 0 0 15 4B90DAFA 00000000 ~~
Li led_3mm_red
Cd 3mm red led
Kw led
Sc 00000000
AR
Op 0 0 0
T0 0 1500 600 600 0 120 N V 21 N"led_3mm_red"
T1 0 -1500 600 600 0 120 N V 21 N"VAL**"
DS 410 460 -440 460 120 21
DS -350 530 -340 540 120 21
DS -470 430 -350 530 120 21
DS -580 270 -470 430 120 21
DS -630 100 -580 270 120 21
DS -630 -140 -630 100 120 21
DS -560 -320 -630 -140 120 21
DS -410 -490 -560 -320 120 21
DS -210 -600 -410 -490 120 21
DS -10 -630 -210 -600 120 21
DS 0 -630 200 -600 120 21
DS 200 -600 400 -490 120 21
DS 400 -490 550 -320 120 21
DS 550 -320 620 -140 120 21
DS 620 -140 620 100 120 21
DS 620 100 570 270 120 21
DS 570 270 460 430 120 21
DS 460 430 340 530 120 21
DS 340 530 330 540 120 21
DS 330 540 -320 540 120 21
$PAD
Sh "1" C 787 787 0 0 0
Dr 315 0 0
At STD N 00E0FFFF
Ne 0 ""
Po 0 -500
$EndPAD
$PAD
Sh "2" C 787 787 0 0 0
Dr 315 0 0
At STD N 00E0FFFF
Ne 0 ""
Po 0 500
$EndPAD
$SHAPE3D
Na "walter\indicators\led_3mm_red.wrl"
Sc 1.000000 1.000000 1.000000
Of 0.000000 0.000000 0.000000
Ro 0.000000 0.000000 0.000000
$EndSHAPE3D
$EndMODULE  led_3mm_red
$MODULE led_3mm_green
Po 0 0 0 15 4B90DB02 00000000 ~~
Li led_3mm_green
Cd 3mm green led
Kw led
Sc 00000000
AR
Op 0 0 0
T0 0 1500 600 600 0 120 N V 21 N"led_3mm_green"
T1 0 -1500 600 600 0 120 N V 21 N"VAL**"
DS 410 460 -440 460 120 21
DS -350 530 -340 540 120 21
DS -470 430 -350 530 120 21
DS -580 270 -470 430 120 21
DS -630 100 -580 270 120 21
DS -630 -140 -630 100 120 21
DS -560 -320 -630 -140 120 21
DS -410 -490 -560 -320 120 21
DS -210 -600 -410 -490 120 21
DS -10 -630 -210 -600 120 21
DS 0 -630 200 -600 120 21
DS 200 -600 400 -490 120 21
DS 400 -490 550 -320 120 21
DS 550 -320 620 -140 120 21
DS 620 -140 620 100 120 21
DS 620 100 570 270 120 21
DS 570 270 460 430 120 21
DS 460 430 340 530 120 21
DS 340 530 330 540 120 21
DS 330 540 -320 540 120 21
$PAD
Sh "1" C 787 787 0 0 0
Dr 315 0 0
At STD N 00E0FFFF
Ne 0 ""
Po 0 -500
$EndPAD
$PAD
Sh "2" C 787 787 0 0 0
Dr 315 0 0
At STD N 00E0FFFF
Ne 0 ""
Po 0 500
$EndPAD
$SHAPE3D
Na "walter\indicators\led_3mm_green.wrl"
Sc 1.000000 1.000000 1.000000
Of 0.000000 0.000000 0.000000
Ro 0.000000 0.000000 0.000000
$EndSHAPE3D
$EndMODULE  led_3mm_green
$MODULE 7segdisp
Po 0 0 0 15 4E4D041C 00000000 ~~
Li 7segdisp
Cd 7 segments display
Kw display
Sc 00000000
AR
Op 0 0 0
T0 0 -3000 700 450 0 113 N V 21 N"DISP***"
T1 0 3100 700 400 0 100 N V 21 N"7segdisp"
DS -1500 -2000 -1000 -2500 120 21
DC -950 -1450 -850 -1350 120 21
DS -950 1300 -700 200 120 21
DS 350 1300 600 200 120 21
DS 650 -150 900 -1300 120 21
DS -650 -150 -400 -1300 120 21
DS -850 1500 200 1500 120 21
DS -250 -1500 800 -1500 120 21
DS -550 0 500 0 120 21
DS -1500 -2300 -1300 -2500 120 21
DS -1500 -2150 -1150 -2500 120 21
DS 1500 -2500 -1500 -2500 120 21
DS -1500 -2500 -1500 2500 120 21
DS -1500 2500 1500 2500 120 21
DS 1500 2500 1500 -2500 120 21
$PAD
Sh "1" R 866 591 0 0 0
Dr 315 0 0
At STD N 00E0FFFF
Ne 0 ""
Po -1000 -2000
$EndPAD
$PAD
Sh "2" O 866 591 0 0 0
Dr 315 0 0
At STD N 00E0FFFF
Ne 0 ""
Po -1000 -1000
$EndPAD
$PAD
Sh "3" O 866 591 0 0 0
Dr 315 0 0
At STD N 00E0FFFF
Ne 0 ""
Po -1000 0
$EndPAD
$PAD
Sh "4" O 866 591 0 0 0
Dr 315 0 0
At STD N 00E0FFFF
Ne 0 ""
Po -1000 1000
$EndPAD
$PAD
Sh "5" O 866 591 0 0 0
Dr 315 0 0
At STD N 00E0FFFF
Ne 0 ""
Po -1000 2000
$EndPAD
$PAD
Sh "6" O 866 591 0 0 0
Dr 315 0 0
At STD N 00E0FFFF
Ne 0 ""
Po 1000 2000
$EndPAD
$PAD
Sh "7" O 866 591 0 0 0
Dr 315 0 0
At STD N 00E0FFFF
Ne 0 ""
Po 1000 1000
$EndPAD
$PAD
Sh "8" O 866 591 0 0 0
Dr 315 0 0
At STD N 00E0FFFF
Ne 0 ""
Po 1000 0
$EndPAD
$PAD
Sh "9" O 866 591 0 0 0
Dr 315 0 0
At STD N 00E0FFFF
Ne 0 ""
Po 1000 -1000
$EndPAD
$PAD
Sh "10" O 866 591 0 0 0
Dr 315 0 0
At STD N 00E0FFFF
Ne 0 ""
Po 1000 -2000
$EndPAD
$SHAPE3D
Na "walter\indicators\7segdisp.wrl"
Sc 1.000000 1.000000 1.000000
Of 0.000000 0.000000 0.000000
Ro 0.000000 0.000000 0.000000
$EndSHAPE3D
$EndMODULE  7segdisp
$MODULE 7segdisp_HDSP
Po 0 0 0 15 4B90DA96 00000000 ~~
Li 7segdisp_HDSP
Cd 7 segments display, Avago HDSP
Kw display
Sc 00000000
AR
Op 0 0 0
T0 0 -3000 700 450 0 113 N V 21 N"DISP***"
T1 0 3000 700 400 0 100 N V 21 N"7segdisp_HDSP"
DS -1400 -2170 1400 -2170 100 21
DS -1400 2170 -1400 -2170 100 21
DS 1400 2170 -1400 2170 100 21
DS 1400 -2170 1400 2170 100 21
DC 1050 1550 1150 1650 120 21
DS -950 1300 -700 200 120 21
DS 350 1300 600 200 120 21
DS 650 -150 900 -1300 120 21
DS -650 -150 -400 -1300 120 21
DS -850 1500 200 1500 120 21
DS -250 -1500 800 -1500 120 21
DS -550 0 500 0 120 21
$PAD
Sh "1" R 866 591 0 0 0
Dr 315 0 0
At STD N 00E0FFFF
Ne 0 ""
Po -1040 -1580
$EndPAD
$PAD
Sh "2" O 866 591 0 0 0
Dr 315 0 0
At STD N 00E0FFFF
Ne 0 ""
Po -1040 -790
$EndPAD
$PAD
Sh "3" O 866 591 0 0 0
Dr 315 0 0
At STD N 00E0FFFF
Ne 0 ""
Po -1040 0
$EndPAD
$PAD
Sh "4" O 866 591 0 0 0
Dr 315 0 0
At STD N 00E0FFFF
Ne 0 ""
Po -1040 790
$EndPAD
$PAD
Sh "5" O 866 591 0 0 0
Dr 315 0 0
At STD N 00E0FFFF
Ne 0 ""
Po -1040 1580
$EndPAD
$PAD
Sh "6" O 866 591 0 0 0
Dr 315 0 0
At STD N 00E0FFFF
Ne 0 ""
Po 1040 1580
$EndPAD
$PAD
Sh "7" O 866 591 0 0 0
Dr 315 0 0
At STD N 00E0FFFF
Ne 0 ""
Po 1040 790
$EndPAD
$PAD
Sh "8" O 866 591 0 0 0
Dr 315 0 0
At STD N 00E0FFFF
Ne 0 ""
Po 1040 0
$EndPAD
$PAD
Sh "9" O 866 591 0 0 0
Dr 315 0 0
At STD N 00E0FFFF
Ne 0 ""
Po 1040 -790
$EndPAD
$PAD
Sh "10" O 866 591 0 0 0
Dr 315 0 0
At STD N 00E0FFFF
Ne 0 ""
Po 1040 -1580
$EndPAD
$SHAPE3D
Na "walter\indicators\7segdisp_hdsp.wrl"
Sc 1.000000 1.000000 1.000000
Of 0.000000 0.000000 0.000000
Ro 0.000000 0.000000 0.000000
$EndSHAPE3D
$EndMODULE  7segdisp_HDSP
$MODULE 7segdisp_sa05
Po 0 0 0 15 4B90DAAB 00000000 ~~
Li 7segdisp_sa05
Cd 7 segments display, SA05 series
Kw display
Sc 00000000
AR
Op 0 0 0
T0 0 -4100 700 450 0 113 N V 21 N"DISP***"
T1 0 4100 700 400 0 100 N V 21 N"7segdisp_sa"
DS 2500 -3750 2500 3750 127 21
DS -2500 3750 -2500 -3750 127 21
DS 1500 0 -1500 0 551 21
DS -1200 -2300 -1800 2300 551 21
DS -1800 2300 1200 2300 551 21
DS 1200 2300 1800 -2300 551 21
DS 1800 -2300 -1200 -2300 551 21
DS -2000 3750 -2500 3250 120 21
DC 1950 2250 2050 2150 394 21
DS -2300 3750 -2500 3550 120 21
DS -2150 3750 -2500 3400 120 21
DS -2500 3750 2500 3750 127 21
DS 2500 -3750 -2500 -3750 127 21
$PAD
Sh "1" R 866 591 0 0 900
Dr 315 0 0
At STD N 00E0FFFF
Ne 0 ""
Po -2000 3000
$EndPAD
$PAD
Sh "2" O 866 591 0 0 900
Dr 315 0 0
At STD N 00E0FFFF
Ne 0 ""
Po -1000 3000
$EndPAD
$PAD
Sh "3" O 866 591 0 0 900
Dr 315 0 0
At STD N 00E0FFFF
Ne 0 ""
Po 0 3000
$EndPAD
$PAD
Sh "4" O 866 591 0 0 900
Dr 315 0 0
At STD N 00E0FFFF
Ne 0 ""
Po 1000 3000
$EndPAD
$PAD
Sh "5" O 866 591 0 0 900
Dr 315 0 0
At STD N 00E0FFFF
Ne 0 ""
Po 2000 3000
$EndPAD
$PAD
Sh "6" O 866 591 0 0 900
Dr 315 0 0
At STD N 00E0FFFF
Ne 0 ""
Po 2000 -3000
$EndPAD
$PAD
Sh "7" O 866 591 0 0 900
Dr 315 0 0
At STD N 00E0FFFF
Ne 0 ""
Po 1000 -3000
$EndPAD
$PAD
Sh "8" O 866 591 0 0 900
Dr 315 0 0
At STD N 00E0FFFF
Ne 0 ""
Po 0 -3000
$EndPAD
$PAD
Sh "9" O 866 591 0 0 900
Dr 315 0 0
At STD N 00E0FFFF
Ne 0 ""
Po -1000 -3000
$EndPAD
$PAD
Sh "10" O 866 591 0 0 900
Dr 315 0 0
At STD N 00E0FFFF
Ne 0 ""
Po -2000 -3000
$EndPAD
$SHAPE3D
Na "walter\indicators\7segdisp_sa05.wrl"
Sc 1.000000 1.000000 1.000000
Of 0.000000 0.000000 0.000000
Ro 0.000000 0.000000 0.000000
$EndSHAPE3D
$EndMODULE  7segdisp_sa05
$MODULE 7segdisp_sa52
Po 0 0 0 15 4B90DAB8 00000000 ~~
Li 7segdisp_sa52
Cd 7 segments display, SA52 series
Kw display
Sc 00000000
AR
Op 0 0 0
T0 0 -4100 700 450 0 113 N V 21 N"DISP***"
T1 0 4100 700 400 0 100 N V 21 N"7segdisp_sa"
DS 1500 0 -1500 0 551 21
DS -1200 -2300 -1800 2300 551 21
DS -1800 2300 1200 2300 551 21
DS 1200 2300 1800 -2300 551 21
DS 1800 -2300 -1200 -2300 551 21
DS 2500 3500 2500 -3500 118 21
DS -2500 3500 -2500 -3500 118 21
DS -2000 3500 -2500 3000 120 21
DC 1950 2250 2050 2150 394 21
DS -2300 3500 -2500 3300 120 21
DS -2150 3500 -2500 3150 120 21
DS -2500 3500 2500 3500 120 21
DS 2500 -3500 -2500 -3500 120 21
$PAD
Sh "1" R 866 591 0 0 900
Dr 315 0 0
At STD N 00E0FFFF
Ne 0 ""
Po -2000 3000
$EndPAD
$PAD
Sh "2" O 866 591 0 0 900
Dr 315 0 0
At STD N 00E0FFFF
Ne 0 ""
Po -1000 3000
$EndPAD
$PAD
Sh "3" O 866 591 0 0 900
Dr 315 0 0
At STD N 00E0FFFF
Ne 0 ""
Po 0 3000
$EndPAD
$PAD
Sh "4" O 866 591 0 0 900
Dr 315 0 0
At STD N 00E0FFFF
Ne 0 ""
Po 1000 3000
$EndPAD
$PAD
Sh "5" O 866 591 0 0 900
Dr 315 0 0
At STD N 00E0FFFF
Ne 0 ""
Po 2000 3000
$EndPAD
$PAD
Sh "6" O 866 591 0 0 900
Dr 315 0 0
At STD N 00E0FFFF
Ne 0 ""
Po 2000 -3000
$EndPAD
$PAD
Sh "7" O 866 591 0 0 900
Dr 315 0 0
At STD N 00E0FFFF
Ne 0 ""
Po 1000 -3000
$EndPAD
$PAD
Sh "8" O 866 591 0 0 900
Dr 315 0 0
At STD N 00E0FFFF
Ne 0 ""
Po 0 -3000
$EndPAD
$PAD
Sh "9" O 866 591 0 0 900
Dr 315 0 0
At STD N 00E0FFFF
Ne 0 ""
Po -1000 -3000
$EndPAD
$PAD
Sh "10" O 866 591 0 0 900
Dr 315 0 0
At STD N 00E0FFFF
Ne 0 ""
Po -2000 -3000
$EndPAD
$SHAPE3D
Na "walter\indicators\7segdisp_sa52.wrl"
Sc 1.000000 1.000000 1.000000
Of 0.000000 0.000000 0.000000
Ro 0.000000 0.000000 0.000000
$EndSHAPE3D
$EndMODULE  7segdisp_sa52
$EndLIBRARY
