PCBNEW-LibModule-V1  St 20. červen 2012, 18:52:46 CEST
# encoding utf-8
Units deci-mils
$INDEX
SOT103-1
SOT103-2
$EndINDEX
$MODULE SOT103-1
Po 0 0 0 15 4FE1FF0C 00000000 ~~
Li SOT103-1
Sc 0
AR 
Op 0 0 0
T0 2750 -1000 393 393 0 78 N V 21 N "SOT103-1"
T1 2750 1000 392 392 0 77 N I 21 N "Value"
DS 150 1550 250 1550 150 21
DS 250 1550 250 1350 150 21
DS 250 1350 150 1350 150 21
DS -150 1550 -250 1550 150 21
DS -250 1550 -250 1350 150 21
DS -250 1350 -150 1350 150 21
DS -150 1350 -150 1000 150 21
DS -1500 -150 -1500 -250 150 21
DS -1500 -250 -1300 -250 150 21
DS -1300 -250 -1300 -150 150 21
DS 1300 -200 1300 -300 150 21
DS 1300 -300 1450 -300 150 21
DS 1450 -300 1450 -250 150 21
DS -950 -150 -1300 -150 150 21
DS -1500 -150 -3050 -150 150 21
DS -3050 -150 -3250 0 150 21
DS -3250 0 -3050 100 150 21
DS -3050 100 -1500 100 150 21
DS -1500 100 -1500 200 150 21
DS -1500 200 -1300 200 150 21
DS -1300 200 -1300 100 150 21
DS -1300 100 -1000 100 150 21
DS 150 950 150 1350 150 21
DS 150 1550 150 3050 150 21
DS 150 3050 0 3200 150 21
DS 0 3200 -150 3050 150 21
DS -150 3050 -150 1600 150 21
DS -150 -950 -150 -1350 150 21
DS -150 -1350 -550 -1350 150 21
DS -550 -1350 -550 -1550 150 21
DS -550 -1550 -150 -1550 150 21
DS -150 -1550 -150 -2950 150 21
DS -150 -2950 0 -3150 150 21
DS 0 -3150 150 -2950 150 21
DS 150 -2950 150 -1600 150 21
DS 150 -1600 300 -1600 150 21
DS 300 -1600 300 -1350 150 21
DS 300 -1350 150 -1350 150 21
DS 150 -1350 150 -1000 150 21
DS 3950 100 1450 100 150 21
DS 1450 100 1450 200 150 21
DS 1450 200 1300 200 150 21
DS 1300 200 1300 100 150 21
DS 1300 100 1000 100 150 21
DS 950 -200 1300 -200 150 21
DS 1450 -200 4000 -200 150 21
DS 4000 -200 4200 -50 150 21
DS 4200 -50 4000 100 150 21
DC 0 0 950 0 150 21
$PAD
Sh "" C 2047 2047 0 0 0
Dr 2047 0 0
At HOLE N 00E0FFFF
Ne 0 ""
Po 0 0
$EndPAD
$PAD
Sh "2" R 3268 669 0 0 0
Dr 0 0 0
At SMD N 00888000
Ne 0 ""
Po 2800 0
$EndPAD
$PAD
Sh "3" R 669 2087 0 0 0
Dr 0 0 0
At SMD N 00888000
Ne 0 ""
Po 0 2250
$EndPAD
$PAD
Sh "4" R 2087 669 0 0 0
Dr 0 0 0
At SMD N 00888000
Ne 0 ""
Po -2300 0
$EndPAD
$PAD
Sh "1" R 669 2087 0 0 0
Dr 0 0 0
At SMD N 00888000
Ne 0 ""
Po 0 -2250
$EndPAD
$SHAPE3D
Na "smd/sot103-1.wrl"
Sc 1 1 1
Of 0 0 0
Ro 0 0 0
$EndSHAPE3D
$EndMODULE SOT103-1
$MODULE SOT103-2
Po 0 0 0 15 4FE1FF5C 00000000 ~~
Li SOT103-2
Sc 0
AR 
Op 0 0 0
T0 0 -2500 393 393 0 78 N V 21 N "SOT103-1"
T1 0 2500 393 393 0 78 N I 21 N "Value"
DS -150 -1550 -150 -1700 150 21
DS -150 -1700 150 -1700 150 21
DS 150 -1700 150 -1600 150 21
DS -1500 -150 -1700 -150 150 21
DS -1700 -150 -1700 100 150 21
DS -1700 100 -1500 100 150 21
DS -150 1550 -150 1650 150 21
DS -150 1650 150 1650 150 21
DS 150 1650 150 1550 150 21
DS 1450 -200 1600 -200 150 21
DS 1600 -200 1650 -200 150 21
DS 1650 -200 1650 100 150 21
DS 1650 100 1450 100 150 21
DS 150 1550 250 1550 150 21
DS 250 1550 250 1350 150 21
DS 250 1350 150 1350 150 21
DS -150 1550 -250 1550 150 21
DS -250 1550 -250 1350 150 21
DS -250 1350 -150 1350 150 21
DS -150 1350 -150 1000 150 21
DS -1500 -150 -1500 -250 150 21
DS -1500 -250 -1300 -250 150 21
DS -1300 -250 -1300 -150 150 21
DS 1300 -200 1300 -300 150 21
DS 1300 -300 1450 -300 150 21
DS 1450 -300 1450 -250 150 21
DS -950 -150 -1300 -150 150 21
DS -1500 100 -1500 200 150 21
DS -1500 200 -1300 200 150 21
DS -1300 200 -1300 100 150 21
DS -1300 100 -1000 100 150 21
DS 150 950 150 1350 150 21
DS -150 -950 -150 -1350 150 21
DS -150 -1350 -550 -1350 150 21
DS -550 -1350 -550 -1550 150 21
DS -550 -1550 -150 -1550 150 21
DS 150 -1600 300 -1600 150 21
DS 300 -1600 300 -1350 150 21
DS 300 -1350 150 -1350 150 21
DS 150 -1350 150 -1000 150 21
DS 1450 100 1450 200 150 21
DS 1450 200 1300 200 150 21
DS 1300 200 1300 100 150 21
DS 1300 100 1000 100 150 21
DS 950 -200 1300 -200 150 21
DC 0 0 950 0 150 21
$PAD
Sh "2" R 472 787 0 0 0
Dr 236 0 0 O 236 669
At STD N 00E0FFFF
Ne 0 ""
Po 1650 -50
$EndPAD
$PAD
Sh "3" R 787 472 0 0 0
Dr 669 0 0 O 669 236
At STD N 00E0FFFF
Ne 0 ""
Po 0 1650
$EndPAD
$PAD
Sh "4" R 472 787 0 0 0
Dr 236 0 0 O 236 669
At STD N 00E0FFFF
Ne 0 ""
Po -1700 0
$EndPAD
$PAD
Sh "1" R 787 472 0 0 0
Dr 669 0 0 O 669 236
At STD N 00E0FFFF
Ne 0 ""
Po 0 -1700
$EndPAD
$SHAPE3D
Na "smd/sot103-2.wrl"
Sc 1 1 1
Of 0 0 0
Ro 0 0 0
$EndSHAPE3D
$EndMODULE SOT103-2
$EndLIBRARY
