PCBNEW-LibModule-V1  Čt 7. červen 2012, 20:03:06 CEST
# encoding utf-8
Units deci-mils
$INDEX
FUSE_KS20-170
Fuse-Holder_H
Fuse-Holder_V
fuse-pcbpan
$EndINDEX
$MODULE FUSE_KS20-170
Po 0 0 0 15 4FB13F32 00000000 ~~
Li FUSE_KS20-170
Cd Support fusible 5 x 20
Kw DEV
Sc 0
AR 
Op 0 0 0
T0 0 -2461 394 394 0 79 N V 21 N "FUSE_KS20-170"
T1 0 0 394 394 0 79 N I 21 N "Value"
DS 4760 -1980 4760 1960 150 21
DS -4780 -1980 -4780 1980 150 21
DS 4760 -1980 -4760 -1980 150 21
DS -4740 1980 4740 1980 150 21
$PAD
Sh "1" C 1500 1500 0 0 0
Dr 550 0 0
At STD N 00E0FFFF
Ne 1 "N-000013"
Po -4420 0
$EndPAD
$PAD
Sh "2" C 1500 1500 0 0 0
Dr 550 0 0
At STD N 00E0FFFF
Ne 2 "N-000015"
Po 4420 0
$EndPAD
$SHAPE3D
Na "Fuse\\fuse_socket.wrl"
Sc 1 1 1
Of 0 0 0
Ro 0 0 0
$EndSHAPE3D
$EndMODULE FUSE_KS20-170
$MODULE Fuse-Holder_H
Po 0 0 0 15 4FB13E39 00000000 ~~
Li Fuse-Holder_H
Sc 0
AR 
Op 0 0 0
T0 0 -3150 394 394 0 79 N V 21 N "Fuse-Holder_H"
T1 0 0 394 394 0 79 N I 21 N "VAL**"
DS 3450 -2550 3450 2550 150 21
DS 3450 2550 -3550 2550 150 21
DS -3550 2550 -3550 -2550 150 21
DS 3450 -2550 -3450 -2550 150 21
$PAD
Sh "1" C 709 709 0 0 0
Dr 500 0 0
At STD N 00E0FFFF
Ne 0 ""
Po 1450 -1550
$EndPAD
$PAD
Sh "2" C 709 709 0 0 0
Dr 500 0 0
At STD N 00E0FFFF
Ne 0 ""
Po -1550 -1550
$EndPAD
$PAD
Sh "" C 843 843 0 0 0
Dr 819 0 0
At HOLE N 00F0FFFF
Ne 0 ""
Po -50 1450
$EndPAD
$SHAPE3D
Na "Fuse\\fuseholder_153007.wrl"
Sc 1 1 1
Of 0 0 0
Ro 0 0 0
$EndSHAPE3D
$EndMODULE Fuse-Holder_H
$MODULE Fuse-Holder_V
Po 0 0 0 15 4FB13E75 00000000 ~~
Li Fuse-Holder_V
Sc 0
AR 
Op 0 0 0
T0 0 -1969 394 394 0 79 N V 21 N "Fuse-Holder_V"
T1 0 1969 394 394 0 79 N I 21 N "VAL**"
DS -3500 1500 3500 1500 150 21
DS 3500 1500 3500 -1500 150 21
DS 3500 -1500 -3500 -1500 150 21
DS -3500 -1500 -3500 1500 150 21
$PAD
Sh "" C 1575 1575 0 0 900
Dr 1535 0 0
At STD N 00E0FFFF
Ne 0 ""
Po 0 0
$EndPAD
$PAD
Sh "2" C 709 709 0 0 900
Dr 500 0 0
At STD N 00E0FFFF
Ne 0 ""
Po 1550 700
$EndPAD
$PAD
Sh "1" C 709 709 0 0 900
Dr 500 0 0
At STD N 00E0FFFF
Ne 0 ""
Po -1500 -700
$EndPAD
$SHAPE3D
Na "Fuse\\fuseholder_153008.wrl"
Sc 1 1 1
Of 0 0 0
Ro 0 0 0
$EndSHAPE3D
$EndMODULE Fuse-Holder_V
$MODULE fuse-pcbpan
Po 0 0 0 15 4FD0ECAA 00000000 ~~
Li fuse-pcbpan
Sc 0
AR 
Op 0 0 0
T0 0 -3100 393 393 0 78 N V 21 N "fuse-pcbpan"
T1 0 -1600 393 393 0 78 N I 21 N "Value"
DS -8500 -2000 -8500 2000 250 21
DS -6500 -2500 -6500 2500 250 21
DS 4500 -2500 4500 2500 250 21
DS -7000 -2000 -8500 -2000 250 21
DS -8500 2000 -7000 2000 250 21
DS -6500 1500 -7000 1500 250 21
DS -7000 2000 -7000 -2000 250 21
DS -7000 -1500 -6500 -1500 250 21
DS 4500 2500 -6500 2500 250 21
DS -6500 -2500 4500 -2500 250 21
$PAD
Sh "1" C 2000 2000 0 0 0
Dr 1181 0 0
At STD N 00E0FFFF
Ne 0 ""
Po 0 0
$EndPAD
$PAD
Sh "2" C 2000 2000 0 0 0
Dr 1181 0 0
At STD N 00E0FFFF
Ne 0 ""
Po 4000 0
$EndPAD
$EndMODULE fuse-pcbpan
$EndLIBRARY
