PCBNEW-LibModule-V1  St 20. červen 2012, 18:42:22 CEST
# encoding utf-8
Units deci-mils
$INDEX
sht11-SHT11
sht11-SHT7X
sht11-SHT7XH
$EndINDEX
$MODULE sht11-SHT11
Po 0 0 0 15 4FE1FD4B 00000000 ~~
Li sht11-SHT11
Sc 0
AR 
Op 0 0 0
At SMD
T0 0 -2000 393 393 0 78 N V 21 N "SHT11"
T1 0 2000 393 393 0 78 N I 21 N "Value"
DS -999 -1498 1001 -1498 50 21
DS 1001 -1498 1001 1499 50 21
DS 1001 1499 -999 1499 50 21
DS -999 1499 -999 -1498 50 21
DS 769 -1021 769 743 50 21
DS -743 -1021 -743 -769 50 21
DS -743 -1021 769 -1021 50 21
DS -743 -1021 -743 743 50 21
DS -743 743 -491 743 50 21
DS 769 743 517 743 50 21
DS -491 -769 -491 -517 50 21
DS -491 -517 517 -517 50 21
DS 517 -517 517 -769 50 21
DS 517 -769 -491 -769 50 21
DC 13 743 294 462 25 21
$PAD
Sh "5" R 500 250 0 0 0
Dr 0 0 0
At SMD N 00888000
Ne 0 ""
Po 1127 750
$EndPAD
$PAD
Sh "6" R 500 250 0 0 0
Dr 0 0 0
At SMD N 00888000
Ne 0 ""
Po 1127 250
$EndPAD
$PAD
Sh "7" R 500 250 0 0 0
Dr 0 0 0
At SMD N 00888000
Ne 0 ""
Po 1127 -250
$EndPAD
$PAD
Sh "8" R 500 250 0 0 0
Dr 0 0 0
At SMD N 00888000
Ne 0 ""
Po 1127 -750
$EndPAD
$PAD
Sh "DATA" R 500 250 0 0 0
Dr 0 0 0
At SMD N 00888000
Ne 0 ""
Po -1125 -250
$EndPAD
$PAD
Sh "GND" R 500 250 0 0 0
Dr 0 0 0
At SMD N 00888000
Ne 0 ""
Po -1125 -750
$EndPAD
$PAD
Sh "SCK" R 500 250 0 0 0
Dr 0 0 0
At SMD N 00888000
Ne 0 ""
Po -1125 250
$EndPAD
$PAD
Sh "VDD" R 500 250 0 0 0
Dr 0 0 0
At SMD N 00888000
Ne 0 ""
Po -1125 750
$EndPAD
$SHAPE3D
Na "Sensors/SHT1x.wrl"
Sc 1 1 1
Of 0 0 0
Ro 0 0 0
$EndSHAPE3D
$EndMODULE sht11-SHT11
$MODULE sht11-SHT7X
Po 0 0 0 15 4FE1FC51 00000000 ~~
Li sht11-SHT7X
Sc 0
AR 
Op 0 0 0
At VIRTUAL
T0 0 -1000 393 393 0 78 N V 21 N "SHT7x"
T1 0 1000 393 393 0 78 N I 21 N "Value"
DS -1250 -500 1250 -500 50 21
DS 1250 -500 1250 500 50 21
DS 1250 500 -1250 500 50 21
DS -1250 500 -1250 -500 50 21
$PAD
Sh "1" O 320 640 0 0 0
Dr 160 0 0
At STD N 00A88001
Ne 0 ""
Po -750 0
$EndPAD
$PAD
Sh "2" O 320 640 0 0 0
Dr 160 0 0
At STD N 00A88001
Ne 0 ""
Po -250 0
$EndPAD
$PAD
Sh "3" O 320 640 0 0 0
Dr 160 0 0
At STD N 00A88001
Ne 0 ""
Po 250 0
$EndPAD
$PAD
Sh "4" O 320 640 0 0 0
Dr 160 0 0
At STD N 00A88001
Ne 0 ""
Po 750 0
$EndPAD
$SHAPE3D
Na "Sensors/SHT7x.wrl"
Sc 1 1 1
Of 0 0 0
Ro 0 0 0
$EndSHAPE3D
$EndMODULE sht11-SHT7X
$MODULE sht11-SHT7XH
Po 0 0 0 15 4FE1FCFC 00000000 ~~
Li sht11-SHT7XH
Sc 0
AR 
Op 0 0 0
At VIRTUAL
T0 -1000 -1750 393 393 900 78 N V 21 N "SHT7xH"
T1 1000 -1750 393 393 900 78 N I 21 N "Value"
DS -1000 2450 1000 2450 50 21
DS 1000 2450 1000 950 50 21
DS -1000 2450 -1000 950 50 21
DS -625 -2800 625 -2800 50 21
DS -500 -2675 -500 -1300 50 21
DS 500 -1300 500 -2675 50 21
DS 500 -2675 -500 -2675 50 21
DS 250 -2550 250 -2300 50 21
DS 250 -2300 -250 -2300 50 21
DS -250 -2300 -250 -2550 50 21
DS -250 -2550 250 -2550 50 21
DS -500 -1300 -250 -1300 50 21
DS 250 -1300 500 -1300 50 21
DS 625 -675 625 -2800 50 21
DS -625 -675 -625 -2800 50 21
DS -1000 950 -500 950 50 21
DS 500 950 1000 950 50 21
DS 250 700 250 -300 50 21
DS -250 -300 -250 700 50 21
DS -750 3200 -750 1950 160 21
DS -250 3200 -250 1950 160 21
DS 250 3200 250 1950 160 21
DS 750 3200 750 1950 160 21
DC 0 -1300 139 -1439 25 21
DA 500 -675 625 -675 900 50 21
DA -500 -675 -500 -550 900 50 21
DA 500 -300 250 -300 900 50 21
DA 500 700 500 950 900 50 21
DA -500 -300 -500 -550 900 50 21
DA -500 700 -250 700 900 50 21
$PAD
Sh "1" O 320 640 0 0 0
Dr 160 0 0
At STD N 00A88001
Ne 0 ""
Po -750 3200
$EndPAD
$PAD
Sh "2" O 320 640 0 0 0
Dr 160 0 0
At STD N 00A88001
Ne 0 ""
Po -250 3200
$EndPAD
$PAD
Sh "3" O 320 640 0 0 0
Dr 160 0 0
At STD N 00A88001
Ne 0 ""
Po 250 3200
$EndPAD
$PAD
Sh "4" O 320 640 0 0 0
Dr 160 0 0
At STD N 00A88001
Ne 0 ""
Po 750 3200
$EndPAD
$SHAPE3D
Na "Sensors/SHT7xH.wrl"
Sc 1 1 1
Of 0 0 0
Ro 0 0 0
$EndSHAPE3D
$EndMODULE sht11-SHT7XH
$EndLIBRARY
