PCBNEW-LibModule-V1  21.5.2012 18:52:05
# encoding utf-8
$INDEX
mouse_key
$EndINDEX
$MODULE mouse_key
Po 0 0 0 15 4FBA7275 00000000 ~~
Li mouse_key
Sc 00000000
AR mouse_key
Op 0 0 0
T0 0 -1350 394 394 0 79 N V 21 N "mouse_key"
T1 0 1400 394 394 0 79 N I 21 N "VAL**"
DS -1300 -500 -1300 500 150 21
DS -1300 500 -800 500 150 21
DS -800 500 -800 -500 150 21
DS -800 -500 -1300 -500 150 21
DS -2500 900 -2500 -900 150 21
DS -2500 -900 2500 -900 150 21
DS 2500 -900 2500 900 150 21
DS 2500 900 -2500 900 150 21
$PAD
Sh "2" C 787 787 0 0 0
Dr 394 0 0
At STD N 00E0FFFF
Ne 0 ""
Po 0 0
$EndPAD
$PAD
Sh "3" C 787 787 0 0 0
Dr 394 0 0
At STD N 00E0FFFF
Ne 0 ""
Po 2000 0
$EndPAD
$PAD
Sh "1" C 787 787 0 0 0
Dr 394 0 0
At STD N 00E0FFFF
Ne 0 ""
Po -2000 0
$EndPAD
$SHAPE3D
Na "Switch\\mouse-key.wrl"
Sc 1.000000 1.000000 1.000000
Of 0.000000 0.000000 0.000000
Ro 0.000000 0.000000 0.000000
$EndSHAPE3D
$EndMODULE  mouse_key
$EndLIBRARY
