PCBNEW-LibModule-V1  12/05/2010 16:56:41
$INDEX
VALVE-ECC-83-1
VALVE-ECC-83-2
VALVE-EURO
VALVE-GLIMM
VALVE-MINI_G
VALVE-MINI_P
VALVE-NOVAL_G
VALVE-NOVAL_P
VALVE-OCTAL
3M-N7E50
$EndINDEX
$MODULE VALVE-ECC-83-1
Po 0 0 0 15 454CBC05 00000000 ~~
Li VALVE-ECC-83-1
Sc 00000000
Op 0 0 0
T0 500 -4500 600 600 0 120 N V 21 "VALVE-ECC-83-1"
T1 0 4500 600 600 0 120 N V 21 "VAL**"
DC 0 0 4000 500 150 21
$PAD
Sh "1" C 800 800 0 0 0
Dr 400 0 0
At STD N 00E0FFFF
Ne 0 ""
Po 1360 1872
$EndPAD
$PAD
Sh "2" C 800 800 0 0 0
Dr 400 0 0
At STD N 00E0FFFF
Ne 0 ""
Po 2208 720
$EndPAD
$PAD
Sh "3" C 800 800 0 0 0
Dr 400 0 0
At STD N 00E0FFFF
Ne 0 ""
Po 2208 -720
$EndPAD
$PAD
Sh "4" C 800 800 0 0 0
Dr 400 0 0
At STD N 00E0FFFF
Ne 0 ""
Po 1360 -1872
$EndPAD
$PAD
Sh "5" C 800 800 0 0 0
Dr 400 0 0
At STD N 00E0FFFF
Ne 0 ""
Po 0 -2320
$EndPAD
$PAD
Sh "6" C 800 800 0 0 0
Dr 400 0 0
At STD N 00E0FFFF
Ne 0 ""
Po -1360 -1872
$EndPAD
$PAD
Sh "7" C 800 800 0 0 0
Dr 400 0 0
At STD N 00E0FFFF
Ne 0 ""
Po -2208 -720
$EndPAD
$PAD
Sh "8" C 800 800 0 0 0
Dr 400 0 0
At STD N 00E0FFFF
Ne 0 ""
Po -2208 704
$EndPAD
$PAD
Sh "9" C 800 800 0 0 0
Dr 400 0 0
At STD N 00E0FFFF
Ne 0 ""
Po -1360 1872
$EndPAD
$SHAPE3D
Na "valves/ecc83.wrl"
Sc 1.000000 1.000000 1.000000
Of 0.000000 0.000000 0.000000
Ro 0.000000 0.000000 0.000000
$EndSHAPE3D
$EndMODULE  VALVE-ECC-83-1
$MODULE VALVE-ECC-83-2
Po 0 0 0 15 456BE21B 00000000 ~~
Li VALVE-ECC-83-2
Sc 00000000
Op 0 0 0
T0 0 -4500 600 600 0 120 N V 21 "VALVE-ECC-83-2"
T1 0 4500 600 600 0 120 N V 21 "VAL**"
DC 0 0 4000 500 150 21
$PAD
Sh "1" O 800 1200 0 0 -540
Dr 400 0 0 O 400 800
At STD N 00E0FFFF
Ne 0 ""
Po 1360 1872
$EndPAD
$PAD
Sh "2" O 800 1200 0 0 -180
Dr 400 0 0 O 400 800
At STD N 00E0FFFF
Ne 0 ""
Po 2208 720
$EndPAD
$PAD
Sh "3" O 800 1200 0 0 180
Dr 400 0 0 O 400 800
At STD N 00E0FFFF
Ne 0 ""
Po 2208 -720
$EndPAD
$PAD
Sh "4" O 800 1200 0 0 540
Dr 400 0 0 O 400 800
At STD N 00E0FFFF
Ne 0 ""
Po 1360 -1872
$EndPAD
$PAD
Sh "5" O 800 1200 0 0 900
Dr 400 0 0 O 400 800
At STD N 00E0FFFF
Ne 0 ""
Po 0 -2320
$EndPAD
$PAD
Sh "6" O 800 1200 0 0 -540
Dr 400 0 0 O 400 800
At STD N 00E0FFFF
Ne 0 ""
Po -1360 -1872
$EndPAD
$PAD
Sh "7" O 800 1200 0 0 -180
Dr 400 0 0 O 400 800
At STD N 00E0FFFF
Ne 0 ""
Po -2208 -720
$EndPAD
$PAD
Sh "8" O 800 1200 0 0 180
Dr 400 0 0 O 400 800
At STD N 00E0FFFF
Ne 0 ""
Po -2208 704
$EndPAD
$PAD
Sh "9" O 800 1200 0 0 540
Dr 400 0 0 O 400 800
At STD N 00E0FFFF
Ne 0 ""
Po -1360 1872
$EndPAD
$PAD
Sh "2" C 1772 1772 0 0 0
Dr 1220 0 0
At STD N 00E0FFFF
Ne 0 ""
Po 0 0
$EndPAD
$SHAPE3D
Na "valves/ecc83.wrl"
Sc 1.000000 1.000000 1.000000
Of 0.000000 0.000000 0.000000
Ro 0.000000 0.000000 0.000000
$EndSHAPE3D
$EndMODULE  VALVE-ECC-83-2
$MODULE VALVE-GLIMM
Po 0 0 0 15 489BFF03 00000000 ~~
Li VALVE-GLIMM
Sc 00000000
AR
Op 0 0 0
At VIRTUAL
T0 500 -1800 600 600 0 80 N V 21 "VALVE-GLIMM"
T1 859 1650 600 600 0 80 N V 21 "VAL***"
DS -500 -1000 1500 -1000 100 21
DS -500 1000 1500 1000 100 21
DA -500 0 -500 1000 5400 100 21
DA 1500 0 1500 -1000 5400 100 21
$PAD
Sh "1" R 700 700 0 0 0
Dr 314 0 0
At STD N 00A88001
Ne 0 ""
Po -500 0
$EndPAD
$PAD
Sh "2" C 700 700 0 0 0
Dr 314 0 0
At STD N 00A8FFFF
Ne 0 ""
Po 1500 0
$EndPAD
$EndMODULE  VALVE-GLIMM
$MODULE VALVE-MINI_P
Po 0 0 0 15 489C0056 00000000 ~~
Li VALVE-MINI_P
Sc 00000000
AR
Op 0 0 0
At VIRTUAL
T0 0 0 600 600 0 35 N V 21 "VALVE-MINI_P"
T1 2100 2700 600 600 0 35 N V 21 "VAL***"
DC 0 0 -1750 1750 60 21
T2 3900 1600 600 600 0 35 N V 21 "1"
T2 3880 -1560 600 600 0 35 N V 21 "2"
T2 1620 -3890 600 600 0 35 N V 21 "3"
T2 -1520 -3870 600 600 0 35 N V 21 "4"
T2 -3890 -1590 600 600 0 35 N V 21 "5"
T2 -3880 1620 600 600 0 35 N V 21 "6"
T2 -1610 3860 600 600 0 35 N V 21 "7"
$PAD
Sh "1" R 1000 1000 0 0 0
Dr 393 0 0
At STD N 00A8FFFF
Ne 0 ""
Po 2500 1000
$EndPAD
$PAD
Sh "2" C 1000 2000 0 0 0
Dr 393 0 0
At STD N 00A88001
Ne 0 ""
Po 2500 -1000
$EndPAD
$PAD
Sh "3" C 1000 2000 0 0 0
Dr 393 0 0
At STD N 00A88001
Ne 0 ""
Po 1000 -2500
$EndPAD
$PAD
Sh "4" C 1000 2000 0 0 0
Dr 393 0 0
At STD N 00A88001
Ne 0 ""
Po -1000 -2500
$EndPAD
$PAD
Sh "5" C 1000 2000 0 0 0
Dr 393 0 0
At STD N 00A88001
Ne 0 ""
Po -2500 -1000
$EndPAD
$PAD
Sh "6" C 1000 2000 0 0 0
Dr 393 0 0
At STD N 00A88001
Ne 0 ""
Po -2500 1000
$EndPAD
$PAD
Sh "7" C 1000 2000 0 0 0
Dr 393 0 0
At STD N 00A88001
Ne 0 ""
Po -1000 2500
$EndPAD
$EndMODULE  VALVE-MINI_P
$MODULE VALVE-NOVAL_G
Po 0 0 0 15 489C0156 00000000 ~~
Li VALVE-NOVAL_G
Sc 00000000
AR
Op 0 0 0
At VIRTUAL
T0 5800 -2250 600 600 0 35 N V 21 "VALVE-NOVAL_G"
T1 6300 3700 600 600 0 35 N V 21 "VAL***"
DS 6420 -740 2710 -3560 80 21
DS -6350 -790 -2800 -3500 80 21
DS -6350 800 -2680 3600 80 21
DS 6410 750 2750 3560 80 21
DC 0 0 -1750 1750 60 21
DA 5750 0 6420 -740 4582 80 21
DA -5760 10 -6331 820 4675 80 21
DA -10 20 -2839 -3479 4366 80 21
DA 0 20 2774 3550 4352 80 21
T2 2660 -3130 600 600 0 35 N V 21 "1"
T2 60 -3950 600 600 0 35 N V 21 "2"
T2 -2440 -3110 600 600 0 35 N V 21 "3"
T2 -4210 -1690 600 600 0 35 N V 21 "4"
T2 -4300 1570 600 600 0 35 N V 21 "5"
T2 -2380 3190 600 600 0 35 N V 21 "6"
T2 90 3990 600 600 0 35 N V 21 "7"
T2 2500 3150 600 600 0 35 N V 21 "8"
T2 4250 1680 600 600 0 35 N V 21 "9"
T2 100 2700 500 500 0 35 N V 21 "d=18,0mm"
$PAD
Sh "1" R 700 700 0 0 0
Dr 393 0 0
At STD N 00A8FFFF
Ne 0 ""
Po 3000 -4000
$EndPAD
$PAD
Sh "2" C 700 1400 0 0 0
Dr 393 0 0
At STD N 00A88001
Ne 0 ""
Po 0 -5000
$EndPAD
$PAD
Sh "3" C 700 1400 0 0 0
Dr 393 0 0
At STD N 00A88001
Ne 0 ""
Po -3000 -4000
$EndPAD
$PAD
Sh "4" C 700 1400 0 0 0
Dr 393 0 0
At STD N 00A88001
Ne 0 ""
Po -5000 -2500
$EndPAD
$PAD
Sh "5" C 700 1400 0 0 0
Dr 393 0 0
At STD N 00A88001
Ne 0 ""
Po -5000 2500
$EndPAD
$PAD
Sh "6" C 700 1400 0 0 0
Dr 393 0 0
At STD N 00A88001
Ne 0 ""
Po -3000 4000
$EndPAD
$PAD
Sh "7" C 700 1400 0 0 0
Dr 393 0 0
At STD N 00A88001
Ne 0 ""
Po 0 5000
$EndPAD
$PAD
Sh "8" C 700 1400 0 0 0
Dr 393 0 0
At STD N 00A88001
Ne 0 ""
Po 3000 4000
$EndPAD
$PAD
Sh "9" C 700 1400 0 0 0
Dr 393 0 0
At STD N 00A88001
Ne 0 ""
Po 5000 2500
$EndPAD
$PAD
Sh "2" C 1614 1614 0 0 0
Dr 1575 0 0
At STD N 00A8FFFF
Ne 0 ""
Po -5750 0
$EndPAD
$PAD
Sh "" C 1614 1614 0 0 0
Dr 1575 0 0
At STD N 00A8FFFF
Ne 0 ""
Po 5750 0
$EndPAD
$EndMODULE  VALVE-NOVAL_G
$MODULE VALVE-OCTAL
Po 0 0 0 15 489C0217 00000000 ~~
Li VALVE-OCTAL
Sc 00000000
AR
Op 0 0 0
At VIRTUAL
T0 7500 -2100 600 600 0 35 N V 21 "VALVE-OCTAL"
T1 6100 1800 600 600 0 35 N V 21 "VAL***"
DC 750 1250 925 1425 40 21
DC 0 0 -3125 3125 50 21
T2 3650 4200 600 600 0 35 N V 21 "1"
T2 5400 -50 600 600 0 35 N V 21 "2"
T2 4100 -4050 600 600 0 35 N V 21 "3"
T2 -50 -5550 600 600 0 35 N V 21 "4"
T2 -4050 -3850 600 600 0 35 N V 21 "5"
T2 -5400 -50 600 600 0 35 N V 21 "6"
T2 -4150 3850 600 600 0 35 N V 21 "7"
T2 0 5250 600 600 0 35 N V 21 "8"
$PAD
Sh "1" R 1500 1500 0 0 0
Dr 708 0 0
At STD N 00A8FFFF
Ne 0 ""
Po 3000 3000
$EndPAD
$PAD
Sh "2" C 1500 3000 0 0 0
Dr 708 0 0
At STD N 00A88001
Ne 0 ""
Po 4000 0
$EndPAD
$PAD
Sh "3" C 1500 3000 0 0 0
Dr 708 0 0
At STD N 00A88001
Ne 0 ""
Po 3000 -3000
$EndPAD
$PAD
Sh "4" C 1500 3000 0 0 0
Dr 708 0 0
At STD N 00A88001
Ne 0 ""
Po 0 -4000
$EndPAD
$PAD
Sh "5" C 1500 3000 0 0 0
Dr 708 0 0
At STD N 00A88001
Ne 0 ""
Po -3000 -3000
$EndPAD
$PAD
Sh "6" C 1500 3000 0 0 0
Dr 708 0 0
At STD N 00A88001
Ne 0 ""
Po -4000 0
$EndPAD
$PAD
Sh "7" C 1500 3000 0 0 0
Dr 708 0 0
At STD N 00A88001
Ne 0 ""
Po -3000 3000
$EndPAD
$PAD
Sh "8" C 1500 3000 0 0 0
Dr 708 0 0
At STD N 00A88001
Ne 0 ""
Po 0 4000
$EndPAD
$PAD
Sh "" C 2362 2362 0 0 0
Dr 2165 0 0
At STD N 00A8FFFF
Ne 0 ""
Po 0 0
$EndPAD
$EndMODULE  VALVE-OCTAL
$MODULE VALVE-EURO
Po 0 0 0 15 48DE6000 00000000 ~~
Li VALVE-EURO
Sc 00000000
AR
Op 0 0 0
At VIRTUAL
T0 -2000 -7300 600 600 0 80 N V 21 "VALVE-EURO"
T1 300 7200 600 600 0 80 N V 21 "VAL***"
T2 1180 -3960 600 600 0 80 N V 21 "1"
T2 3640 2000 600 600 0 80 N V 21 "2"
DS -4670 -6740 540 -6210 100 21
DS 6750 4780 6190 -730 100 21
DS 4740 6740 -250 6240 100 21
DS -6210 680 -6690 -4730 100 21
DS -4670 -6740 540 -6210 100 21
DS 6750 4780 6190 -730 100 21
DS 4740 6740 -250 6240 100 21
DS -6210 680 -6690 -4730 100 21
DC 0 0 -2620 2620 50 21
DA -4850 -4900 -6693 -4719 4621 100 21
DA 4910 4900 6750 4760 4602 100 21
DA 10 -10 540 -6210 4388 100 21
DA -20 0 -205 6229 4424 100 21
DA -4850 -4900 -6693 -4719 4621 100 21
DA 4910 4900 6750 4760 4602 100 21
DA 10 -10 540 -6210 4388 100 21
DA -20 0 -205 6229 4424 100 21
T2 -2200 3500 600 600 0 80 N V 21 "3"
T2 -3800 -1800 600 600 0 80 N V 21 "4"
T2 1300 1250 600 600 0 80 N V 21 "5"
$PAD
Sh "1" R 2050 2050 0 0 0
Dr 787 0 0
At STD N 00A8FFFF
Ne 0 ""
Po -590 -3340
$EndPAD
$PAD
Sh "2" C 2050 2050 0 0 0
Dr 787 0 0
At STD N 00A8FFFF
Ne 0 ""
Po 3150 0
$EndPAD
$PAD
Sh "3" C 2050 2050 0 0 0
Dr 787 0 0
At STD N 00A8FFFF
Ne 0 ""
Po -590 3340
$EndPAD
$PAD
Sh "4" C 2050 2050 0 0 0
Dr 787 0 0
At STD N 00A8FFFF
Ne 0 ""
Po -3150 0
$EndPAD
$PAD
Sh "5" C 2050 2050 0 0 0
Dr 1653 0 0
At STD N 00A88001
Ne 0 ""
Po 0 0
$EndPAD
$PAD
Sh "" C 1969 1969 0 0 0
Dr 1575 0 0
At STD N 00A8FFFF
Ne 0 ""
Po 4900 4900
$EndPAD
$PAD
Sh "" C 1969 1969 0 0 0
Dr 1600 0 0
At STD N 00A8FFFF
Ne 0 ""
Po -4860 -4900
$EndPAD
$EndMODULE  VALVE-EURO
$MODULE VALVE-MINI_G
Po 0 0 0 15 48DE602B 00000000 ~~
Li VALVE-MINI_G
Sc 00000000
AR
Op 0 0 0
At VIRTUAL
T0 7600 -2700 600 600 0 35 N V 21 "VALVE-MINI_G"
T1 5300 3200 600 600 0 35 N V 21 "VAL***"
DS 2750 -2870 5110 -500 80 21
DS -5090 -520 -2750 -2890 80 21
DS 5080 540 2750 2910 80 21
DS -5090 530 -2880 2770 80 21
DS 2750 -2870 5110 -500 80 21
DS -5090 -520 -2750 -2890 80 21
DS 2750 -2870 5110 -500 80 21
DC -10 0 -1510 1500 60 21
DC 10 0 1510 1500 40 21
DC 10 0 1510 1500 40 21
DC 10 0 1510 1500 40 21
DA 10 0 2793 2867 4506 80 21
DA -10 20 -2750 -2890 4468 80 21
DA 4500 0 5110 -500 4436 80 21
DA -4500 0 -5079 531 4439 80 21
T2 1870 -3030 600 600 0 35 N V 21 "1"
T2 -1480 -3150 600 600 0 35 N V 21 "2"
T2 -3449 1310 600 600 0 35 N V 21 "4"
T2 -1560 3090 600 600 0 35 N V 21 "5"
T2 1520 3190 600 600 0 35 N V 21 "6"
T2 3620 1429 600 600 0 35 N V 21 "7"
T2 -3370 -1370 600 600 0 35 N V 21 "3"
T2 0 -500 600 600 0 35 N V 21 "montage"
T2 0 400 500 500 0 35 N V 21 "d=15.6mm"
$PAD
Sh "1" R 700 700 0 0 0
Dr 393 0 0
At STD N 00A8FFFF
Ne 0 ""
Po 2000 -4000
$EndPAD
$PAD
Sh "2" C 700 1400 0 0 0
Dr 393 0 0
At STD N 00A88001
Ne 0 ""
Po -2000 -4000
$EndPAD
$PAD
Sh "3" C 700 1400 0 0 0
Dr 393 0 0
At STD N 00A88001
Ne 0 ""
Po -4500 -2000
$EndPAD
$PAD
Sh "4" C 700 1400 0 0 0
Dr 393 0 0
At STD N 00A88001
Ne 0 ""
Po -4500 2000
$EndPAD
$PAD
Sh "5" C 700 1400 0 0 0
Dr 393 0 0
At STD N 00A88001
Ne 0 ""
Po -2000 4000
$EndPAD
$PAD
Sh "6" C 700 1400 0 0 0
Dr 393 0 0
At STD N 00A88001
Ne 0 ""
Po 2000 4000
$EndPAD
$PAD
Sh "7" C 700 1400 0 0 0
Dr 393 0 0
At STD N 00A88001
Ne 0 ""
Po 4500 2000
$EndPAD
$PAD
Sh "" C 1969 1969 0 0 0
Dr 1575 0 0
At STD N 00A8FFFF
Ne 0 ""
Po -4500 0
$EndPAD
$PAD
Sh "" C 1969 1969 0 0 0
Dr 1575 0 0
At STD N 00A8FFFF
Ne 0 ""
Po 4500 0
$EndPAD
$EndMODULE  VALVE-MINI_G
$MODULE VALVE-NOVAL_P
Po 0 0 0 15 48DE60A2 00000000 ~~
Li VALVE-NOVAL_P
Sc 00000000
AR
Op 0 0 0
At VIRTUAL
T0 4500 -4050 600 600 0 35 N V 21 "VALVE-NOVAL_P"
T1 4800 3950 600 600 0 35 N V 21 "VAL***"
DC 0 0 -2250 2250 50 21
T2 4550 2450 600 600 0 35 N V 21 "1"
T2 5300 -50 600 600 0 35 N V 21 "2"
T2 4300 -3050 600 600 0 35 N V 21 "3"
T2 1800 -4800 600 600 0 35 N V 21 "4"
T2 -1450 -4800 600 600 0 35 N V 21 "5"
T2 -4200 -3050 600 600 0 35 N V 21 "6"
T2 -4950 -50 600 600 0 35 N V 21 "7"
T2 -4200 3200 600 600 0 35 N V 21 "8"
T2 -1700 4950 600 600 0 35 N V 21 "9"
T2 7000 -1800 600 600 0 35 N V 21 "Noval"
$PAD
Sh "1" R 1000 1000 0 0 0
Dr 393 0 0
At STD N 00A8FFFF
Ne 0 ""
Po 3000 2000
$EndPAD
$PAD
Sh "2" C 1000 2000 0 0 0
Dr 393 0 0
At STD N 00A88001
Ne 0 ""
Po 3000 0
$EndPAD
$PAD
Sh "3" C 1000 2000 0 0 0
Dr 393 0 0
At STD N 00A88001
Ne 0 ""
Po 3000 -2000
$EndPAD
$PAD
Sh "4" C 1000 2000 0 0 0
Dr 393 0 0
At STD N 00A88001
Ne 0 ""
Po 1000 -3000
$EndPAD
$PAD
Sh "5" C 1000 2000 0 0 0
Dr 393 0 0
At STD N 00A88001
Ne 0 ""
Po -1000 -3000
$EndPAD
$PAD
Sh "6" C 1000 2000 0 0 0
Dr 393 0 0
At STD N 00A88001
Ne 0 ""
Po -3000 -2000
$EndPAD
$PAD
Sh "7" C 1000 2000 0 0 0
Dr 393 0 0
At STD N 00A88001
Ne 0 ""
Po -3000 0
$EndPAD
$PAD
Sh "8" C 1000 2000 0 0 0
Dr 393 0 0
At STD N 00A88001
Ne 0 ""
Po -3000 2000
$EndPAD
$PAD
Sh "9" C 1000 2000 0 0 0
Dr 393 0 0
At STD N 00A88001
Ne 0 ""
Po -1000 3000
$EndPAD
$EndMODULE  VALVE-NOVAL_P
$MODULE 3M-N7E50
Po 0 0 0 15 00200000 00000000 ~~
Li 3M-N7E50
Cd Connecteur PCMCIA + carte
Kw CONN
Sc 00000000
AR 
Op 0 0 0
T0 0 1750 600 600 0 150 N V 21 N"3M-N7E50"
T1 0 3000 600 600 0 150 N V 21 N"VAL**"
DS 8500 12250 8500 15000 120 21
DS 8500 11000 8500 11750 120 21
DS 8500 8000 8500 10500 120 21
DS 8500 6750 8500 7500 120 21
DS 8500 3750 8500 6250 120 21
DS 7250 15000 8000 15000 120 21
DS 4250 15000 6750 15000 120 21
DS 3000 15000 3750 15000 120 21
DS 0 15000 2500 15000 120 21
DS -1250 15000 -500 15000 120 21
DS -4250 15000 -1750 15000 120 21
DS -5500 15000 -4750 15000 120 21
DS -8500 15000 -6000 15000 120 21
DS -8500 12250 -8500 15000 120 21
DS -8500 11000 -8500 11750 120 21
DS -8500 8000 -8500 10500 120 21
DS -8500 6750 -8500 7500 120 21
DS -8500 3750 -8500 6250 120 21
DS 6125 -375 5875 125 120 21
DS 5875 125 6375 125 120 21
DS 6375 125 6125 -375 120 21
DS 250 -250 -250 250 120 21
DS -250 -250 250 250 120 21
DS 8470 3270 8470 790 120 21
DS 8470 790 8320 640 120 21
DS 8320 640 8090 640 120 21
DS -8470 3270 -8470 790 120 21
DS -8470 790 -8320 640 120 21
DS -8320 640 -8090 640 120 21
DS -8850 1040 -8850 3270 120 21
DS -8850 3270 -8090 3270 120 21
DS -8090 3270 -8090 640 120 21
DS -8090 640 8090 640 120 21
DS 8090 640 8090 3270 120 21
DS 8090 3270 8850 3270 120 21
DS 8850 3270 8850 1040 120 21
DS -8850 -1200 -8850 -2130 120 21
DS -8850 -2130 -6860 -2130 120 21
DS -6860 -2130 -6860 -2870 120 21
DS -6860 -2870 -6460 -2870 120 21
DS -6460 -2870 -6460 -660 120 21
DS -6460 -660 6460 -660 120 21
DS 6460 -660 6460 -2870 120 21
DS 6460 -2870 6860 -2870 120 21
DS 6860 -2870 6860 -2130 120 21
DS 6860 -2130 8850 -2130 120 21
DS 8850 -2130 8850 -1200 120 21
$PAD
Sh "1" R 160 1380 0 0 0
Dr 0 0 0
At SMD N 00888000
Ne 0 ""
Po 6125 -2310
$EndPAD
$PAD
Sh "26" R 160 1380 0 0 0
Dr 0 0 0
At SMD N 00888000
Ne 0 ""
Po 5875 -2310
$EndPAD
$PAD
Sh "2" R 160 1380 0 0 0
Dr 0 0 0
At SMD N 00888000
Ne 0 ""
Po 5625 -2310
$EndPAD
$PAD
Sh "27" R 160 1380 0 0 0
Dr 0 0 0
At SMD N 00888000
Ne 0 ""
Po 5375 -2310
$EndPAD
$PAD
Sh "3" R 160 1380 0 0 0
Dr 0 0 0
At SMD N 00888000
Ne 0 ""
Po 5125 -2310
$EndPAD
$PAD
Sh "28" R 160 1380 0 0 0
Dr 0 0 0
At SMD N 00888000
Ne 0 ""
Po 4875 -2310
$EndPAD
$PAD
Sh "4" R 160 1380 0 0 0
Dr 0 0 0
At SMD N 00888000
Ne 0 ""
Po 4625 -2310
$EndPAD
$PAD
Sh "29" R 160 1380 0 0 0
Dr 0 0 0
At SMD N 00888000
Ne 0 ""
Po 4375 -2310
$EndPAD
$PAD
Sh "5" R 160 1380 0 0 0
Dr 0 0 0
At SMD N 00888000
Ne 0 ""
Po 4125 -2310
$EndPAD
$PAD
Sh "30" R 160 1380 0 0 0
Dr 0 0 0
At SMD N 00888000
Ne 0 ""
Po 3875 -2310
$EndPAD
$PAD
Sh "6" R 160 1380 0 0 0
Dr 0 0 0
At SMD N 00888000
Ne 0 ""
Po 3625 -2310
$EndPAD
$PAD
Sh "31" R 160 1380 0 0 0
Dr 0 0 0
At SMD N 00888000
Ne 0 ""
Po 3375 -2310
$EndPAD
$PAD
Sh "7" R 160 1380 0 0 0
Dr 0 0 0
At SMD N 00888000
Ne 0 ""
Po 3125 -2310
$EndPAD
$PAD
Sh "32" R 160 1380 0 0 0
Dr 0 0 0
At SMD N 00888000
Ne 0 ""
Po 2875 -2310
$EndPAD
$PAD
Sh "8" R 160 1380 0 0 0
Dr 0 0 0
At SMD N 00888000
Ne 0 ""
Po 2625 -2310
$EndPAD
$PAD
Sh "33" R 160 1380 0 0 0
Dr 0 0 0
At SMD N 00888000
Ne 0 ""
Po 2375 -2310
$EndPAD
$PAD
Sh "9" R 160 1380 0 0 0
Dr 0 0 0
At SMD N 00888000
Ne 0 ""
Po 2125 -2310
$EndPAD
$PAD
Sh "34" R 160 1380 0 0 0
Dr 0 0 0
At SMD N 00888000
Ne 0 ""
Po 1875 -2310
$EndPAD
$PAD
Sh "10" R 160 1380 0 0 0
Dr 0 0 0
At SMD N 00888000
Ne 0 ""
Po 1625 -2310
$EndPAD
$PAD
Sh "35" R 160 1380 0 0 0
Dr 0 0 0
At SMD N 00888000
Ne 0 ""
Po 1375 -2310
$EndPAD
$PAD
Sh "11" R 160 1380 0 0 0
Dr 0 0 0
At SMD N 00888000
Ne 0 ""
Po 1125 -2310
$EndPAD
$PAD
Sh "36" R 160 1380 0 0 0
Dr 0 0 0
At SMD N 00888000
Ne 0 ""
Po 875 -2310
$EndPAD
$PAD
Sh "12" R 160 1380 0 0 0
Dr 0 0 0
At SMD N 00888000
Ne 0 ""
Po 625 -2310
$EndPAD
$PAD
Sh "37" R 160 1380 0 0 0
Dr 0 0 0
At SMD N 00888000
Ne 0 ""
Po 375 -2310
$EndPAD
$PAD
Sh "13" R 160 1380 0 0 0
Dr 0 0 0
At SMD N 00888000
Ne 0 ""
Po 125 -2310
$EndPAD
$PAD
Sh "38" R 160 1380 0 0 0
Dr 0 0 0
At SMD N 00888000
Ne 0 ""
Po -125 -2310
$EndPAD
$PAD
Sh "14" R 160 1380 0 0 0
Dr 0 0 0
At SMD N 00888000
Ne 0 ""
Po -375 -2310
$EndPAD
$PAD
Sh "39" R 160 1380 0 0 0
Dr 0 0 0
At SMD N 00888000
Ne 0 ""
Po -625 -2310
$EndPAD
$PAD
Sh "15" R 160 1380 0 0 0
Dr 0 0 0
At SMD N 00888000
Ne 0 ""
Po -875 -2310
$EndPAD
$PAD
Sh "40" R 160 1380 0 0 0
Dr 0 0 0
At SMD N 00888000
Ne 0 ""
Po -1125 -2310
$EndPAD
$PAD
Sh "16" R 160 1380 0 0 0
Dr 0 0 0
At SMD N 00888000
Ne 0 ""
Po -1375 -2310
$EndPAD
$PAD
Sh "41" R 160 1380 0 0 0
Dr 0 0 0
At SMD N 00888000
Ne 0 ""
Po -1625 -2310
$EndPAD
$PAD
Sh "17" R 160 1380 0 0 0
Dr 0 0 0
At SMD N 00888000
Ne 0 ""
Po -1875 -2310
$EndPAD
$PAD
Sh "42" R 160 1380 0 0 0
Dr 0 0 0
At SMD N 00888000
Ne 0 ""
Po -2125 -2310
$EndPAD
$PAD
Sh "18" R 160 1380 0 0 0
Dr 0 0 0
At SMD N 00888000
Ne 0 ""
Po -2375 -2310
$EndPAD
$PAD
Sh "43" R 160 1380 0 0 0
Dr 0 0 0
At SMD N 00888000
Ne 0 ""
Po -2625 -2310
$EndPAD
$PAD
Sh "19" R 160 1380 0 0 0
Dr 0 0 0
At SMD N 00888000
Ne 0 ""
Po -2875 -2310
$EndPAD
$PAD
Sh "44" R 160 1380 0 0 0
Dr 0 0 0
At SMD N 00888000
Ne 0 ""
Po -3125 -2310
$EndPAD
$PAD
Sh "20" R 160 1380 0 0 0
Dr 0 0 0
At SMD N 00888000
Ne 0 ""
Po -3375 -2310
$EndPAD
$PAD
Sh "45" R 160 1380 0 0 0
Dr 0 0 0
At SMD N 00888000
Ne 0 ""
Po -3625 -2310
$EndPAD
$PAD
Sh "21" R 160 1380 0 0 0
Dr 0 0 0
At SMD N 00888000
Ne 0 ""
Po -3875 -2310
$EndPAD
$PAD
Sh "46" R 160 1380 0 0 0
Dr 0 0 0
At SMD N 00888000
Ne 0 ""
Po -4125 -2310
$EndPAD
$PAD
Sh "22" R 160 1380 0 0 0
Dr 0 0 0
At SMD N 00888000
Ne 0 ""
Po -4375 -2310
$EndPAD
$PAD
Sh "47" R 160 1380 0 0 0
Dr 0 0 0
At SMD N 00888000
Ne 0 ""
Po -4625 -2310
$EndPAD
$PAD
Sh "23" R 160 1380 0 0 0
Dr 0 0 0
At SMD N 00888000
Ne 0 ""
Po -4875 -2310
$EndPAD
$PAD
Sh "48" R 160 1380 0 0 0
Dr 0 0 0
At SMD N 00888000
Ne 0 ""
Po -5125 -2310
$EndPAD
$PAD
Sh "24" R 160 1380 0 0 0
Dr 0 0 0
At SMD N 00888000
Ne 0 ""
Po -5375 -2310
$EndPAD
$PAD
Sh "49" R 160 1380 0 0 0
Dr 0 0 0
At SMD N 00888000
Ne 0 ""
Po -5625 -2310
$EndPAD
$PAD
Sh "25" R 160 1380 0 0 0
Dr 0 0 0
At SMD N 00888000
Ne 0 ""
Po -5875 -2310
$EndPAD
$PAD
Sh "50" R 160 1380 0 0 0
Dr 0 0 0
At SMD N 00888000
Ne 0 ""
Po -6125 -2310
$EndPAD
$PAD
Sh "" C 1570 1570 0 0 0
Dr 870 0 0
At STD N 00E0FFFF
Ne 0 ""
Po -7625 -1130
$EndPAD
$PAD
Sh "" C 1570 1570 0 0 0
Dr 870 0 0
At STD N 00E0FFFF
Ne 0 ""
Po 7625 -1130
$EndPAD
$PAD
Sh "" C 670 670 0 0 0
Dr 670 0 0
At STD N 00E0FFFF
Ne 0 ""
Po -7625 50
$EndPAD
$PAD
Sh "" C 670 670 0 0 0
Dr 670 0 0
At STD N 00E0FFFF
Ne 0 ""
Po 7625 50
$EndPAD
$PAD
Sh "" R 980 1800 0 0 0
Dr 0 0 0
At SMD N 00988000
Ne 0 ""
Po 9190 -80
$EndPAD
$PAD
Sh "" R 980 1800 0 0 0
Dr 0 0 0
At SMD N 00988000
Ne 0 ""
Po -9190 -80
$EndPAD
$EndMODULE  3M-N7E50
$EndLIBRARY
