PCBNEW-LibModule-V1  Čt 21. červen 2012, 21:49:13 CEST
# encoding utf-8
Units deci-mils
$INDEX
PKLCS1212E4001-R1
$EndINDEX
$MODULE PKLCS1212E4001-R1
Po 0 0 0 15 4FE37A7B 00000000 ~~
Li PKLCS1212E4001-R1
Sc 0
AR 
Op 0 0 0
T0 0 -3031 472 472 0 100 N V 21 N "PKLCS1212E4001-R1"
T1 0 3100 472 472 0 100 N I 21 N "VAL**"
DS -2362 -2362 2362 -2362 100 27
DS 2362 -2362 2362 2362 100 27
DS 2362 2362 -2362 2362 100 27
DS -2362 2362 -2362 -2362 100 27
DS -2559 -2559 2559 -2559 100 21
DS 2559 -2559 2559 2559 100 21
DS 2559 2559 -2559 2559 100 21
DS -2559 2559 -2559 -2559 100 21
DS -2559 2559 2559 2559 100 26
DS 2559 2559 2559 -2559 100 26
DS 2559 -2559 -2559 -2559 100 26
DS -2559 -2559 -2559 2559 100 26
$PAD
Sh "1" R 472 1575 0 0 0
Dr 0 0 0
At SMD N 00888000
Ne 0 ""
Po -2205 0
$EndPAD
$PAD
Sh "2" R 472 1575 0 0 0
Dr 0 0 0
At SMD N 00888000
Ne 0 ""
Po 2205 0
$EndPAD
$EndMODULE PKLCS1212E4001-R1
$EndLIBRARY
