PCBNEW-LibModule-V1  13.5.2012 21:53:28
# encoding utf-8
$INDEX
BUZZER_AL11P
buzzer-AL23P
buzzer-AL30P
buzzer-AL60P
buzzer-F/BC35
buzzer-F/PMX04A
$EndINDEX
$MODULE buzzer-AL30P
Po 0 0 0 15 4FB010D6 00000000 ~~
Li buzzer-AL30P
Cd SPEAKER
Kw SPEAKER
Sc 00000000
AR
Op 0 0 0
At VIRTUAL
T0 0 -4724 500 500 0 35 N V 21 N "AL30P"
T1 0 1969 500 500 0 35 N I 21 N "BZ*"
DC 0 0 -2950 2950 30 21
DC 0 0 -2500 2500 30 21
DC 0 0 -300 300 30 21
$PAD
Sh "1" C 1000 1000 0 0 0
Dr 470 0 0
At STD N 00E0FFFF
Ne 0 ""
Po -2950 0
$EndPAD
$PAD
Sh "2" C 1000 1000 0 0 0
Dr 470 0 0
At STD N 00E0FFFF
Ne 0 ""
Po 2950 0
$EndPAD
$SHAPE3D
Na "Buzzer\\buzzer_AL30P.wrl"
Sc 1.000000 1.000000 1.000000
Of 0.000000 0.000000 0.000000
Ro 0.000000 0.000000 0.000000
$EndSHAPE3D
$EndMODULE  buzzer-AL30P
$MODULE buzzer-AL23P
Po 0 0 0 15 4FB010E4 00000000 ~~
Li buzzer-AL23P
Cd SPEAKER
Kw SPEAKER
Sc 00000000
AR
Op 0 0 0
At VIRTUAL
T0 0 -3937 500 500 0 35 N V 21 N "AL23P"
T1 0 1575 500 500 0 35 N I 21 N "BZ*"
DC -1 0 -1976 1975 30 21
DC -1 0 -2276 2275 30 21
$PAD
Sh "1" C 1000 1000 0 0 0
Dr 440 0 0
At STD N 00E0FFFF
Ne 0 ""
Po -1970 0
$EndPAD
$PAD
Sh "2" C 1000 1000 0 0 0
Dr 440 0 0
At STD N 00E0FFFF
Ne 0 ""
Po 1970 0
$EndPAD
$SHAPE3D
Na "Buzzer\\buzzer_AL23P.wrl"
Sc 1.000000 1.000000 1.000000
Of 0.000000 0.000000 0.000000
Ro 0.000000 0.000000 0.000000
$EndSHAPE3D
$EndMODULE  buzzer-AL23P
$MODULE buzzer-AL60P
Po 0 0 0 15 4FB010FF 00000000 ~~
Li buzzer-AL60P
Cd SPEAKER
Kw SPEAKER
Sc 00000000
AR
Op 0 0 0
At VIRTUAL
T0 0 -2000 500 500 0 35 N V 21 N "AL60P"
T1 0 2000 500 500 0 35 N V 21 N "BZ*"
DC 0 0 -1200 1200 30 21
DC 0 0 -250 250 30 21
$PAD
Sh "1" C 1000 1000 0 0 0
Dr 400 0 0
At STD N 00E0FFFF
Ne 0 ""
Po -1280 0
$EndPAD
$PAD
Sh "2" C 1000 1000 0 0 0
Dr 400 0 0
At STD N 00E0FFFF
Ne 0 ""
Po 1280 0
$EndPAD
$SHAPE3D
Na "Buzzer\\buzzer_AL60P.wrl"
Sc 1.000000 1.000000 1.000000
Of 0.000000 0.000000 0.000000
Ro 0.000000 0.000000 0.000000
$EndSHAPE3D
$EndMODULE  buzzer-AL60P
$MODULE buzzer-F/BC35
Po 0 0 0 15 4FB0110F 00000000 ~~
Li buzzer-F/BC35
Cd BUZZER
Kw BUZZER
Sc 00000000
AR
Op 0 0 0
At VIRTUAL
T0 0 -6693 700 700 0 35 N V 21 N "BC35"
T1 0 3150 700 700 0 35 N I 21 N "BZ*"
DS -5865 1000 -6800 1000 60 21
DS -5865 -1000 -6800 -1000 60 21
DS 4646 353 5353 -353 60 21
DS 5865 1000 6800 1000 60 21
DS 5865 -1000 6800 -1000 60 21
DC 0 0 -500 500 30 21
DC -7000 0 -7225 225 30 21
DC 5000 0 5250 250 30 21
DC 7000 0 7225 225 30 21
DC 7000 0 7217 217 50 21
DS 6565 0 7435 0 50 21
DS 7000 434 7000 -434 50 21
DC -7000 0 -7217 217 50 21
DS -7435 0 -6565 0 50 21
DS -7000 434 -7000 -434 50 21
DA 0 0 -5929 -492 1705 60 21
DA 0 0 5929 492 1705 60 21
DA -6800 0 -6800 1000 1800 60 21
DA -6800 0 -5929 -492 589 60 21
DA 6800 0 6800 -1000 1800 60 21
DA 6800 0 5929 492 589 60 21
$PAD
Sh "+" C 1240 1240 0 0 0
Dr 520 0 0
At STD N 00E0FFFF
Ne 0 ""
Po 3449 0
$EndPAD
$PAD
Sh "-" C 1240 1240 0 0 0
Dr 520 0 0
At STD N 00E0FFFF
Ne 0 ""
Po -3449 0
$EndPAD
$SHAPE3D
Na "Buzzer\\buzzer_FBC35.wrl"
Sc 1.000000 1.000000 1.000000
Of 0.000000 0.000000 0.000000
Ro 0.000000 0.000000 0.000000
$EndSHAPE3D
$EndMODULE  buzzer-F/BC35
$MODULE buzzer-F/PMX04A
Po 0 0 0 15 4FB01127 00000000 ~~
Li buzzer-F/PMX04A
Cd SPEAKER
Kw SPEAKER
Sc 00000000
AR
Op 0 0 0
At VIRTUAL
T0 0 -3000 500 500 0 35 N V 21 N "PMX04A"
T1 0 3000 500 500 0 35 N I 21 N "BZ*"
DS 3050 -1250 3050 1250 60 21
DS 2048 1250 3050 1250 60 21
DS 2048 -1250 3050 -1250 60 21
DC 0 0 -225 225 30 21
DA 0 0 2048 1250 2972 60 21
$PAD
Sh "+" C 850 850 0 0 0
Dr 360 0 0
At STD N 00E0FFFF
Ne 0 ""
Po 1280 0
$EndPAD
$PAD
Sh "-" C 850 850 0 0 0
Dr 360 0 0
At STD N 00E0FFFF
Ne 0 ""
Po -1280 0
$EndPAD
$SHAPE3D
Na "Buzzer\\buzzer_PMX.wrl"
Sc 1.000000 1.000000 1.000000
Of 0.000000 0.000000 0.000000
Ro 0.000000 0.000000 0.000000
$EndSHAPE3D
$EndMODULE  buzzer-F/PMX04A
$MODULE BUZZER_AL11P
Po 0 0 0 15 4FB01135 00000000 ~~
Li BUZZER_AL11P
Cd SPEAKER
Kw SPEAKER
Sc 00000000
AR 
Op 0 0 0
At VIRTUAL 
T0 0 -2000 500 500 0 35 N V 21 N "AL11P"
T1 0 2362 500 500 0 35 N I 21 N "BZ*"
DC 0 0 -1125 1125 30 21
DC 0 0 -1225 1225 30 21
DC 0 0 -200 200 30 21
$PAD
Sh "+" C 750 750 0 0 0
Dr 400 0 0
At STD N 00E0FFFF
Ne 0 ""
Po 900 0
$EndPAD
$PAD
Sh "-" C 750 750 0 0 0
Dr 400 0 0
At STD N 00E0FFFF
Ne 0 ""
Po -900 0
$EndPAD
$SHAPE3D
Na "Buzzer\\buzzer_AL11P.wrl"
Sc 1.000000 1.000000 1.000000
Of 0.000000 0.000000 0.000000
Ro 0.000000 0.000000 0.000000
$EndSHAPE3D
$EndMODULE  BUZZER_AL11P
$EndLIBRARY
