PCBNEW-LibModule-V1  29.5.2012 15:22:29
# encoding utf-8
$INDEX
HD-A304
HD-A391
HD-A51X
HD-A54X
HD-A55X
HD-A82X
HD-AB5X
HD-BQ-A53
HD-BQ-M31
HD-BVM
HD-E52X
HD-M306
HD-M324
HD-M51XXX
HDSP-2112
HDSP-G
LTS3401
PDA54-11
TDSG31
]
$EndINDEX
$MODULE
Po 0 0 0 15 4FC4C2A8 4FC4C245 ~~
Li
Sc 4FC4C245
AR
Op 0 0 0
T0 -1181 -1575 394 394 900 79 N V 21 N "HD-A304"
T1 7283 -1575 394 394 900 79 N I 21 N "Value"
DC 5540 -580 5460 -660 310 25
DS 5030 -1100 5030 -1730 430 25
DS 1210 -1290 1210 -1920 430 25
DS 4750 -700 3380 -780 430 25
DS 2870 -820 1490 -900 430 25
DS 4750 -2120 3380 -2200 430 25
DS 2870 -2240 1490 -2320 430 25
DS -750 500 6750 500 70 21
DS 6750 500 6750 -3500 70 21
DS 6750 -3500 -750 -3500 70 21
DS -750 -3500 -750 500 70 21
DS 3100 -1210 3100 -1840 430 25
DC 5540 -2240 5460 -2320 310 25
$PAD
Sh "1" R 580 580 0 0 0
Dr 260 0 0
At STD N 0CC08001
Ne 0 ""
Po 0 0
$EndPAD
$PAD
Sh "2" C 580 580 0 0 0
Dr 260 0 0
At STD N 0CC08001
Ne 0 ""
Po 1000 0
$EndPAD
$PAD
Sh "3" C 580 580 0 0 0
Dr 260 0 0
At STD N 0CC08001
Ne 0 ""
Po 2000 0
$EndPAD
$PAD
Sh "4" C 580 580 0 0 0
Dr 260 0 0
At STD N 0CC08001
Ne 0 ""
Po 3000 0
$EndPAD
$PAD
Sh "5" C 580 580 0 0 0
Dr 260 0 0
At STD N 0CC08001
Ne 0 ""
Po 4000 0
$EndPAD
$PAD
Sh "6" C 580 580 0 0 0
Dr 260 0 0
At STD N 0CC08001
Ne 0 ""
Po 5000 0
$EndPAD
$PAD
Sh "7" C 580 580 0 0 0
Dr 260 0 0
At STD N 0CC08001
Ne 0 ""
Po 6000 0
$EndPAD
$PAD
Sh "8" C 580 580 0 0 0
Dr 260 0 0
At STD N 0CC08001
Ne 0 ""
Po 6000 -3000
$EndPAD
$PAD
Sh "9" C 580 580 0 0 0
Dr 260 0 0
At STD N 0CC08001
Ne 0 ""
Po 5000 -3000
$EndPAD
$PAD
Sh "10" C 580 580 0 0 0
Dr 260 0 0
At STD N 0CC08001
Ne 0 ""
Po 4000 -3000
$EndPAD
$PAD
Sh "11" C 580 580 0 0 0
Dr 260 0 0
At STD N 0CC08001
Ne 0 ""
Po 3000 -3000
$EndPAD
$PAD
Sh "12" C 580 580 0 0 0
Dr 260 0 0
At STD N 0CC08001
Ne 0 ""
Po 2000 -3000
$EndPAD
$PAD
Sh "13" C 580 580 0 0 0
Dr 260 0 0
At STD N 0CC08001
Ne 0 ""
Po 1000 -3000
$EndPAD
$PAD
Sh "14" C 580 580 0 0 0
Dr 260 0 0
At STD N 0CC08001
Ne 0 ""
Po 0 -3000
$EndPAD
$EndMODULE
$MODULE HD-A391
Po 0 0 0 15 4FC4C3FD 00000000 ~~
Li HD-A391
Sc 00000000
AR
Op 0 0 0
T0 0 -3250 394 394 0 79 N V 21 N "HD-A391"
T1 0 3250 394 394 0 79 N I 21 N "Value"
DS 160 1150 -350 1150 310 25
DS -270 -110 240 -110 310 25
DS 510 90 440 950 310 25
DS 630 -1210 550 -340 310 25
DS -550 90 -630 950 310 25
DS -430 -1210 -510 -340 310 25
DS 2000 2750 2000 -2750 70 21
DS 2000 -2750 -2000 -2750 70 21
DS -2000 -2750 -2000 2750 70 21
DS -2000 2750 2000 2750 70 21
DC 670 1390 710 1430 310 25
DS -150 -1410 360 -1410 310 25
$PAD
Sh "1" R 580 580 0 0 0
Dr 260 0 0
At STD N 00E0FFFF
Ne 0 ""
Po -1250 -2000
$EndPAD
$PAD
Sh "2" C 580 580 0 0 0
Dr 260 0 0
At STD N 00E0FFFF
Ne 0 ""
Po -1250 -1000
$EndPAD
$PAD
Sh "3" C 580 580 0 0 0
Dr 260 0 0
At STD N 00E0FFFF
Ne 0 ""
Po -1250 0
$EndPAD
$PAD
Sh "4" C 580 580 0 0 0
Dr 260 0 0
At STD N 00E0FFFF
Ne 0 ""
Po -1250 1000
$EndPAD
$PAD
Sh "5" C 580 580 0 0 0
Dr 260 0 0
At STD N 00E0FFFF
Ne 0 ""
Po -1250 2000
$EndPAD
$PAD
Sh "6" C 580 580 0 0 0
Dr 260 0 0
At STD N 00E0FFFF
Ne 0 ""
Po 1250 2000
$EndPAD
$PAD
Sh "7" C 580 580 0 0 0
Dr 260 0 0
At STD N 00E0FFFF
Ne 0 ""
Po 1250 1000
$EndPAD
$PAD
Sh "8" C 580 580 0 0 0
Dr 260 0 0
At STD N 00E0FFFF
Ne 0 ""
Po 1250 0
$EndPAD
$PAD
Sh "9" C 580 580 0 0 0
Dr 260 0 0
At STD N 00E0FFFF
Ne 0 ""
Po 1250 -1000
$EndPAD
$PAD
Sh "10" C 580 580 0 0 0
Dr 260 0 0
At STD N 00E0FFFF
Ne 0 ""
Po 1250 -2000
$EndPAD
$EndMODULE  HD-A391
$MODULE HD-A304
Po 0 0 0 15 4FC4C42B 00000000 ~~
Li HD-A304
Sc 00000000
AR
Op 0 0 0
T0 -4500 0 394 394 900 79 N V 21 N "HD-A304"
T1 4500 0 394 394 900 79 N I 21 N "Value"
DC 2540 920 2460 840 310 25
DS 2030 400 2030 -230 430 25
DS -1790 210 -1790 -420 430 25
DS 1750 800 380 720 430 25
DS -130 680 -1510 600 430 25
DS 1750 -620 380 -700 430 25
DS -130 -740 -1510 -820 430 25
DS -3750 2000 3750 2000 70 21
DS 3750 2000 3750 -2000 70 21
DS 3750 -2000 -3750 -2000 70 21
DS -3750 -2000 -3750 2000 70 21
DS 100 290 100 -340 430 25
DC 2540 -740 2460 -820 310 25
$PAD
Sh "1" R 580 580 0 0 0
Dr 260 0 0
At STD N 00E0FFFF
Ne 0 ""
Po -3000 1500
$EndPAD
$PAD
Sh "2" C 580 580 0 0 0
Dr 260 0 0
At STD N 00E0FFFF
Ne 0 ""
Po -2000 1500
$EndPAD
$PAD
Sh "3" C 580 580 0 0 0
Dr 260 0 0
At STD N 00E0FFFF
Ne 0 ""
Po -1000 1500
$EndPAD
$PAD
Sh "4" C 580 580 0 0 0
Dr 260 0 0
At STD N 00E0FFFF
Ne 0 ""
Po 0 1500
$EndPAD
$PAD
Sh "5" C 580 580 0 0 0
Dr 260 0 0
At STD N 00E0FFFF
Ne 0 ""
Po 1000 1500
$EndPAD
$PAD
Sh "6" C 580 580 0 0 0
Dr 260 0 0
At STD N 00E0FFFF
Ne 0 ""
Po 2000 1500
$EndPAD
$PAD
Sh "7" C 580 580 0 0 0
Dr 260 0 0
At STD N 00E0FFFF
Ne 0 ""
Po 3000 1500
$EndPAD
$PAD
Sh "8" C 580 580 0 0 0
Dr 260 0 0
At STD N 00E0FFFF
Ne 0 ""
Po 3000 -1500
$EndPAD
$PAD
Sh "9" C 580 580 0 0 0
Dr 260 0 0
At STD N 00E0FFFF
Ne 0 ""
Po 2000 -1500
$EndPAD
$PAD
Sh "10" C 580 580 0 0 0
Dr 260 0 0
At STD N 00E0FFFF
Ne 0 ""
Po 1000 -1500
$EndPAD
$PAD
Sh "11" C 580 580 0 0 0
Dr 260 0 0
At STD N 00E0FFFF
Ne 0 ""
Po 0 -1500
$EndPAD
$PAD
Sh "12" C 580 580 0 0 0
Dr 260 0 0
At STD N 00E0FFFF
Ne 0 ""
Po -1000 -1500
$EndPAD
$PAD
Sh "13" C 580 580 0 0 0
Dr 260 0 0
At STD N 00E0FFFF
Ne 0 ""
Po -2000 -1500
$EndPAD
$PAD
Sh "14" C 580 580 0 0 0
Dr 260 0 0
At STD N 00E0FFFF
Ne 0 ""
Po -3000 -1500
$EndPAD
$EndMODULE  HD-A304
$MODULE HD-A51X
Po 0 0 0 15 4FC4C4C0 00000000 ~~
Li HD-A51X
Sc 00000000
AR
Op 0 0 0
T0 0 -4500 394 394 0 79 N V 21 N "HD-A51X"
T1 0 4500 394 394 0 79 N I 21 N "Value"
DS 4980 250 4820 1750 390 25
DS 5220 -1790 5060 -300 390 25
DS 3330 -60 4670 -60 390 25
DS 2930 170 2780 1670 390 25
DS 3170 -1870 3010 -380 390 25
DC 1520 2060 1600 2060 390 25
DS -840 1980 500 1980 390 25
DS -370 -2110 970 -2110 390 25
DS 1050 250 890 1750 390 25
DS 1280 -1790 1130 -300 390 25
DS -600 -60 730 -60 390 25
DS -1000 170 -1160 1670 390 25
DS -760 -1870 -920 -380 390 25
DC -2410 2060 -2340 2060 390 25
DS -4770 1980 -3440 1980 390 25
DS -4300 -2110 -2970 -2110 390 25
DS -2890 250 -3040 1750 390 25
DS -2650 -1790 -2810 -300 390 25
DS -4540 -60 -3200 -60 390 25
DS -4930 170 -5090 1670 390 25
DS -4700 -1870 -4850 -380 390 25
DS -7500 3750 7500 3750 70 21
DS 7500 3750 7500 -3750 70 21
DS 7500 -3750 -7500 -3750 70 21
DS -7500 -3750 -7500 3750 70 21
DC 5450 2060 5530 2060 390 25
DS 3090 1980 4430 1980 390 25
DS 3560 -2110 4900 -2110 390 25
$PAD
Sh "1" R 620 620 0 0 0
Dr 300 0 0
At STD N 0CC08001
Ne 0 ""
Po -6500 3000
$EndPAD
$PAD
Sh "2" C 620 620 0 0 0
Dr 300 0 0
At STD N 0CC08001
Ne 0 ""
Po -5500 3000
$EndPAD
$PAD
Sh "3" C 620 620 0 0 0
Dr 300 0 0
At STD N 0CC08001
Ne 0 ""
Po -4500 3000
$EndPAD
$PAD
Sh "4" C 620 620 0 0 0
Dr 300 0 0
At STD N 0CC08001
Ne 0 ""
Po -3500 3000
$EndPAD
$PAD
Sh "5" C 620 620 0 0 0
Dr 300 0 0
At STD N 0CC08001
Ne 0 ""
Po -2500 3000
$EndPAD
$PAD
Sh "6" C 620 620 0 0 0
Dr 300 0 0
At STD N 0CC08001
Ne 0 ""
Po -1500 3000
$EndPAD
$PAD
Sh "7" C 620 620 0 0 0
Dr 300 0 0
At STD N 0CC08001
Ne 0 ""
Po -500 3000
$EndPAD
$PAD
Sh "8" C 620 620 0 0 0
Dr 300 0 0
At STD N 0CC08001
Ne 0 ""
Po 500 3000
$EndPAD
$PAD
Sh "9" C 620 620 0 0 0
Dr 300 0 0
At STD N 0CC08001
Ne 0 ""
Po 1500 3000
$EndPAD
$PAD
Sh "10" C 620 620 0 0 0
Dr 300 0 0
At STD N 0CC08001
Ne 0 ""
Po 2500 3000
$EndPAD
$PAD
Sh "11" C 620 620 0 0 0
Dr 300 0 0
At STD N 0CC08001
Ne 0 ""
Po 3500 3000
$EndPAD
$PAD
Sh "12" C 620 620 0 0 0
Dr 300 0 0
At STD N 0CC08001
Ne 0 ""
Po 4500 3000
$EndPAD
$PAD
Sh "13" C 620 620 0 0 0
Dr 300 0 0
At STD N 0CC08001
Ne 0 ""
Po 5500 3000
$EndPAD
$PAD
Sh "14" C 620 620 0 0 0
Dr 300 0 0
At STD N 0CC08001
Ne 0 ""
Po 6500 3000
$EndPAD
$PAD
Sh "15" C 620 620 0 0 0
Dr 300 0 0
At STD N 0CC08001
Ne 0 ""
Po 6500 -3000
$EndPAD
$PAD
Sh "16" C 620 620 0 0 0
Dr 300 0 0
At STD N 0CC08001
Ne 0 ""
Po 5500 -3000
$EndPAD
$PAD
Sh "17" C 620 620 0 0 0
Dr 300 0 0
At STD N 0CC08001
Ne 0 ""
Po 4500 -3000
$EndPAD
$PAD
Sh "18" C 620 620 0 0 0
Dr 300 0 0
At STD N 0CC08001
Ne 0 ""
Po 3500 -3000
$EndPAD
$PAD
Sh "19" C 620 620 0 0 0
Dr 300 0 0
At STD N 0CC08001
Ne 0 ""
Po 2500 -3000
$EndPAD
$PAD
Sh "20" C 620 620 0 0 0
Dr 300 0 0
At STD N 0CC08001
Ne 0 ""
Po 1500 -3000
$EndPAD
$PAD
Sh "21" C 620 620 0 0 0
Dr 300 0 0
At STD N 0CC08001
Ne 0 ""
Po 500 -3000
$EndPAD
$PAD
Sh "22" C 620 620 0 0 0
Dr 300 0 0
At STD N 0CC08001
Ne 0 ""
Po -500 -3000
$EndPAD
$PAD
Sh "23" C 620 620 0 0 0
Dr 300 0 0
At STD N 0CC08001
Ne 0 ""
Po -1500 -3000
$EndPAD
$PAD
Sh "24" C 620 620 0 0 0
Dr 300 0 0
At STD N 0CC08001
Ne 0 ""
Po -2500 -3000
$EndPAD
$PAD
Sh "25" C 620 620 0 0 0
Dr 300 0 0
At STD N 0CC08001
Ne 0 ""
Po -3500 -3000
$EndPAD
$PAD
Sh "26" C 620 620 0 0 0
Dr 300 0 0
At STD N 0CC08001
Ne 0 ""
Po -4500 -3000
$EndPAD
$PAD
Sh "27" C 620 620 0 0 0
Dr 300 0 0
At STD N 0CC08001
Ne 0 ""
Po -5500 -3000
$EndPAD
$PAD
Sh "28" C 620 620 0 0 0
Dr 300 0 0
At STD N 0CC08001
Ne 0 ""
Po -6500 -3000
$EndPAD
$EndMODULE  HD-A51X
$MODULE HD-A55X
Po 0 0 0 15 4FC4C59C 00000000 ~~
Li HD-A55X
Sc 00000000
AR
Op 0 0 0
T0 0 -4500 394 394 0 79 N V 21 N "HD-A55X"
T1 0 4500 394 394 0 79 N I 21 N "Value"
DS 980 2060 1140 330 390 25
DS 1220 -380 1380 -2110 390 25
DS -830 20 830 20 390 25
DS -1300 2060 -1140 330 390 25
DS -1060 -380 -900 -2110 390 25
DS -2500 3750 2500 3750 70 21
DS 2500 3750 2500 -3750 70 21
DS 2500 -3750 -2500 -3750 70 21
DS -2500 -3750 -2500 3750 70 21
DC 1610 2300 1770 2300 390 25
DS -590 -2420 1060 -2420 390 25
DS -980 2380 670 2380 390 25
$PAD
Sh "1" R 580 580 0 0 0
Dr 260 0 0
At STD N 00E0FFFF
Ne 0 ""
Po -2000 3000
$EndPAD
$PAD
Sh "2" C 580 580 0 0 0
Dr 260 0 0
At STD N 00E0FFFF
Ne 0 ""
Po -1000 3000
$EndPAD
$PAD
Sh "3" C 580 580 0 0 0
Dr 260 0 0
At STD N 00E0FFFF
Ne 0 ""
Po 0 3000
$EndPAD
$PAD
Sh "4" C 580 580 0 0 0
Dr 260 0 0
At STD N 00E0FFFF
Ne 0 ""
Po 1000 3000
$EndPAD
$PAD
Sh "5" C 580 580 0 0 0
Dr 260 0 0
At STD N 00E0FFFF
Ne 0 ""
Po 2000 3000
$EndPAD
$PAD
Sh "6" C 580 580 0 0 0
Dr 260 0 0
At STD N 00E0FFFF
Ne 0 ""
Po 2000 -3000
$EndPAD
$PAD
Sh "7" C 580 580 0 0 0
Dr 260 0 0
At STD N 00E0FFFF
Ne 0 ""
Po 1000 -3000
$EndPAD
$PAD
Sh "8" C 580 580 0 0 0
Dr 260 0 0
At STD N 00E0FFFF
Ne 0 ""
Po 0 -3000
$EndPAD
$PAD
Sh "9" C 580 580 0 0 0
Dr 260 0 0
At STD N 00E0FFFF
Ne 0 ""
Po -1000 -3000
$EndPAD
$PAD
Sh "10" C 580 580 0 0 0
Dr 260 0 0
At STD N 00E0FFFF
Ne 0 ""
Po -2000 -3000
$EndPAD
$EndMODULE  HD-A55X
$MODULE HD-BVM
Po 0 0 0 15 4FC4C60F 00000000 ~~
Li HD-BVM
Sc 00000000
AR
Op 0 0 0
T0 0 -3500 394 394 0 79 N V 21 N "HD-BVM"
T1 0 3500 394 394 0 79 N I 21 N "Value"
DS -3440 120 -3560 1180 310 25
DS -3280 -1420 -3400 -350 310 25
DS -4700 -120 -3750 -120 310 25
DS -5010 120 -5130 1180 310 25
DS -4850 -1420 -4970 -350 310 25
DC -5880 1490 -5800 1450 310 25
DS -7290 -1570 -6350 -1570 310 25
DS -7570 1420 -6620 1420 310 25
DS -6190 160 -6310 1220 310 25
DS -6030 -1380 -6150 -320 310 25
DS -7450 -80 -6510 -80 310 25
DS -7760 160 -7880 1220 310 25
DS -7610 -1380 -7720 -320 310 25
DC 7890 1450 7970 1420 310 25
DS 6470 -1610 7420 -1610 310 25
DS 6200 1380 7140 1380 310 25
DS 7580 120 7460 1180 310 25
DS 7730 -1420 7610 -350 310 25
DS 6320 -120 7260 -120 310 25
DS 6000 120 5880 1180 310 25
DS 6160 -1420 6040 -350 310 25
DC 5140 1490 5220 1450 310 25
DS 3720 -1570 4660 -1570 310 25
DS 3450 1420 4390 1420 310 25
DS 4820 160 4700 1220 310 25
DS 4980 -1380 4860 -320 310 25
DS 3560 -80 4510 -80 310 25
DS 3250 160 3130 1220 310 25
DS 3410 -1380 3290 -320 310 25
DC 2380 1450 2460 1420 310 25
DS 970 -1610 1910 -1610 310 25
DS 690 1380 1640 1380 310 25
DS 2070 120 1950 1180 310 25
DS 2230 -1420 2110 -350 310 25
DS 810 -120 1750 -120 310 25
DS 500 120 380 1180 310 25
DS 650 -1420 530 -350 310 25
DC -370 1490 -290 1450 310 25
DS -1790 -1570 -840 -1570 310 25
DS -2060 1420 -1120 1420 310 25
DS -680 160 -800 1220 310 25
DS -530 -1380 -650 -320 310 25
DS -1940 -80 -1000 -80 310 25
DS -2260 160 -2380 1220 310 25
DS -2100 -1380 -2220 -320 310 25
DS -8750 2750 -8750 -3000 70 21
DS -8750 -3000 8750 -3000 70 21
DS 8750 -3000 8750 2750 70 21
DS 8750 2750 -8750 2750 70 21
DC -3120 1450 -3040 1420 310 25
DS -4540 -1610 -3590 -1610 310 25
DS -4810 1380 -3870 1380 310 25
$PAD
Sh "1" R 600 600 0 0 0
Dr 360 0 0
At STD N 00E0FFFF
Ne 0 ""
Po -3000 2000
$EndPAD
$PAD
Sh "2" C 600 600 0 0 0
Dr 360 0 0
At STD N 00E0FFFF
Ne 0 ""
Po -2000 2000
$EndPAD
$PAD
Sh "3" C 600 600 0 0 0
Dr 360 0 0
At STD N 00E0FFFF
Ne 0 ""
Po -1000 2000
$EndPAD
$PAD
Sh "4" C 600 600 0 0 0
Dr 360 0 0
At STD N 00E0FFFF
Ne 0 ""
Po 0 2000
$EndPAD
$PAD
Sh "5" C 600 600 0 0 0
Dr 360 0 0
At STD N 00E0FFFF
Ne 0 ""
Po 1000 2000
$EndPAD
$PAD
Sh "6" C 600 600 0 0 0
Dr 360 0 0
At STD N 00E0FFFF
Ne 0 ""
Po 2000 2000
$EndPAD
$PAD
Sh "7" C 600 600 0 0 0
Dr 360 0 0
At STD N 00E0FFFF
Ne 0 ""
Po 3000 2000
$EndPAD
$PAD
Sh "8" C 600 600 0 0 0
Dr 360 0 0
At STD N 00E0FFFF
Ne 0 ""
Po 3000 -2220
$EndPAD
$PAD
Sh "9" C 600 600 0 0 0
Dr 360 0 0
At STD N 00E0FFFF
Ne 0 ""
Po 2020 -2220
$EndPAD
$PAD
Sh "10" C 600 600 0 0 0
Dr 360 0 0
At STD N 00E0FFFF
Ne 0 ""
Po 1000 -2220
$EndPAD
$PAD
Sh "11" C 600 600 0 0 0
Dr 360 0 0
At STD N 00E0FFFF
Ne 0 ""
Po 0 -2220
$EndPAD
$PAD
Sh "12" C 600 600 0 0 0
Dr 360 0 0
At STD N 00E0FFFF
Ne 0 ""
Po -1020 -2210
$EndPAD
$PAD
Sh "13" C 600 600 0 0 0
Dr 360 0 0
At STD N 00E0FFFF
Ne 0 ""
Po -2000 -2220
$EndPAD
$PAD
Sh "14" C 600 600 0 0 0
Dr 360 0 0
At STD N 00E0FFFF
Ne 0 ""
Po -3000 -2220
$EndPAD
$EndMODULE  HD-BVM
$MODULE HD-A82X
Po 0 0 0 15 4FC4C683 00000000 ~~
Li HD-A82X
Sc 00000000
AR
Op 0 0 0
T0 0 -6000 394 394 0 79 N V 21 N "HD-A82X"
T1 0 5000 394 394 0 79 N I 21 N "Value"
DS 380 530 970 3200 310 25
DS -1000 -3130 -410 -460 310 25
DS -50 330 -210 3320 310 25
DS 140 -3290 -20 -300 310 25
DS 420 -3600 1480 -3600 310 25
DS -1200 -3600 -130 -3600 310 25
DS 60 3640 1120 3640 310 25
DS -1550 3640 -490 3640 310 25
DS 1520 330 1360 3320 310 25
DS 1710 -3290 1560 -300 310 25
DS 260 20 1320 20 310 25
DS -1350 20 -290 20 310 25
DS -1590 330 -1750 3320 310 25
DS -1390 -3290 -1550 -300 310 25
DS -4000 -5500 -4000 5500 70 21
DS -4000 5500 4000 5500 70 21
DS 4000 5500 4000 -5500 70 21
DS 4000 -5500 -4000 -5500 70 21
DC 1950 3790 2110 3790 310 25
DS 1320 -3210 420 -420 310 25
DS -450 450 -1350 3240 310 25
$PAD
Sh "1" R 580 580 0 0 0
Dr 260 0 0
At STD N 00E0FFFF
Ne 0 ""
Po -3000 -4000
$EndPAD
$PAD
Sh "2" C 580 580 0 0 0
Dr 260 0 0
At STD N 00E0FFFF
Ne 0 ""
Po -3000 -3000
$EndPAD
$PAD
Sh "3" C 580 580 0 0 0
Dr 260 0 0
At STD N 00E0FFFF
Ne 0 ""
Po -3000 -2000
$EndPAD
$PAD
Sh "4" C 580 580 0 0 0
Dr 260 0 0
At STD N 00E0FFFF
Ne 0 ""
Po -3000 -1000
$EndPAD
$PAD
Sh "5" C 580 580 0 0 0
Dr 260 0 0
At STD N 00E0FFFF
Ne 0 ""
Po -3000 0
$EndPAD
$PAD
Sh "6" C 580 580 0 0 0
Dr 260 0 0
At STD N 00E0FFFF
Ne 0 ""
Po -3000 1000
$EndPAD
$PAD
Sh "7" C 580 580 0 0 0
Dr 260 0 0
At STD N 00E0FFFF
Ne 0 ""
Po -3000 2000
$EndPAD
$PAD
Sh "8" C 580 580 0 0 0
Dr 260 0 0
At STD N 00E0FFFF
Ne 0 ""
Po -3000 3000
$EndPAD
$PAD
Sh "9" C 580 580 0 0 0
Dr 260 0 0
At STD N 00E0FFFF
Ne 0 ""
Po -3000 4000
$EndPAD
$PAD
Sh "10" C 580 580 0 0 0
Dr 260 0 0
At STD N 00E0FFFF
Ne 0 ""
Po 3000 4000
$EndPAD
$PAD
Sh "11" C 580 580 0 0 0
Dr 260 0 0
At STD N 00E0FFFF
Ne 0 ""
Po 3000 3000
$EndPAD
$PAD
Sh "12" C 580 580 0 0 0
Dr 260 0 0
At STD N 00E0FFFF
Ne 0 ""
Po 3000 2000
$EndPAD
$PAD
Sh "13" C 580 580 0 0 0
Dr 260 0 0
At STD N 00E0FFFF
Ne 0 ""
Po 3000 1000
$EndPAD
$PAD
Sh "14" C 580 580 0 0 0
Dr 260 0 0
At STD N 00E0FFFF
Ne 0 ""
Po 3000 0
$EndPAD
$PAD
Sh "15" C 580 580 0 0 0
Dr 260 0 0
At STD N 00E0FFFF
Ne 0 ""
Po 3000 -1000
$EndPAD
$PAD
Sh "16" C 580 580 0 0 0
Dr 260 0 0
At STD N 00E0FFFF
Ne 0 ""
Po 3000 -2000
$EndPAD
$PAD
Sh "17" C 580 580 0 0 0
Dr 260 0 0
At STD N 00E0FFFF
Ne 0 ""
Po 3000 -3000
$EndPAD
$PAD
Sh "18" C 580 580 0 0 0
Dr 260 0 0
At STD N 00E0FFFF
Ne 0 ""
Po 3000 -4000
$EndPAD
$EndMODULE  HD-A82X
$MODULE HD-AB5X
Po 0 0 0 15 4FC4C734 00000000 ~~
Li HD-AB5X
Sc 00000000
AR
Op 0 0 0
.SolderPasteRatio 1.04619e-316
T0 0 -9500 394 394 0 79 N V 21 N "HD-AB5X"
T1 0 -3500 394 394 0 79 N I 21 N "Value"
DS 3310 1220 2920 6730 1180 25
DS 3700 -6260 3310 -750 1180 25
DS -2600 240 2330 240 1180 25
DS -3580 1220 -3970 6730 1180 25
DS -3190 -6260 -3580 -750 1180 25
DS -6750 9500 6750 9500 70 21
DS 6750 9500 6750 -9000 70 21
DS 6750 -9000 -6750 -9000 70 21
DS -6750 -9000 -6750 9500 70 21
DC 4880 7720 4880 7520 1180 25
DS -2200 -7240 2720 -7240 1180 25
DS -2990 7720 1930 7720 1180 25
$PAD
Sh "1" R 620 620 0 0 0
Dr 300 0 0
At STD N 00E0FFFF
Ne 0 ""
Po -2000 8500
$EndPAD
$PAD
Sh "2" C 620 620 0 0 0
Dr 300 0 0
At STD N 00E0FFFF
Ne 0 ""
Po -1000 8500
$EndPAD
$PAD
Sh "3" C 620 620 0 0 0
Dr 300 0 0
At STD N 00E0FFFF
Ne 0 ""
Po 0 8500
$EndPAD
$PAD
Sh "4" C 620 620 0 0 0
Dr 300 0 0
At STD N 00E0FFFF
Ne 0 ""
Po 1000 8500
$EndPAD
$PAD
Sh "5" C 620 620 0 0 0
Dr 300 0 0
At STD N 00E0FFFF
Ne 0 ""
Po 2000 8500
$EndPAD
$PAD
Sh "6" C 620 620 0 0 0
Dr 300 0 0
At STD N 00E0FFFF
Ne 0 ""
Po 2000 -8000
$EndPAD
$PAD
Sh "7" C 620 620 0 0 0
Dr 300 0 0
At STD N 00E0FFFF
Ne 0 ""
Po 1000 -8000
$EndPAD
$PAD
Sh "8" C 620 620 0 0 0
Dr 300 0 0
At STD N 00E0FFFF
Ne 0 ""
Po 0 -8000
$EndPAD
$PAD
Sh "9" C 620 620 0 0 0
Dr 300 0 0
At STD N 00E0FFFF
Ne 0 ""
Po -1000 -8000
$EndPAD
$PAD
Sh "10" C 620 620 0 0 0
Dr 300 0 0
At STD N 00E0FFFF
Ne 0 ""
Po -2000 -8000
$EndPAD
$EndMODULE  HD-AB5X
$MODULE HD-BQ-A53
Po 0 0 0 15 4FC4C7CA 00000000 ~~
Li HD-BQ-A53
Sc 00000000
AR
Op 0 0 0
T0 0 -4000 394 394 0 79 N V 21 N "HD-BQ-A53"
T1 0 4000 394 394 0 79 N I 21 N "Value"
DS 6460 250 6310 2220 310 25
DS 6660 -2270 6500 -300 310 25
DS 4620 -20 6230 -20 310 25
DS 4340 250 4180 2220 310 25
DS 4540 -2270 4380 -300 310 25
DC 2920 2610 3000 2570 310 25
DS 880 -2540 2490 -2540 310 25
DS 490 2490 2100 2490 310 25
DS 2530 250 2370 2220 310 25
DS 2730 -2270 2570 -300 310 25
DS 680 -20 2300 -20 310 25
DS 410 250 250 2220 310 25
DS 600 -2270 450 -300 310 25
DC -1010 2610 -930 2570 310 25
DS -3050 -2540 -1440 -2540 310 25
DS -3450 2490 -1840 2490 310 25
DS -1400 250 -1560 2220 310 25
DS -1210 -2270 -1360 -300 310 25
DS -3250 -20 -1640 -20 310 25
DS -3530 250 -3680 2220 310 25
DS -3330 -2270 -3490 -300 310 25
DC -4940 2610 -4860 2570 310 25
DS -6990 -2540 -5380 -2540 310 25
DS -7380 2490 -5770 2490 310 25
DS -5340 250 -5490 2220 310 25
DS -5140 -2270 -5300 -300 310 25
DS -7180 -20 -5570 -20 310 25
DS -7460 250 -7620 2220 310 25
DS -7260 -2270 -7420 -300 310 25
DS -10000 3500 10000 3500 70 21
DS 10000 3500 10000 -3500 70 21
DS 10000 -3500 -10000 -3500 70 21
DS -10000 -3500 -10000 3500 70 21
DC 6860 2610 6940 2570 310 25
DS 4810 -2540 6420 -2540 310 25
DS 4420 2490 6030 2490 310 25
$PAD
Sh "1" R 600 600 0 0 0
Dr 360 0 0
At STD N 00E0FFFF
Ne 0 ""
Po -9500 3000
$EndPAD
$PAD
Sh "2" C 600 600 0 0 0
Dr 360 0 0
At STD N 00E0FFFF
Ne 0 ""
Po -8500 3000
$EndPAD
$PAD
Sh "3" C 600 600 0 0 0
Dr 360 0 0
At STD N 00E0FFFF
Ne 0 ""
Po -7500 3000
$EndPAD
$PAD
Sh "4" C 600 600 0 0 0
Dr 360 0 0
At STD N 00E0FFFF
Ne 0 ""
Po -6500 3000
$EndPAD
$PAD
Sh "5" C 600 600 0 0 0
Dr 360 0 0
At STD N 00E0FFFF
Ne 0 ""
Po -5500 3000
$EndPAD
$PAD
Sh "6" C 600 600 0 0 0
Dr 360 0 0
At STD N 00E0FFFF
Ne 0 ""
Po -4500 3000
$EndPAD
$PAD
Sh "7" C 600 600 0 0 0
Dr 360 0 0
At STD N 00E0FFFF
Ne 0 ""
Po -3500 3000
$EndPAD
$PAD
Sh "8" C 600 600 0 0 0
Dr 360 0 0
At STD N 00E0FFFF
Ne 0 ""
Po -2500 3000
$EndPAD
$PAD
Sh "9" C 600 600 0 0 0
Dr 360 0 0
At STD N 00E0FFFF
Ne 0 ""
Po -1500 3000
$EndPAD
$PAD
Sh "10" C 600 600 0 0 0
Dr 360 0 0
At STD N 00E0FFFF
Ne 0 ""
Po -500 3000
$EndPAD
$PAD
Sh "11" C 600 600 0 0 0
Dr 360 0 0
At STD N 00E0FFFF
Ne 0 ""
Po 500 3000
$EndPAD
$PAD
Sh "12" C 600 600 0 0 0
Dr 360 0 0
At STD N 00E0FFFF
Ne 0 ""
Po 1500 3000
$EndPAD
$PAD
Sh "13" C 600 600 0 0 0
Dr 360 0 0
At STD N 00E0FFFF
Ne 0 ""
Po 2500 3000
$EndPAD
$PAD
Sh "14" C 600 600 0 0 0
Dr 360 0 0
At STD N 00E0FFFF
Ne 0 ""
Po 3500 3000
$EndPAD
$PAD
Sh "15" C 600 600 0 0 0
Dr 360 0 0
At STD N 00E0FFFF
Ne 0 ""
Po 4500 3000
$EndPAD
$PAD
Sh "16" C 600 600 0 0 0
Dr 360 0 0
At STD N 00E0FFFF
Ne 0 ""
Po 5500 3000
$EndPAD
$PAD
Sh "17" C 600 600 0 0 0
Dr 360 0 0
At STD N 00E0FFFF
Ne 0 ""
Po 6500 3000
$EndPAD
$PAD
Sh "18" C 600 600 0 0 0
Dr 360 0 0
At STD N 00E0FFFF
Ne 0 ""
Po 7500 3000
$EndPAD
$PAD
Sh "19" C 600 600 0 0 0
Dr 360 0 0
At STD N 00E0FFFF
Ne 0 ""
Po 8500 3000
$EndPAD
$PAD
Sh "20" C 600 600 0 0 0
Dr 360 0 0
At STD N 00E0FFFF
Ne 0 ""
Po 9500 3000
$EndPAD
$PAD
Sh "21" C 600 600 0 0 0
Dr 360 0 0
At STD N 00E0FFFF
Ne 0 ""
Po 9500 -3000
$EndPAD
$PAD
Sh "22" C 600 600 0 0 0
Dr 360 0 0
At STD N 00E0FFFF
Ne 0 ""
Po 8500 -3000
$EndPAD
$PAD
Sh "23" C 600 600 0 0 0
Dr 360 0 0
At STD N 00E0FFFF
Ne 0 ""
Po 7500 -3000
$EndPAD
$PAD
Sh "24" C 600 600 0 0 0
Dr 360 0 0
At STD N 00E0FFFF
Ne 0 ""
Po 6500 -3000
$EndPAD
$PAD
Sh "25" C 600 600 0 0 0
Dr 360 0 0
At STD N 00E0FFFF
Ne 0 ""
Po 5500 -3000
$EndPAD
$PAD
Sh "26" C 600 600 0 0 0
Dr 360 0 0
At STD N 00E0FFFF
Ne 0 ""
Po 4500 -3000
$EndPAD
$PAD
Sh "27" C 600 600 0 0 0
Dr 360 0 0
At STD N 00E0FFFF
Ne 0 ""
Po 3500 -3000
$EndPAD
$PAD
Sh "28" C 600 600 0 0 0
Dr 360 0 0
At STD N 00E0FFFF
Ne 0 ""
Po 2500 -3000
$EndPAD
$PAD
Sh "29" C 600 600 0 0 0
Dr 360 0 0
At STD N 00E0FFFF
Ne 0 ""
Po 1500 -3000
$EndPAD
$PAD
Sh "30" C 600 600 0 0 0
Dr 360 0 0
At STD N 00E0FFFF
Ne 0 ""
Po 500 -3000
$EndPAD
$PAD
Sh "31" C 600 600 0 0 0
Dr 360 0 0
At STD N 00E0FFFF
Ne 0 ""
Po -500 -3000
$EndPAD
$PAD
Sh "32" C 600 600 0 0 0
Dr 360 0 0
At STD N 00E0FFFF
Ne 0 ""
Po -1500 -3000
$EndPAD
$PAD
Sh "33" C 600 600 0 0 0
Dr 360 0 0
At STD N 00E0FFFF
Ne 0 ""
Po -2500 -3000
$EndPAD
$PAD
Sh "34" C 600 600 0 0 0
Dr 360 0 0
At STD N 00E0FFFF
Ne 0 ""
Po -3500 -3000
$EndPAD
$PAD
Sh "35" C 600 600 0 0 0
Dr 360 0 0
At STD N 00E0FFFF
Ne 0 ""
Po -4500 -3000
$EndPAD
$PAD
Sh "36" C 600 600 0 0 0
Dr 360 0 0
At STD N 00E0FFFF
Ne 0 ""
Po -5500 -3000
$EndPAD
$PAD
Sh "37" C 600 600 0 0 0
Dr 360 0 0
At STD N 00E0FFFF
Ne 0 ""
Po -6500 -3000
$EndPAD
$PAD
Sh "38" C 600 600 0 0 0
Dr 360 0 0
At STD N 00E0FFFF
Ne 0 ""
Po -7500 -3000
$EndPAD
$PAD
Sh "39" C 600 600 0 0 0
Dr 360 0 0
At STD N 00E0FFFF
Ne 0 ""
Po -8500 -3000
$EndPAD
$PAD
Sh "40" C 600 600 0 0 0
Dr 360 0 0
At STD N 00E0FFFF
Ne 0 ""
Po -9500 -3000
$EndPAD
$EndMODULE  HD-BQ-A53
$MODULE HD-E52X
Po 0 0 0 15 4FC4C84E 00000000 ~~
Li HD-E52X
Sc 00000000
AR
Op 0 0 0
T0 0 -5000 394 394 0 79 N V 21 N "HD-E52X"
T1 0 5000 394 394 0 79 N I 21 N "Value"
DS 2290 330 2680 2060 310 25
DS 1540 -460 1150 -2190 310 25
DS 1930 -420 2010 -2270 310 25
DS 1860 2100 1930 250 310 25
DS 3150 210 3070 2180 310 25
DS 2050 2420 2800 2420 310 25
DS 870 2420 1620 2420 310 25
DS 2210 -2580 2960 -2580 310 25
DS 1030 -2580 1780 -2580 310 25
DS 3230 -2300 3150 -340 310 25
DS 2130 -60 2880 -60 310 25
DS 950 -60 1700 -60 310 25
DS 640 210 560 2180 310 25
DS 750 -2300 680 -340 310 25
DC -660 2450 -580 2380 310 25
DS -2000 -500 -1410 -2190 310 25
DS -3340 2020 -2750 330 310 25
DS -2000 330 -1610 2060 310 25
DS -2750 -460 -3140 -2190 310 25
DS -2350 -420 -2270 -2270 310 25
DS -2430 2100 -2350 250 310 25
DS -1130 210 -1210 2180 310 25
DS -2240 2420 -1490 2420 310 25
DS -3420 2420 -2670 2420 310 25
DS -2080 -2580 -1330 -2580 310 25
DS -3260 -2580 -2510 -2580 310 25
DS -1050 -2300 -1130 -340 310 25
DS -2160 -60 -1410 -60 310 25
DS -3340 -60 -2590 -60 310 25
DS -3650 210 -3730 2180 310 25
DS -3530 -2300 -3610 -340 310 25
DS -5000 4250 5000 4250 70 21
DS 5000 4250 5000 -4250 70 21
DS 5000 -4250 -5000 -4250 70 21
DS -5000 -4250 -5000 4250 70 21
DC 3630 2450 3700 2380 310 25
DS 2290 -500 2880 -2190 310 25
DS 950 2020 1540 330 310 25
$PAD
Sh "1" R 600 600 0 0 0
Dr 360 0 0
At STD N 00E0FFFF
Ne 0 ""
Po -4000 3000
$EndPAD
$PAD
Sh "2" C 600 600 0 0 0
Dr 360 0 0
At STD N 00E0FFFF
Ne 0 ""
Po -3000 3000
$EndPAD
$PAD
Sh "3" C 600 600 0 0 0
Dr 360 0 0
At STD N 00E0FFFF
Ne 0 ""
Po -2000 3000
$EndPAD
$PAD
Sh "4" C 600 600 0 0 0
Dr 360 0 0
At STD N 00E0FFFF
Ne 0 ""
Po -1000 3000
$EndPAD
$PAD
Sh "5" C 600 600 0 0 0
Dr 360 0 0
At STD N 00E0FFFF
Ne 0 ""
Po 0 3000
$EndPAD
$PAD
Sh "6" C 600 600 0 0 0
Dr 360 0 0
At STD N 00E0FFFF
Ne 0 ""
Po 1000 3000
$EndPAD
$PAD
Sh "7" C 600 600 0 0 0
Dr 360 0 0
At STD N 00E0FFFF
Ne 0 ""
Po 2000 3000
$EndPAD
$PAD
Sh "8" C 600 600 0 0 0
Dr 360 0 0
At STD N 00E0FFFF
Ne 0 ""
Po 3000 3000
$EndPAD
$PAD
Sh "9" C 600 600 0 0 0
Dr 360 0 0
At STD N 00E0FFFF
Ne 0 ""
Po 4000 3000
$EndPAD
$PAD
Sh "10" C 600 600 0 0 0
Dr 360 0 0
At STD N 00E0FFFF
Ne 0 ""
Po 4000 -3000
$EndPAD
$PAD
Sh "11" C 600 600 0 0 0
Dr 360 0 0
At STD N 00E0FFFF
Ne 0 ""
Po 3000 -3000
$EndPAD
$PAD
Sh "12" C 600 600 0 0 0
Dr 360 0 0
At STD N 00E0FFFF
Ne 0 ""
Po 2000 -3000
$EndPAD
$PAD
Sh "13" C 600 600 0 0 0
Dr 360 0 0
At STD N 00E0FFFF
Ne 0 ""
Po 1000 -3000
$EndPAD
$PAD
Sh "14" C 600 600 0 0 0
Dr 360 0 0
At STD N 00E0FFFF
Ne 0 ""
Po 0 -3000
$EndPAD
$PAD
Sh "15" C 600 600 0 0 0
Dr 360 0 0
At STD N 00E0FFFF
Ne 0 ""
Po -1000 -3000
$EndPAD
$PAD
Sh "16" C 600 600 0 0 0
Dr 360 0 0
At STD N 00E0FFFF
Ne 0 ""
Po -2000 -3000
$EndPAD
$PAD
Sh "17" C 600 600 0 0 0
Dr 360 0 0
At STD N 00E0FFFF
Ne 0 ""
Po -3000 -3000
$EndPAD
$PAD
Sh "18" C 600 600 0 0 0
Dr 360 0 0
At STD N 00E0FFFF
Ne 0 ""
Po -4000 -3000
$EndPAD
$EndMODULE  HD-E52X
$MODULE HD-BQ-M31
Po 0 0 0 15 4FC4C897 00000000 ~~
Li HD-BQ-M31
Sc 00000000
AR
Op 0 0 0
T0 0 -3500 394 394 0 79 N V 21 N "HD-BQ-M31"
T1 0 118 394 394 0 79 N I 21 N "Value"
DS -7000 2750 7000 2750 70 21
DS 7000 2750 7000 -2750 70 21
DS 7000 -2750 -7000 -2750 70 21
DS -7000 -2750 -7000 2750 70 21
$PAD
Sh "1" R 600 600 0 0 0
Dr 360 0 0
At STD N 00E0FFFF
Ne 0 ""
Po -3500 2000
$EndPAD
$PAD
Sh "2" C 600 600 0 0 0
Dr 360 0 0
At STD N 00E0FFFF
Ne 0 ""
Po -2500 2000
$EndPAD
$PAD
Sh "3" C 600 600 0 0 0
Dr 360 0 0
At STD N 00E0FFFF
Ne 0 ""
Po -1500 2000
$EndPAD
$PAD
Sh "4" C 600 600 0 0 0
Dr 360 0 0
At STD N 00E0FFFF
Ne 0 ""
Po -500 2000
$EndPAD
$PAD
Sh "5" C 600 600 0 0 0
Dr 360 0 0
At STD N 00E0FFFF
Ne 0 ""
Po 500 2000
$EndPAD
$PAD
Sh "6" C 600 600 0 0 0
Dr 360 0 0
At STD N 00E0FFFF
Ne 0 ""
Po 1500 2000
$EndPAD
$PAD
Sh "7" C 600 600 0 0 0
Dr 360 0 0
At STD N 00E0FFFF
Ne 0 ""
Po 2500 2000
$EndPAD
$PAD
Sh "8" C 600 600 0 0 0
Dr 360 0 0
At STD N 00E0FFFF
Ne 0 ""
Po 3500 2000
$EndPAD
$PAD
Sh "9" C 600 600 0 0 0
Dr 360 0 0
At STD N 00E0FFFF
Ne 0 ""
Po 3500 -2000
$EndPAD
$PAD
Sh "10" C 600 600 0 0 0
Dr 360 0 0
At STD N 00E0FFFF
Ne 0 ""
Po 2500 -2000
$EndPAD
$PAD
Sh "11" C 600 600 0 0 0
Dr 360 0 0
At STD N 00E0FFFF
Ne 0 ""
Po 1500 -2000
$EndPAD
$PAD
Sh "12" C 600 600 0 0 0
Dr 360 0 0
At STD N 00E0FFFF
Ne 0 ""
Po 500 -2000
$EndPAD
$PAD
Sh "13" C 600 600 0 0 0
Dr 360 0 0
At STD N 00E0FFFF
Ne 0 ""
Po -500 -2000
$EndPAD
$PAD
Sh "14" C 600 600 0 0 0
Dr 360 0 0
At STD N 00E0FFFF
Ne 0 ""
Po -1500 -2000
$EndPAD
$PAD
Sh "15" C 600 600 0 0 0
Dr 360 0 0
At STD N 00E0FFFF
Ne 0 ""
Po -2500 -2000
$EndPAD
$PAD
Sh "16" C 600 600 0 0 0
Dr 360 0 0
At STD N 00E0FFFF
Ne 0 ""
Po -3500 -2000
$EndPAD
$EndMODULE  HD-BQ-M31
$MODULE HD-M306
Po 0 0 0 15 4FC4C908 00000000 ~~
Li HD-M306
Sc 00000000
AR
Op 0 0 0
T0 0 -4500 394 394 0 79 N V 21 N "HD-M306"
T1 0 3000 394 394 0 79 N I 21 N "Value"
DS -5840 1450 -5050 1450 310 25
DS -5640 -1500 -4850 -1500 310 25
DS -5760 0 -4970 0 310 25
DS -6070 200 -6150 1220 310 25
DS -5950 -1300 -6030 -280 310 25
DC 6790 1450 6870 1490 310 25
DS 6360 200 6280 1220 310 25
DS 6470 -1300 6400 -280 310 25
DS 5180 1450 5960 1450 310 25
DS 5370 -1500 6160 -1500 310 25
DS 5250 0 6040 0 310 25
DS 4940 200 4860 1220 310 25
DS 5060 -1300 4980 -280 310 25
DC 4040 1450 4110 1490 310 25
DS 3600 200 3520 1220 310 25
DS 3720 -1300 3640 -280 310 25
DS 2420 1450 3210 1450 310 25
DS 2620 -1500 3410 -1500 310 25
DS 2500 0 3290 0 310 25
DS 2190 200 2110 1220 310 25
DS 2300 -1300 2230 -280 310 25
DC 1280 1450 1360 1490 310 25
DS 850 200 770 1220 310 25
DS 970 -1300 890 -280 310 25
DS -330 1450 460 1450 310 25
DS -130 -1500 650 -1500 310 25
DS -250 0 530 0 310 25
DS -570 200 -650 1220 310 25
DS -450 -1300 -530 -280 310 25
DC -1470 1450 -1390 1490 310 25
DS -1900 200 -1980 1220 310 25
DS -1790 -1300 -1860 -280 310 25
DS -3080 1450 -2300 1450 310 25
DS -2890 -1500 -2100 -1500 310 25
DS -3000 0 -2220 0 310 25
DS -3320 200 -3400 1220 310 25
DS -3200 -1300 -3280 -280 310 25
DS -10000 3750 10000 3750 70 21
DS 10000 3750 10000 -3750 70 21
DS 10000 -3750 -10000 -3750 70 21
DS -10000 -3750 -10000 3750 70 21
DC -4220 1450 -4150 1490 310 25
DS -4660 200 -4740 1220 310 25
DS -4540 -1300 -4620 -280 310 25
$PAD
Sh "1" R 600 600 0 0 0
Dr 360 0 0
At STD N 00E0FFFF
Ne 0 ""
Po -3000 2000
$EndPAD
$PAD
Sh "2" C 600 600 0 0 0
Dr 360 0 0
At STD N 00E0FFFF
Ne 0 ""
Po -2000 2000
$EndPAD
$PAD
Sh "3" C 600 600 0 0 0
Dr 360 0 0
At STD N 00E0FFFF
Ne 0 ""
Po -1000 2000
$EndPAD
$PAD
Sh "4" C 600 600 0 0 0
Dr 360 0 0
At STD N 00E0FFFF
Ne 0 ""
Po 0 2000
$EndPAD
$PAD
Sh "5" C 600 600 0 0 0
Dr 360 0 0
At STD N 00E0FFFF
Ne 0 ""
Po 1000 2000
$EndPAD
$PAD
Sh "6" C 600 600 0 0 0
Dr 360 0 0
At STD N 00E0FFFF
Ne 0 ""
Po 2000 2000
$EndPAD
$PAD
Sh "7" C 600 600 0 0 0
Dr 360 0 0
At STD N 00E0FFFF
Ne 0 ""
Po 3000 2000
$EndPAD
$PAD
Sh "8" C 600 600 0 0 0
Dr 360 0 0
At STD N 00E0FFFF
Ne 0 ""
Po 3000 -2000
$EndPAD
$PAD
Sh "9" C 600 600 0 0 0
Dr 360 0 0
At STD N 00E0FFFF
Ne 0 ""
Po 2000 -2000
$EndPAD
$PAD
Sh "10" C 600 600 0 0 0
Dr 360 0 0
At STD N 00E0FFFF
Ne 0 ""
Po 1000 -2000
$EndPAD
$PAD
Sh "11" C 600 600 0 0 0
Dr 360 0 0
At STD N 00E0FFFF
Ne 0 ""
Po 0 -2000
$EndPAD
$PAD
Sh "12" C 600 600 0 0 0
Dr 360 0 0
At STD N 00E0FFFF
Ne 0 ""
Po -1000 -2000
$EndPAD
$PAD
Sh "13" C 600 600 0 0 0
Dr 360 0 0
At STD N 00E0FFFF
Ne 0 ""
Po -2000 -2000
$EndPAD
$PAD
Sh "14" C 600 600 0 0 0
Dr 360 0 0
At STD N 00E0FFFF
Ne 0 ""
Po -3000 -2000
$EndPAD
$EndMODULE  HD-M306
$MODULE HD-M324
Po 0 0 0 15 4FC4C964 00000000 ~~
Li HD-M324
Sc 00000000
AR
Op 0 0 0
T0 0 -3500 394 394 0 79 N V 21 N "HD-M324"
T1 0 3500 394 394 0 79 N I 21 N "Value"
DS -3720 1100 -3650 240 310 25
DS -3610 -280 -3530 -1140 310 25
DS -4710 -40 -3880 -40 310 25
DS -5060 1060 -4980 200 310 25
DS -4940 -320 -4860 -1180 310 25
DC 5010 1420 5050 1380 310 25
DS 3670 -1420 4500 -1420 310 25
DS 3430 1340 4260 1340 310 25
DS 4540 1100 4610 240 310 25
DS 4650 -280 4730 -1140 310 25
DS 3550 -40 4380 -40 310 25
DS 3200 1060 3280 200 310 25
DS 3320 -320 3400 -1180 310 25
DC 2250 1420 2290 1380 310 25
DS 920 -1420 1740 -1420 310 25
DS 680 1340 1510 1340 310 25
DS 1780 1100 1860 240 310 25
DS 1900 -280 1980 -1140 310 25
DS 800 -40 1620 -40 310 25
DS 450 1060 520 200 310 25
DS 560 -320 640 -1180 310 25
DC -500 1420 -460 1380 310 25
DS -1840 -1420 -1010 -1420 310 25
DS -2070 1340 -1250 1340 310 25
DS -970 1100 -890 240 310 25
DS -850 -280 -770 -1140 310 25
DS -1950 -40 -1130 -40 310 25
DS -2310 1060 -2230 200 310 25
DS -2190 -320 -2110 -1180 310 25
DS -6000 2750 -5750 2750 70 25
DS -5750 2750 6000 2750 70 21
DS 6000 2750 6000 -3000 70 21
DS 6000 -3000 -6000 -3000 70 21
DS -6000 -3000 -6000 2750 70 21
DS -6000 2750 -5750 2750 70 25
DC -3250 1420 -3210 1380 310 25
DS -4590 -1420 -3760 -1420 310 25
DS -4830 1340 -4000 1340 310 25
$PAD
Sh "1" R 540 540 0 0 0
Dr 260 0 0
At STD N 00E0FFFF
Ne 0 ""
Po -2500 2000
$EndPAD
$PAD
Sh "2" C 540 540 0 0 0
Dr 260 0 0
At STD N 00E0FFFF
Ne 0 ""
Po -1500 2000
$EndPAD
$PAD
Sh "3" C 540 540 0 0 0
Dr 260 0 0
At STD N 00E0FFFF
Ne 0 ""
Po -500 2000
$EndPAD
$PAD
Sh "4" C 540 540 0 0 0
Dr 260 0 0
At STD N 00E0FFFF
Ne 0 ""
Po 500 2000
$EndPAD
$PAD
Sh "5" C 540 540 0 0 0
Dr 260 0 0
At STD N 00E0FFFF
Ne 0 ""
Po 1500 2000
$EndPAD
$PAD
Sh "6" C 540 540 0 0 0
Dr 260 0 0
At STD N 00E0FFFF
Ne 0 ""
Po 2500 2000
$EndPAD
$PAD
Sh "7" C 540 540 0 0 0
Dr 260 0 0
At STD N 00E0FFFF
Ne 0 ""
Po 2500 -2000
$EndPAD
$PAD
Sh "8" C 540 540 0 0 0
Dr 260 0 0
At STD N 00E0FFFF
Ne 0 ""
Po 1500 -2000
$EndPAD
$PAD
Sh "9" C 540 540 0 0 0
Dr 260 0 0
At STD N 00E0FFFF
Ne 0 ""
Po 500 -2000
$EndPAD
$PAD
Sh "10" C 540 540 0 0 0
Dr 260 0 0
At STD N 00E0FFFF
Ne 0 ""
Po -500 -2000
$EndPAD
$PAD
Sh "11" C 540 540 0 0 0
Dr 260 0 0
At STD N 00E0FFFF
Ne 0 ""
Po -1500 -2000
$EndPAD
$PAD
Sh "12" C 540 540 0 0 0
Dr 260 0 0
At STD N 00E0FFFF
Ne 0 ""
Po -2500 -2000
$EndPAD
$EndMODULE  HD-M324
$MODULE HDSP-2112
Po 0 0 0 15 4FC4C9AE 00000000 ~~
Li HDSP-2112
Sc 00000000
AR
Op 0 0 0
T0 0 -4500 394 394 0 79 N V 21 N "HDSP-2112"
T1 0 0 394 394 0 79 N I 21 N "Value"
DS -8500 2500 -7000 4000 70 21
DS -7000 4000 8500 4000 70 21
DS 8500 4000 8500 -4000 70 21
DS 8500 -4000 -8500 -4000 70 21
DS -8500 -4000 -8500 2500 70 21
$PAD
Sh "1" R 540 540 0 0 0
Dr 260 0 0
At STD N 00E0FFFF
Ne 0 ""
Po -6500 3000
$EndPAD
$PAD
Sh "2" C 540 540 0 0 0
Dr 260 0 0
At STD N 00E0FFFF
Ne 0 ""
Po -5500 3000
$EndPAD
$PAD
Sh "15" C 540 540 0 0 0
Dr 260 0 0
At STD N 00E0FFFF
Ne 0 ""
Po 6500 -3000
$EndPAD
$PAD
Sh "3" C 540 540 0 0 0
Dr 260 0 0
At STD N 00E0FFFF
Ne 0 ""
Po -4500 3000
$EndPAD
$PAD
Sh "4" C 540 540 0 0 0
Dr 260 0 0
At STD N 00E0FFFF
Ne 0 ""
Po -3500 3000
$EndPAD
$PAD
Sh "5" C 540 540 0 0 0
Dr 260 0 0
At STD N 00E0FFFF
Ne 0 ""
Po -2500 3000
$EndPAD
$PAD
Sh "6" C 540 540 0 0 0
Dr 260 0 0
At STD N 00E0FFFF
Ne 0 ""
Po -1500 3000
$EndPAD
$PAD
Sh "7" C 540 540 0 0 0
Dr 260 0 0
At STD N 00E0FFFF
Ne 0 ""
Po -500 3000
$EndPAD
$PAD
Sh "8" C 540 540 0 0 0
Dr 260 0 0
At STD N 00E0FFFF
Ne 0 ""
Po 500 3000
$EndPAD
$PAD
Sh "9" C 540 540 0 0 0
Dr 260 0 0
At STD N 00E0FFFF
Ne 0 ""
Po 1500 3000
$EndPAD
$PAD
Sh "10" C 540 540 0 0 0
Dr 260 0 0
At STD N 00E0FFFF
Ne 0 ""
Po 2500 3000
$EndPAD
$PAD
Sh "11" C 540 540 0 0 0
Dr 260 0 0
At STD N 00E0FFFF
Ne 0 ""
Po 3500 3000
$EndPAD
$PAD
Sh "12" C 540 540 0 0 0
Dr 260 0 0
At STD N 00E0FFFF
Ne 0 ""
Po 4500 3000
$EndPAD
$PAD
Sh "13" C 540 540 0 0 0
Dr 260 0 0
At STD N 00E0FFFF
Ne 0 ""
Po 5500 3000
$EndPAD
$PAD
Sh "14" C 540 540 0 0 0
Dr 260 0 0
At STD N 00E0FFFF
Ne 0 ""
Po 6500 3000
$EndPAD
$PAD
Sh "16" C 540 540 0 0 0
Dr 260 0 0
At STD N 00E0FFFF
Ne 0 ""
Po 5500 -3000
$EndPAD
$PAD
Sh "17" C 540 540 0 0 0
Dr 260 0 0
At STD N 00E0FFFF
Ne 0 ""
Po 4500 -3000
$EndPAD
$PAD
Sh "18" C 540 540 0 0 0
Dr 260 0 0
At STD N 00E0FFFF
Ne 0 ""
Po 3500 -3000
$EndPAD
$PAD
Sh "19" C 540 540 0 0 0
Dr 260 0 0
At STD N 00E0FFFF
Ne 0 ""
Po 2500 -3000
$EndPAD
$PAD
Sh "20" C 540 540 0 0 0
Dr 260 0 0
At STD N 00E0FFFF
Ne 0 ""
Po 1500 -3000
$EndPAD
$PAD
Sh "21" C 540 540 0 0 0
Dr 260 0 0
At STD N 00E0FFFF
Ne 0 ""
Po -1500 -3000
$EndPAD
$PAD
Sh "22" C 540 540 0 0 0
Dr 260 0 0
At STD N 00E0FFFF
Ne 0 ""
Po -2500 -3000
$EndPAD
$PAD
Sh "23" C 540 540 0 0 0
Dr 260 0 0
At STD N 00E0FFFF
Ne 0 ""
Po -3500 -3000
$EndPAD
$PAD
Sh "24" C 540 540 0 0 0
Dr 260 0 0
At STD N 00E0FFFF
Ne 0 ""
Po -4500 -3000
$EndPAD
$PAD
Sh "25" C 540 540 0 0 0
Dr 260 0 0
At STD N 00E0FFFF
Ne 0 ""
Po -5500 -3000
$EndPAD
$PAD
Sh "26" C 540 540 0 0 0
Dr 260 0 0
At STD N 00E0FFFF
Ne 0 ""
Po -6500 -3000
$EndPAD
$EndMODULE  HDSP-2112
$MODULE HDSP-G
Po 0 0 0 15 4FC4CA03 00000000 ~~
Li HDSP-G
Sc 00000000
AR
Op 0 0 0
T0 0 -4000 394 394 0 79 N V 21 N "HDSP-G"
T1 0 4000 394 394 0 79 N I 21 N "Value"
DS 2800 290 2720 1860 310 25
DS 2880 -1910 2800 -340 310 25
DS 1230 -20 2560 -20 310 25
DS 990 290 910 1860 310 25
DS 1070 -1910 990 -340 310 25
DC -540 2220 -430 2220 310 25
DS -2430 -2190 -1090 -2190 310 25
DS -2590 2140 -1250 2140 310 25
DS -940 290 -1020 1860 310 25
DS -860 -1910 -940 -340 310 25
DS -2510 -20 -1170 -20 310 25
DS -2750 290 -2830 1860 310 25
DS -2670 -1910 -2750 -340 310 25
DS 4500 3500 4500 -3500 70 21
DS -4500 3500 4500 3500 70 21
DS 4500 -3500 -4500 -3500 70 21
DS -4500 -3500 -4500 3500 70 21
DC 3190 2220 3310 2220 310 25
DS 1300 -2190 2640 -2190 310 25
DS 1150 2140 2480 2140 310 25
$PAD
Sh "1" R 540 540 0 0 0
Dr 260 0 0
At STD N 00E0FFFF
Ne 0 ""
Po -4000 3000
$EndPAD
$PAD
Sh "2" C 540 540 0 0 0
Dr 260 0 0
At STD N 00E0FFFF
Ne 0 ""
Po -3000 3000
$EndPAD
$PAD
Sh "3" C 540 540 0 0 0
Dr 260 0 0
At STD N 00E0FFFF
Ne 0 ""
Po -2000 3000
$EndPAD
$PAD
Sh "4" C 540 540 0 0 0
Dr 260 0 0
At STD N 00E0FFFF
Ne 0 ""
Po -1000 3000
$EndPAD
$PAD
Sh "5" C 540 540 0 0 0
Dr 260 0 0
At STD N 00E0FFFF
Ne 0 ""
Po 0 3000
$EndPAD
$PAD
Sh "6" C 540 540 0 0 0
Dr 260 0 0
At STD N 00E0FFFF
Ne 0 ""
Po 1000 3000
$EndPAD
$PAD
Sh "7" C 540 540 0 0 0
Dr 260 0 0
At STD N 00E0FFFF
Ne 0 ""
Po 2000 3000
$EndPAD
$PAD
Sh "8" C 540 540 0 0 0
Dr 260 0 0
At STD N 00E0FFFF
Ne 0 ""
Po 3000 3000
$EndPAD
$PAD
Sh "9" C 540 540 0 0 0
Dr 260 0 0
At STD N 00E0FFFF
Ne 0 ""
Po 4000 3000
$EndPAD
$PAD
Sh "10" C 540 540 0 0 0
Dr 260 0 0
At STD N 00E0FFFF
Ne 0 ""
Po 4000 -3000
$EndPAD
$PAD
Sh "11" C 540 540 0 0 0
Dr 260 0 0
At STD N 00E0FFFF
Ne 0 ""
Po 3000 -3000
$EndPAD
$PAD
Sh "12" C 540 540 0 0 0
Dr 260 0 0
At STD N 00E0FFFF
Ne 0 ""
Po 2000 -3000
$EndPAD
$PAD
Sh "13" C 540 540 0 0 0
Dr 260 0 0
At STD N 00E0FFFF
Ne 0 ""
Po 1000 -3000
$EndPAD
$PAD
Sh "14" C 540 540 0 0 0
Dr 260 0 0
At STD N 00E0FFFF
Ne 0 ""
Po 0 -3000
$EndPAD
$PAD
Sh "15" C 540 540 0 0 0
Dr 260 0 0
At STD N 00E0FFFF
Ne 0 ""
Po -1000 -3000
$EndPAD
$PAD
Sh "16" C 540 540 0 0 0
Dr 260 0 0
At STD N 00E0FFFF
Ne 0 ""
Po -2000 -3000
$EndPAD
$PAD
Sh "17" C 540 540 0 0 0
Dr 260 0 0
At STD N 00E0FFFF
Ne 0 ""
Po -3000 -3000
$EndPAD
$PAD
Sh "18" C 540 540 0 0 0
Dr 260 0 0
At STD N 00E0FFFF
Ne 0 ""
Po -4000 -3000
$EndPAD
$EndMODULE  HDSP-G
$MODULE LTS3401
Po 0 0 0 15 4FC4CA70 00000000 ~~
Li LTS3401
Sc 00000000
AR
Op 0 0 0
T0 0 -6000 394 394 0 79 N V 21 N "LTS3401"
T1 0 6000 394 394 0 79 N I 21 N "Value"
DS 1440 4490 -1510 4490 780 25
DS 2230 -740 2340 -3730 780 25
DS 2030 3820 2150 830 780 25
DS -1900 -740 -1790 -3730 780 25
DS -2100 3820 -1980 830 780 25
DS 1640 40 -1310 40 780 25
DS -4000 -5500 -4000 5500 70 21
DS -4000 5500 4000 5500 70 21
DS 4000 5500 4000 -5500 70 21
DS 4000 -5500 -4000 -5500 70 21
DC -3080 4570 -3000 4410 780 25
DC 2970 4570 3050 4410 780 25
DS 1750 -4440 -1200 -4440 780 25
$PAD
Sh "1" R 600 600 0 0 0
Dr 360 0 0
At STD N 00E0FFFF
Ne 0 ""
Po -3000 -3500
$EndPAD
$PAD
Sh "2" C 600 600 0 0 0
Dr 360 0 0
At STD N 00E0FFFF
Ne 0 ""
Po -3000 -2500
$EndPAD
$PAD
Sh "3" C 600 600 0 0 0
Dr 360 0 0
At STD N 00E0FFFF
Ne 0 ""
Po -3000 -1500
$EndPAD
$PAD
Sh "4" C 600 600 0 0 0
Dr 360 0 0
At STD N 00E0FFFF
Ne 0 ""
Po -3000 -500
$EndPAD
$PAD
Sh "5" C 600 600 0 0 0
Dr 360 0 0
At STD N 00E0FFFF
Ne 0 ""
Po -3000 500
$EndPAD
$PAD
Sh "6" C 600 600 0 0 0
Dr 360 0 0
At STD N 00E0FFFF
Ne 0 ""
Po -3000 1500
$EndPAD
$PAD
Sh "7" C 600 600 0 0 0
Dr 360 0 0
At STD N 00E0FFFF
Ne 0 ""
Po -3000 2500
$EndPAD
$PAD
Sh "8" C 600 600 0 0 0
Dr 360 0 0
At STD N 00E0FFFF
Ne 0 ""
Po -3000 3500
$EndPAD
$PAD
Sh "9" C 600 600 0 0 0
Dr 360 0 0
At STD N 00E0FFFF
Ne 0 ""
Po 3000 3500
$EndPAD
$PAD
Sh "10" C 600 600 0 0 0
Dr 360 0 0
At STD N 00E0FFFF
Ne 0 ""
Po 3000 2500
$EndPAD
$PAD
Sh "11" C 600 600 0 0 0
Dr 360 0 0
At STD N 00E0FFFF
Ne 0 ""
Po 3000 1500
$EndPAD
$PAD
Sh "12" C 600 600 0 0 0
Dr 360 0 0
At STD N 00E0FFFF
Ne 0 ""
Po 3000 500
$EndPAD
$PAD
Sh "13" C 600 600 0 0 0
Dr 360 0 0
At STD N 00E0FFFF
Ne 0 ""
Po 3000 -500
$EndPAD
$PAD
Sh "14" C 600 600 0 0 0
Dr 360 0 0
At STD N 00E0FFFF
Ne 0 ""
Po 3000 -1500
$EndPAD
$PAD
Sh "15" C 600 600 0 0 0
Dr 360 0 0
At STD N 00E0FFFF
Ne 0 ""
Po 3000 -2500
$EndPAD
$PAD
Sh "16" C 600 600 0 0 0
Dr 360 0 0
At STD N 00E0FFFF
Ne 0 ""
Po 3000 -3500
$EndPAD
$EndMODULE  LTS3401
$MODULE PDA54-11
Po 0 0 0 15 4FC4CAAB 00000000 ~~
Li PDA54-11
Sc 00000000
AR
Op 0 0 0
T0 0 -5000 394 394 0 79 N V 21 N "PDA54-11"
T1 0 118 394 394 0 79 N I 21 N "Value"
DS -5000 4250 5000 4250 70 21
DS 5000 4250 5000 -4250 70 21
DS 5000 -4250 -5000 -4250 70 21
DS -5000 -4250 -5000 4250 70 21
$PAD
Sh "1" R 580 580 0 0 0
Dr 300 0 0
At STD N 00E0FFFF
Ne 0 ""
Po -4000 3000
$EndPAD
$PAD
Sh "2" C 580 580 0 0 0
Dr 300 0 0
At STD N 00E0FFFF
Ne 0 ""
Po -3000 3000
$EndPAD
$PAD
Sh "3" C 580 580 0 0 0
Dr 300 0 0
At STD N 00E0FFFF
Ne 0 ""
Po -2000 3000
$EndPAD
$PAD
Sh "4" C 580 580 0 0 0
Dr 300 0 0
At STD N 00E0FFFF
Ne 0 ""
Po -1000 3000
$EndPAD
$PAD
Sh "5" C 580 580 0 0 0
Dr 300 0 0
At STD N 00E0FFFF
Ne 0 ""
Po 0 3000
$EndPAD
$PAD
Sh "6" C 580 580 0 0 0
Dr 300 0 0
At STD N 00E0FFFF
Ne 0 ""
Po 1000 3000
$EndPAD
$PAD
Sh "7" C 580 580 0 0 0
Dr 300 0 0
At STD N 00E0FFFF
Ne 0 ""
Po 2000 3000
$EndPAD
$PAD
Sh "8" C 580 580 0 0 0
Dr 300 0 0
At STD N 00E0FFFF
Ne 0 ""
Po 3000 3000
$EndPAD
$PAD
Sh "9" C 580 580 0 0 0
Dr 300 0 0
At STD N 00E0FFFF
Ne 0 ""
Po 4000 3000
$EndPAD
$PAD
Sh "10" C 580 580 0 0 0
Dr 300 0 0
At STD N 00E0FFFF
Ne 0 ""
Po 4000 -3000
$EndPAD
$PAD
Sh "11" C 580 580 0 0 0
Dr 300 0 0
At STD N 00E0FFFF
Ne 0 ""
Po 3000 -3000
$EndPAD
$PAD
Sh "12" C 580 580 0 0 0
Dr 300 0 0
At STD N 00E0FFFF
Ne 0 ""
Po 2000 -3000
$EndPAD
$PAD
Sh "13" C 580 580 0 0 0
Dr 300 0 0
At STD N 00E0FFFF
Ne 0 ""
Po 1000 -3000
$EndPAD
$PAD
Sh "14" C 580 580 0 0 0
Dr 300 0 0
At STD N 00E0FFFF
Ne 0 ""
Po 0 -3000
$EndPAD
$PAD
Sh "15" C 580 580 0 0 0
Dr 300 0 0
At STD N 00E0FFFF
Ne 0 ""
Po -1000 -3000
$EndPAD
$PAD
Sh "16" C 580 580 0 0 0
Dr 300 0 0
At STD N 00E0FFFF
Ne 0 ""
Po -2000 -3000
$EndPAD
$PAD
Sh "17" C 580 580 0 0 0
Dr 300 0 0
At STD N 00E0FFFF
Ne 0 ""
Po -3000 -3000
$EndPAD
$PAD
Sh "18" C 580 580 0 0 0
Dr 300 0 0
At STD N 00E0FFFF
Ne 0 ""
Po -4000 -3000
$EndPAD
$EndMODULE  PDA54-11
$MODULE TDSG31
Po 0 0 0 15 4FC4CB34 00000000 ~~
Li TDSG31
Sc 00000000
AR
Op 0 0 0
T0 0 -3250 394 394 0 79 N V 21 N "TDSG31"
T1 0 3250 394 394 0 79 N I 21 N "Value"
DC 1330 2170 1410 2130 310 25
DS -560 -2190 850 -2190 310 25
DS -760 2170 660 2170 310 25
DS 930 330 850 1860 310 25
DS 1050 -1880 970 -340 310 25
DS -680 10 740 10 310 25
DS -880 330 -950 1860 310 25
DS -760 -1880 -840 -340 310 25
DS -2000 -2750 -2000 2750 70 21
DS -2000 2750 2000 2750 70 21
DS 2000 2750 2000 -2750 70 21
DS 2000 -2750 -2000 -2750 70 21
$PAD
Sh "1" R 600 600 0 0 0
Dr 360 0 0
At STD N 00E0FFFF
Ne 0 ""
Po -1500 -2000
$EndPAD
$PAD
Sh "2" C 600 600 0 0 0
Dr 360 0 0
At STD N 00E0FFFF
Ne 0 ""
Po -1500 -1000
$EndPAD
$PAD
Sh "3" C 600 600 0 0 0
Dr 360 0 0
At STD N 00E0FFFF
Ne 0 ""
Po -1500 0
$EndPAD
$PAD
Sh "4" C 600 600 0 0 0
Dr 360 0 0
At STD N 00E0FFFF
Ne 0 ""
Po -1500 1000
$EndPAD
$PAD
Sh "5" C 600 600 0 0 0
Dr 360 0 0
At STD N 00E0FFFF
Ne 0 ""
Po -1500 2000
$EndPAD
$PAD
Sh "6" C 600 600 0 0 0
Dr 360 0 0
At STD N 00E0FFFF
Ne 0 ""
Po 1500 2000
$EndPAD
$PAD
Sh "7" C 600 600 0 0 0
Dr 360 0 0
At STD N 00E0FFFF
Ne 0 ""
Po 1500 1000
$EndPAD
$PAD
Sh "8" C 600 600 0 0 0
Dr 360 0 0
At STD N 00E0FFFF
Ne 0 ""
Po 1500 0
$EndPAD
$PAD
Sh "9" C 600 600 0 0 0
Dr 360 0 0
At STD N 00E0FFFF
Ne 0 ""
Po 1500 -1000
$EndPAD
$PAD
Sh "10" C 600 600 0 0 0
Dr 360 0 0
At STD N 00E0FFFF
Ne 0 ""
Po 1500 -2000
$EndPAD
$EndMODULE  TDSG31
$MODULE HD-A54X
Po 0 0 0 15 4FC4CC20 00000000 ~~
Li HD-A54X
Sc 00000000
AR
Op 0 0 0
T0 0 -4500 394 394 0 79 N V 21 N "HD-A54X"
T1 0 4500 394 394 0 79 N I 21 N "Value"
DC 3150 2140 3230 2140 390 25
DS 790 2140 2050 2140 390 25
DS 950 20 2210 20 390 25
DS 1190 -2190 2450 -2190 390 25
DS 2600 330 2450 1830 390 25
DS 2680 -380 2840 -1870 390 25
DS 950 20 2210 20 390 25
DS 560 330 400 1830 390 25
DS 640 -380 790 -1870 390 25
DC -780 2140 -700 2140 390 25
DS -3140 2140 -1880 2140 390 25
DS -2980 20 -1720 20 390 25
DS -2750 -2190 -1490 -2190 390 25
DS -1330 330 -1490 1830 390 25
DS -1250 -380 -1090 -1870 390 25
DS -2980 20 -1720 20 390 25
DS -3380 330 -3530 1830 390 25
DS -3300 -380 -3140 -1870 390 25
DS -5000 3000 -4000 4000 70 21
DS -4000 4000 -5000 4000 70 25
DS -5000 4000 -5000 3000 70 25
DS -5000 4000 -5000 -4000 70 21
DS -5000 -4000 5000 -4000 70 21
DS 5000 -4000 5000 4000 70 21
DS 5000 4000 -5000 4000 70 21
$PAD
Sh "1" R 600 600 0 0 0
Dr 360 0 0
At STD N 00E0FFFF
Ne 0 ""
Po -4000 3000
$EndPAD
$PAD
Sh "2" C 600 600 0 0 0
Dr 360 0 0
At STD N 00E0FFFF
Ne 0 ""
Po -3000 3000
$EndPAD
$PAD
Sh "3" C 600 600 0 0 0
Dr 360 0 0
At STD N 00E0FFFF
Ne 0 ""
Po -2000 3000
$EndPAD
$PAD
Sh "4" C 600 600 0 0 0
Dr 360 0 0
At STD N 00E0FFFF
Ne 0 ""
Po -1000 3000
$EndPAD
$PAD
Sh "5" C 600 600 0 0 0
Dr 360 0 0
At STD N 00E0FFFF
Ne 0 ""
Po 0 3000
$EndPAD
$PAD
Sh "6" C 600 600 0 0 0
Dr 360 0 0
At STD N 00E0FFFF
Ne 0 ""
Po 1000 3000
$EndPAD
$PAD
Sh "7" C 600 600 0 0 0
Dr 360 0 0
At STD N 00E0FFFF
Ne 0 ""
Po 2000 3000
$EndPAD
$PAD
Sh "8" C 600 600 0 0 0
Dr 360 0 0
At STD N 00E0FFFF
Ne 0 ""
Po 3000 3000
$EndPAD
$PAD
Sh "9" C 600 600 0 0 0
Dr 360 0 0
At STD N 00E0FFFF
Ne 0 ""
Po 4000 3000
$EndPAD
$PAD
Sh "10" C 600 600 0 0 0
Dr 360 0 0
At STD N 00E0FFFF
Ne 0 ""
Po 4000 -3000
$EndPAD
$PAD
Sh "11" C 600 600 0 0 0
Dr 360 0 0
At STD N 00E0FFFF
Ne 0 ""
Po 3000 -3000
$EndPAD
$PAD
Sh "12" C 600 600 0 0 0
Dr 360 0 0
At STD N 00E0FFFF
Ne 0 ""
Po 2000 -3000
$EndPAD
$PAD
Sh "13" C 600 600 0 0 0
Dr 360 0 0
At STD N 00E0FFFF
Ne 0 ""
Po 1000 -3000
$EndPAD
$PAD
Sh "14" C 600 600 0 0 0
Dr 360 0 0
At STD N 00E0FFFF
Ne 0 ""
Po 0 -3000
$EndPAD
$PAD
Sh "15" C 600 600 0 0 0
Dr 360 0 0
At STD N 00E0FFFF
Ne 0 ""
Po -1000 -3000
$EndPAD
$PAD
Sh "16" C 600 600 0 0 0
Dr 360 0 0
At STD N 00E0FFFF
Ne 0 ""
Po -2000 -3000
$EndPAD
$PAD
Sh "17" C 600 600 0 0 0
Dr 360 0 0
At STD N 00E0FFFF
Ne 0 ""
Po -3000 -3000
$EndPAD
$PAD
Sh "18" C 600 600 0 0 0
Dr 360 0 0
At STD N 00E0FFFF
Ne 0 ""
Po -4000 -3000
$EndPAD
$EndMODULE  HD-A54X
$MODULE HD-M51XXX
Po 0 0 0 15 4FC4CD8B 00000000 ~~
Li HD-M51XXX
Sc 00000000
AR 
Op 0 0 0
T0 0 -4250 394 394 0 79 N V 21 N "HD-M51XXX"
T1 0 4250 394 394 0 79 N I 21 N "Val**"
DS -9000 3750 -9750 3000 79 21
DS 1350 20 2690 20 390 25
DS 960 250 800 1900 390 25
DS 1190 -2030 1030 -380 390 25
DC -460 2140 -380 2060 390 25
DS -2900 2220 -1560 2220 390 25
DS -2430 -2270 -1090 -2270 390 25
DS -1010 330 -1170 1980 390 25
DS -770 -1950 -930 -300 390 25
DS -2660 20 -1330 20 390 25
DS -3060 250 -3210 1900 390 25
DS -2820 -2030 -2980 -380 390 25
DC -4310 2140 -4240 2060 390 25
DS -6750 2220 -5420 2220 390 25
DS -6280 -2270 -4940 -2270 390 25
DS -4860 330 -5020 1980 390 25
DS -4630 -1950 -4790 -300 390 25
DS -6520 20 -5180 20 390 25
DS -6910 250 -7070 1900 390 25
DS -6670 -2030 -6830 -380 390 25
DS -9750 3750 9750 3750 79 21
DS 9750 3750 9750 -3750 79 21
DS 9750 -3750 -9750 -3750 79 21
DS -9750 -3750 -9750 3750 79 21
DC 7410 2140 7490 2060 390 25
DS 4970 2220 6310 2220 390 25
DS 5440 -2270 6780 -2270 390 25
DS 6860 330 6700 1980 390 25
DS 7090 -1950 6930 -300 390 25
DS 5200 20 6540 20 390 25
DS 4810 250 4650 1900 390 25
DS 5050 -2030 4890 -380 390 25
DC 3550 2140 3630 2060 390 25
DS 1110 2220 2450 2220 390 25
DS 1590 -2270 2920 -2270 390 25
DS 3000 330 2840 1980 390 25
DS 3240 -1950 3080 -300 390 25
$PAD
Sh "1" R 600 600 0 0 0
Dr 360 0 0
At STD N 00E0FFFF
Ne 0 ""
Po -2500 3000
$EndPAD
$PAD
Sh "2" C 600 600 0 0 0
Dr 360 0 0
At STD N 00E0FFFF
Ne 0 ""
Po -1500 3000
$EndPAD
$PAD
Sh "3" C 600 600 0 0 0
Dr 360 0 0
At STD N 00E0FFFF
Ne 0 ""
Po -500 3000
$EndPAD
$PAD
Sh "4" C 600 600 0 0 0
Dr 360 0 0
At STD N 00E0FFFF
Ne 0 ""
Po 500 3000
$EndPAD
$PAD
Sh "5" C 600 600 0 0 0
Dr 360 0 0
At STD N 00E0FFFF
Ne 0 ""
Po 1500 3000
$EndPAD
$PAD
Sh "6" C 600 600 0 0 0
Dr 360 0 0
At STD N 00E0FFFF
Ne 0 ""
Po 2500 3000
$EndPAD
$PAD
Sh "7" C 600 600 0 0 0
Dr 360 0 0
At STD N 00E0FFFF
Ne 0 ""
Po 2500 -3000
$EndPAD
$PAD
Sh "8" C 600 600 0 0 0
Dr 360 0 0
At STD N 00E0FFFF
Ne 0 ""
Po 1500 -3000
$EndPAD
$PAD
Sh "9" C 600 600 0 0 0
Dr 360 0 0
At STD N 00E0FFFF
Ne 0 ""
Po 500 -3000
$EndPAD
$PAD
Sh "10" C 600 600 0 0 0
Dr 360 0 0
At STD N 00E0FFFF
Ne 0 ""
Po -500 -3000
$EndPAD
$PAD
Sh "11" C 600 600 0 0 0
Dr 360 0 0
At STD N 00E0FFFF
Ne 0 ""
Po -1500 -3000
$EndPAD
$PAD
Sh "12" C 600 600 0 0 0
Dr 360 0 0
At STD N 00E0FFFF
Ne 0 ""
Po -2500 -3000
$EndPAD
$EndMODULE  HD-M51XXX
$EndLIBRARY
