PCBNEW-LibModule-V1  21.8.2012 16:16:54
# encoding utf-8
Units deci-mils
$INDEX
r_0603
r_0805
r_1206
r_1210
r_2010
r_2512
$EndINDEX
$MODULE r_0603
Po 0 0 0 15 50339701 00000000 ~~
Li r_0603
Cd SMT resistor, 0603
Sc 0
AR 
Op 0 0 0
.LocalClearance 78
T0 0 -630 393 393 0 78 N V 21 N "r_0603"
T1 0 0 314 314 0 59 N I 21 N "Val"
DS -591 -315 591 -315 78 21
DS 591 -315 591 315 78 21
DS 591 315 -591 315 78 21
DS -591 315 -591 -315 78 21
$PAD
Sh "1" R 354 394 0 0 0
Dr 0 0 0
At SMD N 00888000
Ne 0 ""
Po 296 0
$EndPAD
$PAD
Sh "2" R 354 394 0 0 0
Dr 0 0 0
At SMD N 00888000
Ne 0 ""
Po -296 0
$EndPAD
$SHAPE3D
Na "walter\\smd_resistors\\r_0603.wrl"
Sc 1 1 1
Of 0 0 0
Ro 0 0 0
$EndSHAPE3D
$EndMODULE r_0603
$MODULE r_0805
Po 0 0 0 15 50339566 00000000 ~~
Li r_0805
Cd SMT resistor, 0805
Sc 0
AR 
Op 0 0 0
.LocalClearance 78
T0 0 -700 393 393 0 78 N V 21 N "r_0805"
T1 0 0 314 314 0 59 N I 21 N "Val"
DS 748 413 748 -413 78 21
DS 748 -413 -748 -413 78 21
DS -748 -413 -748 413 78 21
DS -748 413 748 413 78 21
$PAD
Sh "1" R 512 590 0 0 0
Dr 0 0 0
At SMD N 00888000
Ne 0 ""
Po 375 0
$EndPAD
$PAD
Sh "2" R 512 590 0 0 0
Dr 0 0 0
At SMD N 00888000
Ne 0 ""
Po -375 0
$EndPAD
$SHAPE3D
Na "walter\\smd_resistors\\r_0805.wrl"
Sc 1 1 1
Of 0 0 0
Ro 0 0 0
$EndSHAPE3D
$EndMODULE r_0805
$MODULE r_1206
Po 0 0 0 15 50339670 00000000 ~~
Li r_1206
Cd SMT resistor, 1206
Sc 0
AR 
Op 0 0 0
.LocalClearance 78
T0 0 -787 393 393 0 78 N V 21 N "r_1206"
T1 0 0 392 392 0 77 N I 21 N "Val"
DS -984 -472 984 -472 78 21
DS 984 -472 984 472 78 21
DS 984 472 -984 472 78 21
DS -984 472 -984 -472 78 21
$PAD
Sh "1" R 630 710 0 0 0
Dr 0 0 0
At SMD N 00888000
Ne 0 ""
Po 550 0
$EndPAD
$PAD
Sh "2" R 630 710 0 0 0
Dr 0 0 0
At SMD N 00888000
Ne 0 ""
Po -550 0
$EndPAD
$SHAPE3D
Na "walter\\smd_resistors\\r_1206.wrl"
Sc 1 1 1
Of 0 0 0
Ro 0 0 0
$EndSHAPE3D
$EndMODULE r_1206
$MODULE r_1210
Po 0 0 0 15 50339778 00000000 ~~
Li r_1210
Cd SMT resistor, 1210
Sc 0
AR 
Op 0 0 0
.LocalClearance 78
T0 0 -965 393 393 0 78 N V 21 N "r_1210"
T1 0 0 392 392 0 77 N I 21 N "Val"
DS -984 -650 984 -650 78 21
DS 984 -650 984 650 78 21
DS 984 650 -984 650 78 21
DS -984 650 -984 -650 78 21
$PAD
Sh "1" R 630 1060 0 0 0
Dr 0 0 0
At SMD N 00888000
Ne 0 ""
Po 550 0
$EndPAD
$PAD
Sh "2" R 630 1060 0 0 0
Dr 0 0 0
At SMD N 00888000
Ne 0 ""
Po -550 0
$EndPAD
$SHAPE3D
Na "walter\\smd_resistors\\r_1210.wrl"
Sc 1 1 1
Of 0 0 0
Ro 0 0 0
$EndSHAPE3D
$EndMODULE r_1210
$MODULE r_2010
Po 0 0 0 15 50339816 00000000 ~~
Li r_2010
Cd SMT resistor, 2010
Sc 0
AR 
Op 0 0 0
.LocalClearance 78
T0 0 -965 393 393 0 78 N V 21 N "r_2010"
T1 0 0 393 393 0 78 N I 21 N "Value"
DS -1450 650 1450 650 79 21
DS 1450 650 1450 -650 79 21
DS 1450 -650 -1450 -650 79 21
DS -1450 -650 -1450 650 79 21
$PAD
Sh "1" R 630 1060 0 0 0
Dr 0 0 0
At SMD N 00888000
Ne 0 ""
Po 1015 0
$EndPAD
$PAD
Sh "2" R 630 1060 0 0 0
Dr 0 0 0
At SMD N 00888000
Ne 0 ""
Po -1015 0
$EndPAD
$SHAPE3D
Na "walter\\smd_resistors\\r_2010.wrl"
Sc 1 1 1
Of 0 0 0
Ro 0 0 0
$EndSHAPE3D
$EndMODULE r_2010
$MODULE r_2512
Po 0 0 0 15 5033984D 00000000 ~~
Li r_2512
Cd SMT resistor, 2512
Sc 0
AR 
Op 0 0 0
.LocalClearance 78
T0 0 -1063 393 393 0 78 N V 21 N "r_2512"
T1 0 0 393 393 0 78 N I 21 N "Value"
DS -1700 750 1700 750 79 21
DS 1700 750 1700 -750 79 21
DS 1700 -750 -1700 -750 79 21
DS -1700 -750 -1700 750 79 21
$PAD
Sh "1" R 630 1250 0 0 0
Dr 0 0 0
At SMD N 00888000
Ne 0 ""
Po 1255 0
$EndPAD
$PAD
Sh "2" R 630 1250 0 0 0
Dr 0 0 0
At SMD N 00888000
Ne 0 ""
Po -1255 0
$EndPAD
$SHAPE3D
Na "walter\\smd_resistors\\r_2512.wrl"
Sc 1 1 1
Of 0 0 0
Ro 0 0 0
$EndSHAPE3D
$EndMODULE r_2512
$EndLIBRARY
