PCBNEW-LibModule-V1  23.11.2011 21:43:03
# encoding utf-8
$INDEX
kingfont_sdcmf10915w010-SDCMF-10915W010
$EndINDEX
$MODULE kingfont_sdcmf10915w010-SDCMF-10915W010
Po 0 0 0 15 4E8B06B2 00000000 ~~
Li kingfont_sdcmf10915w010-SDCMF-10915W010
Sc 00000000
AR kingfont_sdcmf10915w010-SDCMF-10915W010
Op 0 0 0
At SMD 
T0 -200 6850 500 500 1800 35 N V 21 N "SDCard"
T1 0 0 400 400 0 100 N V 21 N "Val**"
DS -5000 -5000 4600 -5000 50 21
DS -5000 -5000 -5000 4900 50 21
DS -5000 4900 -4500 4900 50 21
DS -4500 4900 4800 4900 50 21
DS 4800 4900 5300 4900 50 21
DS 5300 4900 5300 -2100 50 21
DS 4600 -5000 4600 -3000 50 21
DS 4600 -3000 5300 -2100 50 21
DS -4500 4900 -4500 9200 50 21
DS -4500 9200 4800 9200 50 21
DS 4800 9200 4800 4900 50 21
DC 3900 -4100 4057 -4257 50 21
DS 3585 -4100 4214 -4100 50 21
DS 3900 -3785 3900 -4414 50 21
DC -4400 -4100 -4508 -4208 50 21
DS -4616 -4100 -4183 -4100 50 21
DS -4400 -3883 -4400 -4316 50 21
$PAD
Sh "1" R 560 280 0 0 900
Dr 0 0 0
At SMD N 00888000
Ne 0 ""
Po 2900 -5300
$EndPAD
$PAD
Sh "2" R 560 280 0 0 900
Dr 0 0 0
At SMD N 00888000
Ne 0 ""
Po 1900 -5300
$EndPAD
$PAD
Sh "3" R 560 280 0 0 900
Dr 0 0 0
At SMD N 00888000
Ne 0 ""
Po 900 -5300
$EndPAD
$PAD
Sh "4" R 560 280 0 0 900
Dr 0 0 0
At SMD N 00888000
Ne 0 ""
Po -100 -5300
$EndPAD
$PAD
Sh "5" R 560 280 0 0 900
Dr 0 0 0
At SMD N 00888000
Ne 0 ""
Po -1100 -5300
$EndPAD
$PAD
Sh "6" R 560 280 0 0 900
Dr 0 0 0
At SMD N 00888000
Ne 0 ""
Po -2100 -5300
$EndPAD
$PAD
Sh "7" R 560 280 0 0 900
Dr 0 0 0
At SMD N 00888000
Ne 0 ""
Po -3100 -5300
$EndPAD
$PAD
Sh "8" R 560 280 0 0 900
Dr 0 0 0
At SMD N 00888000
Ne 0 ""
Po -3700 -5300
$EndPAD
$PAD
Sh "9" R 560 280 0 0 900
Dr 0 0 0
At SMD N 00888000
Ne 0 ""
Po 3900 -5300
$EndPAD
$PAD
Sh "10" R 560 280 0 0 900
Dr 0 0 0
At SMD N 00888000
Ne 0 ""
Po -4700 -5300
$EndPAD
$PAD
Sh "11" R 560 280 0 0 900
Dr 0 0 0
At SMD N 00888000
Ne 0 ""
Po -4200 -5300
$EndPAD
$PAD
Sh "12" R 1000 500 0 0 900
Dr 0 0 0
At SMD N 00888000
Ne 0 ""
Po 4800 -4500
$EndPAD
$PAD
Sh "13" R 1000 500 0 0 900
Dr 0 0 0
At SMD N 00888000
Ne 0 ""
Po 5500 4000
$EndPAD
$PAD
Sh "14" R 1000 500 0 0 900
Dr 0 0 0
At SMD N 00888000
Ne 0 ""
Po -5200 4000
$EndPAD
$PAD
Sh "15" R 1000 500 0 0 900
Dr 0 0 0
At SMD N 00888000
Ne 0 ""
Po -5200 -4500
$EndPAD
$SHAPE3D
Na "Vlastni\\104C-TAA0-R.wrl"
Sc 1.000000 1.000000 1.000000
Of 0.000000 0.000000 0.000000
Ro 0.000000 0.000000 0.000000
$EndSHAPE3D
$EndMODULE  kingfont_sdcmf10915w010-SDCMF-10915W010
$EndLIBRARY
