PCBNEW-LibModule-V1  ven 05 mar 2010 11:43:03 CET
$INDEX
pin_strip_6-90
pin_strip_6
pin_strip_2
pin_strip_1
pin_strip_5
pin_strip_4
pin_strip_3
pin_strip_7
pin_strip_10
pin_strip_9
pin_strip_8
pin_strip_10x2
pin_strip_9x2
pin_strip_8x2
pin_strip_7x2
pin_strip_6x2
pin_strip_5x2
pin_strip_4x2
pin_strip_3x2
pin_strip_2x2
pin_strip_6x2-90
pin_strip_10x2-90
pin_strip_9x2-90
pin_strip_8x2-90
pin_strip_7x2-90
pin_strip_5x2-90
pin_strip_4x2-90
pin_strip_3x2-90
pin_strip_2x2-90
pin_strip_10-90
pin_strip_9-90
pin_strip_8-90
pin_strip_7-90
pin_strip_5-90
pin_strip_4-90
pin_strip_3-90
pin_strip_2-90
$EndINDEX
$MODULE pin_strip_10-90
Po 0 0 0 15 4B90DB4E 00000000 ~~
Li pin_strip_10-90
Cd Pin strip 10pin 90
Kw CONN DEV
Sc 00000000
AR
Op 0 0 0
T0 0 -850 400 400 0 80 N V 21 N"PIN_STRIP_10-90"
T1 100 -1400 400 350 0 80 N I 21 N"Val**"
DS 4500 0 4500 4000 120 21
DS 3500 0 3500 4000 120 21
DS 2500 0 2500 4000 120 21
DS 1500 0 1500 4000 120 21
DS -5000 500 5000 500 120 21
DS 5000 500 5000 1500 120 21
DS 5000 1500 -5000 1500 120 21
DS -4000 500 -4000 1500 120 21
DS -4500 0 -4500 4000 120 21
DS 500 0 500 4000 120 21
DS -500 0 -500 4000 120 21
DS -1500 0 -1500 4000 120 21
DS -2500 4000 -2500 0 120 21
DS -3500 0 -3500 4000 120 21
DS -5000 1500 -5000 500 120 21
$PAD
Sh "1" R 600 866 0 0 0
Dr 394 0 0
At STD N 00E0FFFF
Ne 0 ""
Po -4500 0
$EndPAD
$PAD
Sh "2" O 600 866 0 0 0
Dr 394 0 0
At STD N 00E0FFFF
Ne 0 ""
Po -3500 0
$EndPAD
$PAD
Sh "3" O 600 866 0 0 0
Dr 394 0 0
At STD N 00E0FFFF
Ne 0 ""
Po -2500 0
$EndPAD
$PAD
Sh "4" O 600 866 0 0 0
Dr 394 0 0
At STD N 00E0FFFF
Ne 0 ""
Po -1500 0
$EndPAD
$PAD
Sh "5" O 600 866 0 0 0
Dr 394 0 0
At STD N 00E0FFFF
Ne 0 ""
Po -500 0
$EndPAD
$PAD
Sh "6" O 600 866 0 0 0
Dr 394 0 0
At STD N 00E0FFFF
Ne 0 ""
Po 500 0
$EndPAD
$PAD
Sh "7" O 600 866 0 0 0
Dr 394 0 0
At STD N 00E0FFFF
Ne 0 ""
Po 1500 0
$EndPAD
$PAD
Sh "8" O 600 866 0 0 0
Dr 394 0 0
At STD N 00E0FFFF
Ne 0 ""
Po 2500 0
$EndPAD
$PAD
Sh "9" O 600 866 0 0 0
Dr 394 0 0
At STD N 00E0FFFF
Ne 0 ""
Po 3500 0
$EndPAD
$PAD
Sh "10" O 600 866 0 0 0
Dr 394 0 0
At STD N 00E0FFFF
Ne 0 ""
Po 4500 0
$EndPAD
$SHAPE3D
Na "walter\pin_strip\pin_strip_10-90.wrl"
Sc 1.000000 1.000000 1.000000
Of 0.000000 0.000000 0.000000
Ro 0.000000 0.000000 0.000000
$EndSHAPE3D
$EndMODULE  pin_strip_10-90
$MODULE pin_strip_10
Po 0 0 0 15 4B90DB5D 00000000 ~~
Li pin_strip_10
Cd Pin strip 10pin
Kw CONN DEV
Sc 00000000
AR
Op 0 0 0
T0 0 -850 400 400 0 80 N V 21 N"PIN_STRIP_10"
T1 100 -1400 400 350 0 80 N I 21 N"Val**"
DS -4000 -500 -4000 500 120 21
DS -5000 -500 5000 -500 120 21
DS 5000 -500 5000 500 120 21
DS 5000 500 -5000 500 120 21
DS -5000 500 -5000 -500 120 21
$PAD
Sh "1" R 600 866 0 0 0
Dr 394 0 0
At STD N 00E0FFFF
Ne 0 ""
Po -4500 0
$EndPAD
$PAD
Sh "2" O 600 866 0 0 0
Dr 394 0 0
At STD N 00E0FFFF
Ne 0 ""
Po -3500 0
$EndPAD
$PAD
Sh "3" O 600 866 0 0 0
Dr 394 0 0
At STD N 00E0FFFF
Ne 0 ""
Po -2500 0
$EndPAD
$PAD
Sh "4" O 600 866 0 0 0
Dr 394 0 0
At STD N 00E0FFFF
Ne 0 ""
Po -1500 0
$EndPAD
$PAD
Sh "5" O 600 866 0 0 0
Dr 394 0 0
At STD N 00E0FFFF
Ne 0 ""
Po -500 0
$EndPAD
$PAD
Sh "6" O 600 866 0 0 0
Dr 394 0 0
At STD N 00E0FFFF
Ne 0 ""
Po 500 0
$EndPAD
$PAD
Sh "7" O 600 866 0 0 0
Dr 394 0 0
At STD N 00E0FFFF
Ne 0 ""
Po 1500 0
$EndPAD
$PAD
Sh "8" O 600 866 0 0 0
Dr 394 0 0
At STD N 00E0FFFF
Ne 0 ""
Po 2500 0
$EndPAD
$PAD
Sh "9" O 600 866 0 0 0
Dr 394 0 0
At STD N 00E0FFFF
Ne 0 ""
Po 3500 0
$EndPAD
$PAD
Sh "10" O 600 866 0 0 0
Dr 394 0 0
At STD N 00E0FFFF
Ne 0 ""
Po 4500 0
$EndPAD
$SHAPE3D
Na "walter\pin_strip\pin_strip_10.wrl"
Sc 1.000000 1.000000 1.000000
Of 0.000000 0.000000 0.000000
Ro 0.000000 0.000000 0.000000
$EndSHAPE3D
$EndMODULE  pin_strip_10
$MODULE pin_strip_10x2-90
Po 0 0 0 15 4B90DBB5 00000000 ~~
Li pin_strip_10x2-90
Cd Pin strip 10x2pin 90
Kw CONN DEV
Sc 00000000
AR
Op 0 0 0
T0 0 -1500 400 400 0 80 N V 21 N"PIN_STRIP_10x2-9"
T1 0 -2000 400 350 0 80 N I 21 N"Val**"
DS 4500 500 4500 4500 120 21
DS 3500 500 3500 4500 120 21
DS 2500 500 2500 4500 120 21
DS 1500 500 1500 4500 120 21
DS 1000 1000 5000 1000 120 21
DS 5000 1000 5000 2000 120 21
DS 5000 2000 1000 2000 120 21
DS -4000 2000 -4000 1000 120 21
DS -4500 500 -4500 4500 120 21
DS 500 500 500 4500 120 21
DS -500 500 -500 4500 120 21
DS -1500 500 -1500 4500 120 21
DS -2500 4500 -2500 500 120 21
DS -3500 500 -3500 4500 120 21
DS -5000 2000 -5000 1000 120 21
DS -5000 1000 1000 1000 120 21
DS 1000 2000 -5000 2000 120 21
$PAD
Sh "1" R 600 787 0 0 0
Dr 394 0 98
At STD N 00E0FFFF
Ne 0 ""
Po -4500 500
$EndPAD
$PAD
Sh "2" O 600 787 0 0 0
Dr 394 0 -98
At STD N 00E0FFFF
Ne 0 ""
Po -4500 -500
$EndPAD
$PAD
Sh "3" O 600 787 0 0 0
Dr 394 0 98
At STD N 00E0FFFF
Ne 0 ""
Po -3500 500
$EndPAD
$PAD
Sh "4" O 600 787 0 0 0
Dr 394 0 -98
At STD N 00E0FFFF
Ne 0 ""
Po -3500 -500
$EndPAD
$PAD
Sh "5" O 600 787 0 0 0
Dr 394 0 98
At STD N 00E0FFFF
Ne 0 ""
Po -2500 500
$EndPAD
$PAD
Sh "6" O 600 787 0 0 0
Dr 394 0 -98
At STD N 00E0FFFF
Ne 0 ""
Po -2500 -500
$EndPAD
$PAD
Sh "7" O 600 787 0 0 0
Dr 394 0 98
At STD N 00E0FFFF
Ne 0 ""
Po -1500 500
$EndPAD
$PAD
Sh "8" O 600 787 0 0 0
Dr 394 0 -98
At STD N 00E0FFFF
Ne 0 ""
Po -1500 -500
$EndPAD
$PAD
Sh "9" O 600 787 0 0 0
Dr 394 0 98
At STD N 00E0FFFF
Ne 0 ""
Po -500 500
$EndPAD
$PAD
Sh "10" O 600 787 0 0 0
Dr 394 0 -98
At STD N 00E0FFFF
Ne 0 ""
Po -500 -500
$EndPAD
$PAD
Sh "11" O 600 787 0 0 0
Dr 394 0 98
At STD N 00E0FFFF
Ne 0 ""
Po 500 500
$EndPAD
$PAD
Sh "12" O 600 787 0 0 0
Dr 394 0 -98
At STD N 00E0FFFF
Ne 0 ""
Po 500 -500
$EndPAD
$PAD
Sh "13" O 600 787 0 0 0
Dr 394 0 98
At STD N 00E0FFFF
Ne 0 ""
Po 1500 500
$EndPAD
$PAD
Sh "14" O 600 787 0 0 0
Dr 394 0 -98
At STD N 00E0FFFF
Ne 0 ""
Po 1500 -500
$EndPAD
$PAD
Sh "15" O 600 787 0 0 0
Dr 394 0 98
At STD N 00E0FFFF
Ne 0 ""
Po 2500 500
$EndPAD
$PAD
Sh "16" O 600 787 0 0 0
Dr 394 0 -98
At STD N 00E0FFFF
Ne 0 ""
Po 2500 -500
$EndPAD
$PAD
Sh "17" O 600 787 0 0 0
Dr 394 0 98
At STD N 00E0FFFF
Ne 0 ""
Po 3500 500
$EndPAD
$PAD
Sh "18" O 600 787 0 0 0
Dr 394 0 -98
At STD N 00E0FFFF
Ne 0 ""
Po 3500 -500
$EndPAD
$PAD
Sh "19" O 600 787 0 0 0
Dr 394 0 98
At STD N 00E0FFFF
Ne 0 ""
Po 4500 500
$EndPAD
$PAD
Sh "20" O 600 787 0 0 0
Dr 394 0 -98
At STD N 00E0FFFF
Ne 0 ""
Po 4500 -500
$EndPAD
$SHAPE3D
Na "walter\pin_strip\pin_strip_10x2-90.wrl"
Sc 1.000000 1.000000 1.000000
Of 0.000000 0.000000 0.000000
Ro 0.000000 0.000000 0.000000
$EndSHAPE3D
$EndMODULE  pin_strip_10x2-90
$MODULE pin_strip_10x2
Po 0 0 0 15 4B90DBE1 00000000 ~~
Li pin_strip_10x2
Cd Pin strip 10x2pin
Kw CONN DEV
Sc 00000000
AR
Op 0 0 0
T0 0 -1500 400 400 0 80 N V 21 N"PIN_STRIP_10x2"
T1 0 -2000 400 350 0 80 N I 21 N"Val**"
DS -5000 0 -4000 0 120 21
DS -4000 0 -4000 1000 120 21
DS 5000 -1000 -5000 -1000 120 21
DS -5000 -1000 -5000 1000 120 21
DS -5000 1000 5000 1000 120 21
DS 5000 1000 5000 -1000 120 21
$PAD
Sh "1" R 600 787 0 0 0
Dr 394 0 98
At STD N 00E0FFFF
Ne 0 ""
Po -4500 500
$EndPAD
$PAD
Sh "2" O 600 787 0 0 0
Dr 394 0 -98
At STD N 00E0FFFF
Ne 0 ""
Po -4500 -500
$EndPAD
$PAD
Sh "3" O 600 787 0 0 0
Dr 394 0 98
At STD N 00E0FFFF
Ne 0 ""
Po -3500 500
$EndPAD
$PAD
Sh "4" O 600 787 0 0 0
Dr 394 0 -98
At STD N 00E0FFFF
Ne 0 ""
Po -3500 -500
$EndPAD
$PAD
Sh "5" O 600 787 0 0 0
Dr 394 0 98
At STD N 00E0FFFF
Ne 0 ""
Po -2500 500
$EndPAD
$PAD
Sh "6" O 600 787 0 0 0
Dr 394 0 -98
At STD N 00E0FFFF
Ne 0 ""
Po -2500 -500
$EndPAD
$PAD
Sh "7" O 600 787 0 0 0
Dr 394 0 98
At STD N 00E0FFFF
Ne 0 ""
Po -1500 500
$EndPAD
$PAD
Sh "8" O 600 787 0 0 0
Dr 394 0 -98
At STD N 00E0FFFF
Ne 0 ""
Po -1500 -500
$EndPAD
$PAD
Sh "9" O 600 787 0 0 0
Dr 394 0 98
At STD N 00E0FFFF
Ne 0 ""
Po -500 500
$EndPAD
$PAD
Sh "10" O 600 787 0 0 0
Dr 394 0 -98
At STD N 00E0FFFF
Ne 0 ""
Po -500 -500
$EndPAD
$PAD
Sh "11" O 600 787 0 0 0
Dr 394 0 98
At STD N 00E0FFFF
Ne 0 ""
Po 500 500
$EndPAD
$PAD
Sh "12" O 600 787 0 0 0
Dr 394 0 -98
At STD N 00E0FFFF
Ne 0 ""
Po 500 -500
$EndPAD
$PAD
Sh "13" O 600 787 0 0 0
Dr 394 0 98
At STD N 00E0FFFF
Ne 0 ""
Po 1500 500
$EndPAD
$PAD
Sh "14" O 600 787 0 0 0
Dr 394 0 -98
At STD N 00E0FFFF
Ne 0 ""
Po 1500 -500
$EndPAD
$PAD
Sh "15" O 600 787 0 0 0
Dr 394 0 98
At STD N 00E0FFFF
Ne 0 ""
Po 2500 500
$EndPAD
$PAD
Sh "16" O 600 787 0 0 0
Dr 394 0 -98
At STD N 00E0FFFF
Ne 0 ""
Po 2500 -500
$EndPAD
$PAD
Sh "17" O 600 787 0 0 0
Dr 394 0 98
At STD N 00E0FFFF
Ne 0 ""
Po 3500 500
$EndPAD
$PAD
Sh "18" O 600 787 0 0 0
Dr 394 0 -98
At STD N 00E0FFFF
Ne 0 ""
Po 3500 -500
$EndPAD
$PAD
Sh "19" O 600 787 0 0 0
Dr 394 0 98
At STD N 00E0FFFF
Ne 0 ""
Po 4500 500
$EndPAD
$PAD
Sh "20" O 600 787 0 0 0
Dr 394 0 -98
At STD N 00E0FFFF
Ne 0 ""
Po 4500 -500
$EndPAD
$SHAPE3D
Na "walter\pin_strip\pin_strip_10x2.wrl"
Sc 1.000000 1.000000 1.000000
Of 0.000000 0.000000 0.000000
Ro 0.000000 0.000000 0.000000
$EndSHAPE3D
$EndMODULE  pin_strip_10x2
$MODULE pin_strip_9x2-90
Po 0 0 0 15 4B90DC1E 00000000 ~~
Li pin_strip_9x2-90
Cd Pin strip 9x2pin 90
Kw CONN DEV
Sc 00000000
AR
Op 0 0 0
T0 0 -1500 400 400 0 80 N V 21 N"PIN_STRIP_9x2-90"
T1 0 -2000 400 350 0 80 N I 21 N"Val**"
DS 1500 1000 4500 1000 120 21
DS 4500 1000 4500 2000 120 21
DS 4500 2000 1500 2000 120 21
DS 4000 500 4000 4500 120 21
DS 3000 500 3000 4500 120 21
DS 2000 500 2000 4500 120 21
DS -3500 2000 -3500 1000 120 21
DS -4000 500 -4000 4500 120 21
DS 1000 500 1000 4500 120 21
DS 0 500 0 4500 120 21
DS -1000 500 -1000 4500 120 21
DS -2000 4500 -2000 500 120 21
DS -3000 500 -3000 4500 120 21
DS -4500 2000 -4500 1000 120 21
DS -4500 1000 1500 1000 120 21
DS 1500 2000 -4500 2000 120 21
$PAD
Sh "1" R 600 787 0 0 0
Dr 394 0 98
At STD N 00E0FFFF
Ne 0 ""
Po -4000 500
$EndPAD
$PAD
Sh "2" O 600 787 0 0 0
Dr 394 0 -98
At STD N 00E0FFFF
Ne 0 ""
Po -4000 -500
$EndPAD
$PAD
Sh "3" O 600 787 0 0 0
Dr 394 0 98
At STD N 00E0FFFF
Ne 0 ""
Po -3000 500
$EndPAD
$PAD
Sh "4" O 600 787 0 0 0
Dr 394 0 -98
At STD N 00E0FFFF
Ne 0 ""
Po -3000 -500
$EndPAD
$PAD
Sh "5" O 600 787 0 0 0
Dr 394 0 98
At STD N 00E0FFFF
Ne 0 ""
Po -2000 500
$EndPAD
$PAD
Sh "6" O 600 787 0 0 0
Dr 394 0 -98
At STD N 00E0FFFF
Ne 0 ""
Po -2000 -500
$EndPAD
$PAD
Sh "7" O 600 787 0 0 0
Dr 394 0 98
At STD N 00E0FFFF
Ne 0 ""
Po -1000 500
$EndPAD
$PAD
Sh "8" O 600 787 0 0 0
Dr 394 0 -98
At STD N 00E0FFFF
Ne 0 ""
Po -1000 -500
$EndPAD
$PAD
Sh "9" O 600 787 0 0 0
Dr 394 0 98
At STD N 00E0FFFF
Ne 0 ""
Po 0 500
$EndPAD
$PAD
Sh "10" O 600 787 0 0 0
Dr 394 0 -98
At STD N 00E0FFFF
Ne 0 ""
Po 0 -500
$EndPAD
$PAD
Sh "11" O 600 787 0 0 0
Dr 394 0 98
At STD N 00E0FFFF
Ne 0 ""
Po 1000 500
$EndPAD
$PAD
Sh "12" O 600 787 0 0 0
Dr 394 0 -98
At STD N 00E0FFFF
Ne 0 ""
Po 1000 -500
$EndPAD
$PAD
Sh "13" O 600 787 0 0 0
Dr 394 0 98
At STD N 00E0FFFF
Ne 0 ""
Po 2000 500
$EndPAD
$PAD
Sh "14" O 600 787 0 0 0
Dr 394 0 -98
At STD N 00E0FFFF
Ne 0 ""
Po 2000 -500
$EndPAD
$PAD
Sh "15" O 600 787 0 0 0
Dr 394 0 98
At STD N 00E0FFFF
Ne 0 ""
Po 3000 500
$EndPAD
$PAD
Sh "16" O 600 787 0 0 0
Dr 394 0 -98
At STD N 00E0FFFF
Ne 0 ""
Po 3000 -500
$EndPAD
$PAD
Sh "17" O 600 787 0 0 0
Dr 394 0 98
At STD N 00E0FFFF
Ne 0 ""
Po 4000 500
$EndPAD
$PAD
Sh "18" O 600 787 0 0 0
Dr 394 0 -98
At STD N 00E0FFFF
Ne 0 ""
Po 4000 -500
$EndPAD
$SHAPE3D
Na "walter\pin_strip\pin_strip_9x2-90.wrl"
Sc 1.000000 1.000000 1.000000
Of 0.000000 0.000000 0.000000
Ro 0.000000 0.000000 0.000000
$EndSHAPE3D
$EndMODULE  pin_strip_9x2-90
$MODULE pin_strip_9x2
Po 0 0 0 15 4B90DC4B 00000000 ~~
Li pin_strip_9x2
Cd Pin strip 9x2pin
Kw CONN DEV
Sc 00000000
AR
Op 0 0 0
T0 0 -1500 400 400 0 80 N V 21 N"PIN_STRIP_9x2"
T1 0 -2000 400 350 0 80 N I 21 N"Val**"
DS -4500 -1000 4500 -1000 120 21
DS 4500 -1000 4500 1000 120 21
DS 4500 1000 -4500 1000 120 21
DS -4500 0 -3500 0 120 21
DS -3500 0 -3500 1000 120 21
DS -4500 -1000 -4500 1000 120 21
$PAD
Sh "1" R 600 787 0 0 0
Dr 394 0 98
At STD N 00E0FFFF
Ne 0 ""
Po -4000 500
$EndPAD
$PAD
Sh "2" O 600 787 0 0 0
Dr 394 0 -98
At STD N 00E0FFFF
Ne 0 ""
Po -4000 -500
$EndPAD
$PAD
Sh "3" O 600 787 0 0 0
Dr 394 0 98
At STD N 00E0FFFF
Ne 0 ""
Po -3000 500
$EndPAD
$PAD
Sh "4" O 600 787 0 0 0
Dr 394 0 -98
At STD N 00E0FFFF
Ne 0 ""
Po -3000 -500
$EndPAD
$PAD
Sh "5" O 600 787 0 0 0
Dr 394 0 98
At STD N 00E0FFFF
Ne 0 ""
Po -2000 500
$EndPAD
$PAD
Sh "6" O 600 787 0 0 0
Dr 394 0 -98
At STD N 00E0FFFF
Ne 0 ""
Po -2000 -500
$EndPAD
$PAD
Sh "7" O 600 787 0 0 0
Dr 394 0 98
At STD N 00E0FFFF
Ne 0 ""
Po -1000 500
$EndPAD
$PAD
Sh "8" O 600 787 0 0 0
Dr 394 0 -98
At STD N 00E0FFFF
Ne 0 ""
Po -1000 -500
$EndPAD
$PAD
Sh "9" O 600 787 0 0 0
Dr 394 0 98
At STD N 00E0FFFF
Ne 0 ""
Po 0 500
$EndPAD
$PAD
Sh "10" O 600 787 0 0 0
Dr 394 0 -98
At STD N 00E0FFFF
Ne 0 ""
Po 0 -500
$EndPAD
$PAD
Sh "11" O 600 787 0 0 0
Dr 394 0 98
At STD N 00E0FFFF
Ne 0 ""
Po 1000 500
$EndPAD
$PAD
Sh "12" O 600 787 0 0 0
Dr 394 0 -98
At STD N 00E0FFFF
Ne 0 ""
Po 1000 -500
$EndPAD
$PAD
Sh "13" O 600 787 0 0 0
Dr 394 0 98
At STD N 00E0FFFF
Ne 0 ""
Po 2000 500
$EndPAD
$PAD
Sh "14" O 600 787 0 0 0
Dr 394 0 -98
At STD N 00E0FFFF
Ne 0 ""
Po 2000 -500
$EndPAD
$PAD
Sh "15" O 600 787 0 0 0
Dr 394 0 98
At STD N 00E0FFFF
Ne 0 ""
Po 3000 500
$EndPAD
$PAD
Sh "16" O 600 787 0 0 0
Dr 394 0 -98
At STD N 00E0FFFF
Ne 0 ""
Po 3000 -500
$EndPAD
$PAD
Sh "17" O 600 787 0 0 0
Dr 394 0 98
At STD N 00E0FFFF
Ne 0 ""
Po 4000 500
$EndPAD
$PAD
Sh "18" O 600 787 0 0 0
Dr 394 0 -98
At STD N 00E0FFFF
Ne 0 ""
Po 4000 -500
$EndPAD
$SHAPE3D
Na "walter\pin_strip\pin_strip_9x2.wrl"
Sc 1.000000 1.000000 1.000000
Of 0.000000 0.000000 0.000000
Ro 0.000000 0.000000 0.000000
$EndSHAPE3D
$EndMODULE  pin_strip_9x2
$MODULE pin_strip_8x2-90
Po 0 0 0 15 4B90DC76 00000000 ~~
Li pin_strip_8x2-90
Cd Pin strip 8x2pin 90
Kw CONN DEV
Sc 00000000
AR
Op 0 0 0
T0 0 -1500 400 400 0 80 N V 21 N"PIN_STRIP_8x2-90"
T1 0 -2000 400 350 0 80 N I 21 N"Val**"
DS 2000 1000 4000 1000 120 21
DS 4000 1000 4000 2000 120 21
DS 4000 2000 2000 2000 120 21
DS 3500 500 3500 4500 120 21
DS 2500 500 2500 4500 120 21
DS -3000 2000 -3000 1000 120 21
DS -3500 500 -3500 4500 120 21
DS 1500 500 1500 4500 120 21
DS 500 500 500 4500 120 21
DS -500 500 -500 4500 120 21
DS -1500 4500 -1500 500 120 21
DS -2500 500 -2500 4500 120 21
DS -4000 2000 -4000 1000 120 21
DS -4000 1000 2000 1000 120 21
DS 2000 2000 -4000 2000 120 21
$PAD
Sh "1" R 600 787 0 0 0
Dr 394 0 98
At STD N 00E0FFFF
Ne 0 ""
Po -3500 500
$EndPAD
$PAD
Sh "2" O 600 787 0 0 0
Dr 394 0 -98
At STD N 00E0FFFF
Ne 0 ""
Po -3500 -500
$EndPAD
$PAD
Sh "3" O 600 787 0 0 0
Dr 394 0 98
At STD N 00E0FFFF
Ne 0 ""
Po -2500 500
$EndPAD
$PAD
Sh "4" O 600 787 0 0 0
Dr 394 0 -98
At STD N 00E0FFFF
Ne 0 ""
Po -2500 -500
$EndPAD
$PAD
Sh "5" O 600 787 0 0 0
Dr 394 0 98
At STD N 00E0FFFF
Ne 0 ""
Po -1500 500
$EndPAD
$PAD
Sh "6" O 600 787 0 0 0
Dr 394 0 -98
At STD N 00E0FFFF
Ne 0 ""
Po -1500 -500
$EndPAD
$PAD
Sh "7" O 600 787 0 0 0
Dr 394 0 98
At STD N 00E0FFFF
Ne 0 ""
Po -500 500
$EndPAD
$PAD
Sh "8" O 600 787 0 0 0
Dr 394 0 -98
At STD N 00E0FFFF
Ne 0 ""
Po -500 -500
$EndPAD
$PAD
Sh "9" O 600 787 0 0 0
Dr 394 0 98
At STD N 00E0FFFF
Ne 0 ""
Po 500 500
$EndPAD
$PAD
Sh "10" O 600 787 0 0 0
Dr 394 0 -98
At STD N 00E0FFFF
Ne 0 ""
Po 500 -500
$EndPAD
$PAD
Sh "11" O 600 787 0 0 0
Dr 394 0 98
At STD N 00E0FFFF
Ne 0 ""
Po 1500 500
$EndPAD
$PAD
Sh "12" O 600 787 0 0 0
Dr 394 0 -98
At STD N 00E0FFFF
Ne 0 ""
Po 1500 -500
$EndPAD
$PAD
Sh "13" O 600 787 0 0 0
Dr 394 0 98
At STD N 00E0FFFF
Ne 0 ""
Po 2500 500
$EndPAD
$PAD
Sh "14" O 600 787 0 0 0
Dr 394 0 -98
At STD N 00E0FFFF
Ne 0 ""
Po 2500 -500
$EndPAD
$PAD
Sh "15" O 600 787 0 0 0
Dr 394 0 98
At STD N 00E0FFFF
Ne 0 ""
Po 3500 500
$EndPAD
$PAD
Sh "16" O 600 787 0 0 0
Dr 394 0 -98
At STD N 00E0FFFF
Ne 0 ""
Po 3500 -500
$EndPAD
$SHAPE3D
Na "walter\pin_strip\pin_strip_8x2-90.wrl"
Sc 1.000000 1.000000 1.000000
Of 0.000000 0.000000 0.000000
Ro 0.000000 0.000000 0.000000
$EndSHAPE3D
$EndMODULE  pin_strip_8x2-90
$MODULE pin_strip_8x2
Po 0 0 0 15 4B90DC99 00000000 ~~
Li pin_strip_8x2
Cd Pin strip 8x2pin
Kw CONN DEV
Sc 00000000
AR
Op 0 0 0
T0 0 -1500 400 400 0 80 N V 21 N"PIN_STRIP_8x2"
T1 0 -2000 400 350 0 80 N I 21 N"Val**"
DS -4000 -1000 4000 -1000 120 21
DS 4000 -1000 4000 1000 120 21
DS 4000 1000 -4000 1000 120 21
DS -4000 0 -3000 0 120 21
DS -3000 0 -3000 1000 120 21
DS -4000 -1000 -4000 1000 120 21
$PAD
Sh "1" R 600 787 0 0 0
Dr 394 0 98
At STD N 00E0FFFF
Ne 0 ""
Po -3500 500
$EndPAD
$PAD
Sh "2" O 600 787 0 0 0
Dr 394 0 -98
At STD N 00E0FFFF
Ne 0 ""
Po -3500 -500
$EndPAD
$PAD
Sh "3" O 600 787 0 0 0
Dr 394 0 98
At STD N 00E0FFFF
Ne 0 ""
Po -2500 500
$EndPAD
$PAD
Sh "4" O 600 787 0 0 0
Dr 394 0 -98
At STD N 00E0FFFF
Ne 0 ""
Po -2500 -500
$EndPAD
$PAD
Sh "5" O 600 787 0 0 0
Dr 394 0 98
At STD N 00E0FFFF
Ne 0 ""
Po -1500 500
$EndPAD
$PAD
Sh "6" O 600 787 0 0 0
Dr 394 0 -98
At STD N 00E0FFFF
Ne 0 ""
Po -1500 -500
$EndPAD
$PAD
Sh "7" O 600 787 0 0 0
Dr 394 0 98
At STD N 00E0FFFF
Ne 0 ""
Po -500 500
$EndPAD
$PAD
Sh "8" O 600 787 0 0 0
Dr 394 0 -98
At STD N 00E0FFFF
Ne 0 ""
Po -500 -500
$EndPAD
$PAD
Sh "9" O 600 787 0 0 0
Dr 394 0 98
At STD N 00E0FFFF
Ne 0 ""
Po 500 500
$EndPAD
$PAD
Sh "10" O 600 787 0 0 0
Dr 394 0 -98
At STD N 00E0FFFF
Ne 0 ""
Po 500 -500
$EndPAD
$PAD
Sh "11" O 600 787 0 0 0
Dr 394 0 98
At STD N 00E0FFFF
Ne 0 ""
Po 1500 500
$EndPAD
$PAD
Sh "12" O 600 787 0 0 0
Dr 394 0 -98
At STD N 00E0FFFF
Ne 0 ""
Po 1500 -500
$EndPAD
$PAD
Sh "13" O 600 787 0 0 0
Dr 394 0 98
At STD N 00E0FFFF
Ne 0 ""
Po 2500 500
$EndPAD
$PAD
Sh "14" O 600 787 0 0 0
Dr 394 0 -98
At STD N 00E0FFFF
Ne 0 ""
Po 2500 -500
$EndPAD
$PAD
Sh "15" O 600 787 0 0 0
Dr 394 0 98
At STD N 00E0FFFF
Ne 0 ""
Po 3500 500
$EndPAD
$PAD
Sh "16" O 600 787 0 0 0
Dr 394 0 -98
At STD N 00E0FFFF
Ne 0 ""
Po 3500 -500
$EndPAD
$SHAPE3D
Na "walter\pin_strip\pin_strip_8x2.wrl"
Sc 1.000000 1.000000 1.000000
Of 0.000000 0.000000 0.000000
Ro 0.000000 0.000000 0.000000
$EndSHAPE3D
$EndMODULE  pin_strip_8x2
$MODULE pin_strip_7x2-90
Po 0 0 0 15 4B90DCC0 00000000 ~~
Li pin_strip_7x2-90
Cd Pin strip 7x2pin 90
Kw CONN DEV
Sc 00000000
AR
Op 0 0 0
T0 0 -1500 400 400 0 80 N V 21 N"PIN_STRIP_7x2-90"
T1 0 -2000 400 350 0 80 N I 21 N"Val**"
DS 2500 1000 3500 1000 120 21
DS 3500 1000 3500 2000 120 21
DS 3500 2000 2500 2000 120 21
DS 3000 500 3000 4500 120 21
DS -2500 2000 -2500 1000 120 21
DS -3000 500 -3000 4500 120 21
DS 2000 500 2000 4500 120 21
DS 1000 500 1000 4500 120 21
DS 0 500 0 4500 120 21
DS -1000 4500 -1000 500 120 21
DS -2000 500 -2000 4500 120 21
DS -3500 2000 -3500 1000 120 21
DS -3500 1000 2500 1000 120 21
DS 2500 2000 -3500 2000 120 21
$PAD
Sh "1" R 600 787 0 0 0
Dr 394 0 98
At STD N 00E0FFFF
Ne 0 ""
Po -3000 500
$EndPAD
$PAD
Sh "2" O 600 787 0 0 0
Dr 394 0 -98
At STD N 00E0FFFF
Ne 0 ""
Po -3000 -500
$EndPAD
$PAD
Sh "3" O 600 787 0 0 0
Dr 394 0 98
At STD N 00E0FFFF
Ne 0 ""
Po -2000 500
$EndPAD
$PAD
Sh "4" O 600 787 0 0 0
Dr 394 0 -98
At STD N 00E0FFFF
Ne 0 ""
Po -2000 -500
$EndPAD
$PAD
Sh "5" O 600 787 0 0 0
Dr 394 0 98
At STD N 00E0FFFF
Ne 0 ""
Po -1000 500
$EndPAD
$PAD
Sh "6" O 600 787 0 0 0
Dr 394 0 -98
At STD N 00E0FFFF
Ne 0 ""
Po -1000 -500
$EndPAD
$PAD
Sh "7" O 600 787 0 0 0
Dr 394 0 98
At STD N 00E0FFFF
Ne 0 ""
Po 0 500
$EndPAD
$PAD
Sh "8" O 600 787 0 0 0
Dr 394 0 -98
At STD N 00E0FFFF
Ne 0 ""
Po 0 -500
$EndPAD
$PAD
Sh "9" O 600 787 0 0 0
Dr 394 0 98
At STD N 00E0FFFF
Ne 0 ""
Po 1000 500
$EndPAD
$PAD
Sh "10" O 600 787 0 0 0
Dr 394 0 -98
At STD N 00E0FFFF
Ne 0 ""
Po 1000 -500
$EndPAD
$PAD
Sh "11" O 600 787 0 0 0
Dr 394 0 98
At STD N 00E0FFFF
Ne 0 ""
Po 2000 500
$EndPAD
$PAD
Sh "12" O 600 787 0 0 0
Dr 394 0 -98
At STD N 00E0FFFF
Ne 0 ""
Po 2000 -500
$EndPAD
$PAD
Sh "13" O 600 787 0 0 0
Dr 394 0 98
At STD N 00E0FFFF
Ne 0 ""
Po 3000 500
$EndPAD
$PAD
Sh "14" O 600 787 0 0 0
Dr 394 0 -98
At STD N 00E0FFFF
Ne 0 ""
Po 3000 -500
$EndPAD
$SHAPE3D
Na "walter\pin_strip\pin_strip_7x2-90.wrl"
Sc 1.000000 1.000000 1.000000
Of 0.000000 0.000000 0.000000
Ro 0.000000 0.000000 0.000000
$EndSHAPE3D
$EndMODULE  pin_strip_7x2-90
$MODULE pin_strip_7x2
Po 0 0 0 15 4B90DCE3 00000000 ~~
Li pin_strip_7x2
Cd Pin strip 7x2pin
Kw CONN DEV
Sc 00000000
AR
Op 0 0 0
T0 0 -1500 400 400 0 80 N V 21 N"PIN_STRIP_7x2"
T1 0 -2000 400 350 0 80 N I 21 N"Val**"
DS -3500 -1000 3500 -1000 120 21
DS 3500 -1000 3500 1000 120 21
DS 3500 1000 -3500 1000 120 21
DS -3500 0 -2500 0 120 21
DS -2500 0 -2500 1000 120 21
DS -3500 -1000 -3500 1000 120 21
$PAD
Sh "1" R 600 787 0 0 0
Dr 394 0 98
At STD N 00E0FFFF
Ne 0 ""
Po -3000 500
$EndPAD
$PAD
Sh "2" O 600 787 0 0 0
Dr 394 0 -98
At STD N 00E0FFFF
Ne 0 ""
Po -3000 -500
$EndPAD
$PAD
Sh "3" O 600 787 0 0 0
Dr 394 0 98
At STD N 00E0FFFF
Ne 0 ""
Po -2000 500
$EndPAD
$PAD
Sh "4" O 600 787 0 0 0
Dr 394 0 -98
At STD N 00E0FFFF
Ne 0 ""
Po -2000 -500
$EndPAD
$PAD
Sh "5" O 600 787 0 0 0
Dr 394 0 98
At STD N 00E0FFFF
Ne 0 ""
Po -1000 500
$EndPAD
$PAD
Sh "6" O 600 787 0 0 0
Dr 394 0 -98
At STD N 00E0FFFF
Ne 0 ""
Po -1000 -500
$EndPAD
$PAD
Sh "7" O 600 787 0 0 0
Dr 394 0 98
At STD N 00E0FFFF
Ne 0 ""
Po 0 500
$EndPAD
$PAD
Sh "8" O 600 787 0 0 0
Dr 394 0 -98
At STD N 00E0FFFF
Ne 0 ""
Po 0 -500
$EndPAD
$PAD
Sh "9" O 600 787 0 0 0
Dr 394 0 98
At STD N 00E0FFFF
Ne 0 ""
Po 1000 500
$EndPAD
$PAD
Sh "10" O 600 787 0 0 0
Dr 394 0 -98
At STD N 00E0FFFF
Ne 0 ""
Po 1000 -500
$EndPAD
$PAD
Sh "11" O 600 787 0 0 0
Dr 394 0 98
At STD N 00E0FFFF
Ne 0 ""
Po 2000 500
$EndPAD
$PAD
Sh "12" O 600 787 0 0 0
Dr 394 0 -98
At STD N 00E0FFFF
Ne 0 ""
Po 2000 -500
$EndPAD
$PAD
Sh "13" O 600 787 0 0 0
Dr 394 0 98
At STD N 00E0FFFF
Ne 0 ""
Po 3000 500
$EndPAD
$PAD
Sh "14" O 600 787 0 0 0
Dr 394 0 -98
At STD N 00E0FFFF
Ne 0 ""
Po 3000 -500
$EndPAD
$SHAPE3D
Na "walter\pin_strip\pin_strip_7x2.wrl"
Sc 1.000000 1.000000 1.000000
Of 0.000000 0.000000 0.000000
Ro 0.000000 0.000000 0.000000
$EndSHAPE3D
$EndMODULE  pin_strip_7x2
$MODULE pin_strip_6x2-90
Po 0 0 0 15 4B90DE34 00000000 ~~
Li pin_strip_6x2-90
Cd Pin strip 6x2pin 90
Kw CONN DEV
Sc 00000000
AR
Op 0 0 0
T0 0 -1500 400 400 0 80 N V 21 N"PIN_STRIP_6x2-90"
T1 0 -2000 400 350 0 80 N I 21 N"Val**"
DS -2000 2000 -2000 1000 120 21
DS -2500 500 -2500 4500 150 21
DS 2500 500 2500 4500 150 21
DS 1500 500 1500 4500 150 21
DS 500 500 500 4500 150 21
DS -500 4500 -500 500 150 21
DS -1500 500 -1500 4500 150 21
DS -3000 2000 -3000 1000 120 21
DS -3000 1000 3000 1000 120 21
DS 3000 1000 3000 2000 120 21
DS 3000 2000 -3000 2000 120 21
$PAD
Sh "1" R 600 787 0 0 0
Dr 394 0 98
At STD N 00E0FFFF
Ne 0 ""
Po -2500 500
$EndPAD
$PAD
Sh "2" O 600 787 0 0 0
Dr 394 0 -98
At STD N 00E0FFFF
Ne 0 ""
Po -2500 -500
$EndPAD
$PAD
Sh "3" O 600 787 0 0 0
Dr 394 0 98
At STD N 00E0FFFF
Ne 0 ""
Po -1500 500
$EndPAD
$PAD
Sh "4" O 600 787 0 0 0
Dr 394 0 -98
At STD N 00E0FFFF
Ne 0 ""
Po -1500 -500
$EndPAD
$PAD
Sh "5" O 600 787 0 0 0
Dr 394 0 98
At STD N 00E0FFFF
Ne 0 ""
Po -500 500
$EndPAD
$PAD
Sh "6" O 600 787 0 0 0
Dr 394 0 -98
At STD N 00E0FFFF
Ne 0 ""
Po -500 -500
$EndPAD
$PAD
Sh "7" O 600 787 0 0 0
Dr 394 0 98
At STD N 00E0FFFF
Ne 0 ""
Po 500 500
$EndPAD
$PAD
Sh "8" O 600 787 0 0 0
Dr 394 0 -98
At STD N 00E0FFFF
Ne 0 ""
Po 500 -500
$EndPAD
$PAD
Sh "9" O 600 787 0 0 0
Dr 394 0 98
At STD N 00E0FFFF
Ne 0 ""
Po 1500 500
$EndPAD
$PAD
Sh "10" O 600 787 0 0 0
Dr 394 0 -98
At STD N 00E0FFFF
Ne 0 ""
Po 1500 -500
$EndPAD
$PAD
Sh "11" O 600 787 0 0 0
Dr 394 0 98
At STD N 00E0FFFF
Ne 0 ""
Po 2500 500
$EndPAD
$PAD
Sh "12" O 600 787 0 0 0
Dr 394 0 -98
At STD N 00E0FFFF
Ne 0 ""
Po 2500 -500
$EndPAD
$SHAPE3D
Na "walter\pin_strip\pin_strip_6x2-90.wrl"
Sc 1.000000 1.000000 1.000000
Of 0.000000 0.000000 0.000000
Ro 0.000000 0.000000 0.000000
$EndSHAPE3D
$EndMODULE  pin_strip_6x2-90
$MODULE pin_strip_6x2
Po 0 0 0 15 4B90DE54 00000000 ~~
Li pin_strip_6x2
Cd Pin strip 6x2pin
Kw CONN DEV
Sc 00000000
AR
Op 0 0 0
T0 0 -1500 400 400 0 80 N V 21 N"PIN_STRIP_6x2"
T1 0 -2000 400 350 0 80 N I 21 N"Val**"
DS -3000 -1000 3000 -1000 120 21
DS 3000 -1000 3000 1000 120 21
DS 3000 1000 -3000 1000 120 21
DS -3000 0 -2000 0 120 21
DS -2000 0 -2000 1000 120 21
DS -3000 -1000 -3000 1000 120 21
$PAD
Sh "1" R 600 787 0 0 0
Dr 394 0 98
At STD N 00E0FFFF
Ne 0 ""
Po -2500 500
$EndPAD
$PAD
Sh "2" O 600 787 0 0 0
Dr 394 0 -98
At STD N 00E0FFFF
Ne 0 ""
Po -2500 -500
$EndPAD
$PAD
Sh "3" O 600 787 0 0 0
Dr 394 0 98
At STD N 00E0FFFF
Ne 0 ""
Po -1500 500
$EndPAD
$PAD
Sh "4" O 600 787 0 0 0
Dr 394 0 -98
At STD N 00E0FFFF
Ne 0 ""
Po -1500 -500
$EndPAD
$PAD
Sh "5" O 600 787 0 0 0
Dr 394 0 98
At STD N 00E0FFFF
Ne 0 ""
Po -500 500
$EndPAD
$PAD
Sh "6" O 600 787 0 0 0
Dr 394 0 -98
At STD N 00E0FFFF
Ne 0 ""
Po -500 -500
$EndPAD
$PAD
Sh "7" O 600 787 0 0 0
Dr 394 0 98
At STD N 00E0FFFF
Ne 0 ""
Po 500 500
$EndPAD
$PAD
Sh "8" O 600 787 0 0 0
Dr 394 0 -98
At STD N 00E0FFFF
Ne 0 ""
Po 500 -500
$EndPAD
$PAD
Sh "9" O 600 787 0 0 0
Dr 394 0 98
At STD N 00E0FFFF
Ne 0 ""
Po 1500 500
$EndPAD
$PAD
Sh "10" O 600 787 0 0 0
Dr 394 0 -98
At STD N 00E0FFFF
Ne 0 ""
Po 1500 -500
$EndPAD
$PAD
Sh "11" O 600 787 0 0 0
Dr 394 0 98
At STD N 00E0FFFF
Ne 0 ""
Po 2500 500
$EndPAD
$PAD
Sh "12" O 600 787 0 0 0
Dr 394 0 -98
At STD N 00E0FFFF
Ne 0 ""
Po 2500 -500
$EndPAD
$SHAPE3D
Na "walter\pin_strip\pin_strip_6x2.wrl"
Sc 1.000000 1.000000 1.000000
Of 0.000000 0.000000 0.000000
Ro 0.000000 0.000000 0.000000
$EndSHAPE3D
$EndMODULE  pin_strip_6x2
$MODULE pin_strip_5x2-90
Po 0 0 0 15 4B90DE76 00000000 ~~
Li pin_strip_5x2-90
Cd Pin strip 5x2pin 90
Kw CONN DEV
Sc 00000000
AR
Op 0 0 0
T0 0 -1500 400 400 0 80 N V 21 N"PIN_STRIP_5x2-90"
T1 0 -2000 400 350 0 80 N I 21 N"Val**"
DS -2500 1000 2500 1000 120 21
DS 2500 1000 2500 2000 120 21
DS 2500 2000 -2500 2000 120 21
DS -1500 2000 -1500 1000 120 21
DS -2000 500 -2000 4500 120 21
DS 2000 500 2000 4500 120 21
DS 1000 500 1000 4500 120 21
DS 0 4500 0 500 120 21
DS -1000 500 -1000 4500 120 21
DS -2500 2000 -2500 1000 120 21
$PAD
Sh "1" R 600 787 0 0 0
Dr 394 0 98
At STD N 00E0FFFF
Ne 0 ""
Po -2000 500
$EndPAD
$PAD
Sh "2" O 600 787 0 0 0
Dr 394 0 -98
At STD N 00E0FFFF
Ne 0 ""
Po -2000 -500
$EndPAD
$PAD
Sh "3" O 600 787 0 0 0
Dr 394 0 98
At STD N 00E0FFFF
Ne 0 ""
Po -1000 500
$EndPAD
$PAD
Sh "4" O 600 787 0 0 0
Dr 394 0 -98
At STD N 00E0FFFF
Ne 0 ""
Po -1000 -500
$EndPAD
$PAD
Sh "5" O 600 787 0 0 0
Dr 394 0 98
At STD N 00E0FFFF
Ne 0 ""
Po 0 500
$EndPAD
$PAD
Sh "6" O 600 787 0 0 0
Dr 394 0 -98
At STD N 00E0FFFF
Ne 0 ""
Po 0 -500
$EndPAD
$PAD
Sh "7" O 600 787 0 0 0
Dr 394 0 98
At STD N 00E0FFFF
Ne 0 ""
Po 1000 500
$EndPAD
$PAD
Sh "8" O 600 787 0 0 0
Dr 394 0 -98
At STD N 00E0FFFF
Ne 0 ""
Po 1000 -500
$EndPAD
$PAD
Sh "9" O 600 787 0 0 0
Dr 394 0 98
At STD N 00E0FFFF
Ne 0 ""
Po 2000 500
$EndPAD
$PAD
Sh "10" O 600 787 0 0 0
Dr 394 0 -98
At STD N 00E0FFFF
Ne 0 ""
Po 2000 -500
$EndPAD
$SHAPE3D
Na "walter\pin_strip\pin_strip_5x2-90.wrl"
Sc 1.000000 1.000000 1.000000
Of 0.000000 0.000000 0.000000
Ro 0.000000 0.000000 0.000000
$EndSHAPE3D
$EndMODULE  pin_strip_5x2-90
$MODULE pin_strip_5x2
Po 0 0 0 15 4B90DE8F 00000000 ~~
Li pin_strip_5x2
Cd Pin strip 5x2pin
Kw CONN DEV
Sc 00000000
AR
Op 0 0 0
T0 0 -1500 400 400 0 80 N V 21 N"PIN_STRIP_5x2"
T1 0 -2000 400 350 0 80 N I 21 N"Val**"
DS -2500 -1000 2500 -1000 120 21
DS 2500 -1000 2500 1000 120 21
DS 2500 1000 -2500 1000 120 21
DS -2500 0 -1500 0 120 21
DS -1500 0 -1500 1000 120 21
DS -2500 -1000 -2500 1000 120 21
$PAD
Sh "1" R 600 787 0 0 0
Dr 394 0 98
At STD N 00E0FFFF
Ne 0 ""
Po -2000 500
$EndPAD
$PAD
Sh "2" O 600 787 0 0 0
Dr 394 0 -98
At STD N 00E0FFFF
Ne 0 ""
Po -2000 -500
$EndPAD
$PAD
Sh "3" O 600 787 0 0 0
Dr 394 0 98
At STD N 00E0FFFF
Ne 0 ""
Po -1000 500
$EndPAD
$PAD
Sh "4" O 600 787 0 0 0
Dr 394 0 -98
At STD N 00E0FFFF
Ne 0 ""
Po -1000 -500
$EndPAD
$PAD
Sh "5" O 600 787 0 0 0
Dr 394 0 98
At STD N 00E0FFFF
Ne 0 ""
Po 0 500
$EndPAD
$PAD
Sh "6" O 600 787 0 0 0
Dr 394 0 -98
At STD N 00E0FFFF
Ne 0 ""
Po 0 -500
$EndPAD
$PAD
Sh "7" O 600 787 0 0 0
Dr 394 0 98
At STD N 00E0FFFF
Ne 0 ""
Po 1000 500
$EndPAD
$PAD
Sh "8" O 600 787 0 0 0
Dr 394 0 -98
At STD N 00E0FFFF
Ne 0 ""
Po 1000 -500
$EndPAD
$PAD
Sh "9" O 600 787 0 0 0
Dr 394 0 98
At STD N 00E0FFFF
Ne 0 ""
Po 2000 500
$EndPAD
$PAD
Sh "10" O 600 787 0 0 0
Dr 394 0 -98
At STD N 00E0FFFF
Ne 0 ""
Po 2000 -500
$EndPAD
$SHAPE3D
Na "walter\pin_strip\pin_strip_5x2.wrl"
Sc 1.000000 1.000000 1.000000
Of 0.000000 0.000000 0.000000
Ro 0.000000 0.000000 0.000000
$EndSHAPE3D
$EndMODULE  pin_strip_5x2
$MODULE pin_strip_4x2-90
Po 0 0 0 15 4B90DEB0 00000000 ~~
Li pin_strip_4x2-90
Cd Pin strip 4x2pin 90
Kw CONN DEV
Sc 00000000
AR
Op 0 0 0
T0 0 -1500 400 400 0 80 N V 21 N"PIN_STRIP_4x2-90"
T1 0 -2000 400 350 0 80 N I 21 N"Val**"
DS -2000 1000 2000 1000 120 21
DS 2000 1000 2000 2000 120 21
DS 2000 2000 -2000 2000 120 21
DS -1000 2000 -1000 1000 120 21
DS -1500 500 -1500 4500 120 21
DS 1500 500 1500 4500 120 21
DS 500 4500 500 500 120 21
DS -500 500 -500 4500 120 21
DS -2000 2000 -2000 1000 120 21
$PAD
Sh "1" R 600 787 0 0 0
Dr 394 0 98
At STD N 00E0FFFF
Ne 0 ""
Po -1500 500
$EndPAD
$PAD
Sh "2" O 600 787 0 0 0
Dr 394 0 -98
At STD N 00E0FFFF
Ne 0 ""
Po -1500 -500
$EndPAD
$PAD
Sh "3" O 600 787 0 0 0
Dr 394 0 98
At STD N 00E0FFFF
Ne 0 ""
Po -500 500
$EndPAD
$PAD
Sh "4" O 600 787 0 0 0
Dr 394 0 -98
At STD N 00E0FFFF
Ne 0 ""
Po -500 -500
$EndPAD
$PAD
Sh "5" O 600 787 0 0 0
Dr 394 0 98
At STD N 00E0FFFF
Ne 0 ""
Po 500 500
$EndPAD
$PAD
Sh "6" O 600 787 0 0 0
Dr 394 0 -98
At STD N 00E0FFFF
Ne 0 ""
Po 500 -500
$EndPAD
$PAD
Sh "7" O 600 787 0 0 0
Dr 394 0 98
At STD N 00E0FFFF
Ne 0 ""
Po 1500 500
$EndPAD
$PAD
Sh "8" O 600 787 0 0 0
Dr 394 0 -98
At STD N 00E0FFFF
Ne 0 ""
Po 1500 -500
$EndPAD
$SHAPE3D
Na "walter\pin_strip\pin_strip_4x2-90.wrl"
Sc 1.000000 1.000000 1.000000
Of 0.000000 0.000000 0.000000
Ro 0.000000 0.000000 0.000000
$EndSHAPE3D
$EndMODULE  pin_strip_4x2-90
$MODULE pin_strip_4x2
Po 0 0 0 15 4B90DEC7 00000000 ~~
Li pin_strip_4x2
Cd Pin strip 4x2pin
Kw CONN DEV
Sc 00000000
AR
Op 0 0 0
T0 0 -1500 400 400 0 80 N V 21 N"PIN_STRIP_4x2"
T1 0 -2000 400 350 0 80 N I 21 N"Val**"
DS -2000 -1000 2000 -1000 120 21
DS 2000 -1000 2000 1000 120 21
DS 2000 1000 -2000 1000 120 21
DS -2000 0 -1000 0 120 21
DS -1000 0 -1000 1000 120 21
DS -2000 -1000 -2000 1000 120 21
$PAD
Sh "1" R 600 787 0 0 0
Dr 394 0 98
At STD N 00E0FFFF
Ne 0 ""
Po -1500 500
$EndPAD
$PAD
Sh "2" O 600 787 0 0 0
Dr 394 0 -98
At STD N 00E0FFFF
Ne 0 ""
Po -1500 -500
$EndPAD
$PAD
Sh "3" O 600 787 0 0 0
Dr 394 0 98
At STD N 00E0FFFF
Ne 0 ""
Po -500 500
$EndPAD
$PAD
Sh "4" O 600 787 0 0 0
Dr 394 0 -98
At STD N 00E0FFFF
Ne 0 ""
Po -500 -500
$EndPAD
$PAD
Sh "5" O 600 787 0 0 0
Dr 394 0 98
At STD N 00E0FFFF
Ne 0 ""
Po 500 500
$EndPAD
$PAD
Sh "6" O 600 787 0 0 0
Dr 394 0 -98
At STD N 00E0FFFF
Ne 0 ""
Po 500 -500
$EndPAD
$PAD
Sh "7" O 600 787 0 0 0
Dr 394 0 98
At STD N 00E0FFFF
Ne 0 ""
Po 1500 500
$EndPAD
$PAD
Sh "8" O 600 787 0 0 0
Dr 394 0 -98
At STD N 00E0FFFF
Ne 0 ""
Po 1500 -500
$EndPAD
$SHAPE3D
Na "walter\pin_strip\pin_strip_4x2.wrl"
Sc 1.000000 1.000000 1.000000
Of 0.000000 0.000000 0.000000
Ro 0.000000 0.000000 0.000000
$EndSHAPE3D
$EndMODULE  pin_strip_4x2
$MODULE pin_strip_3x2-90
Po 0 0 0 15 4B90DEE2 00000000 ~~
Li pin_strip_3x2-90
Cd Pin strip 3x2pin 90
Kw CONN DEV
Sc 00000000
AR
Op 0 0 0
T0 0 -1500 400 400 0 80 N V 21 N"PIN_STRIP_3x2-90"
T1 0 -2000 400 350 0 80 N I 21 N"Val**"
DS -1500 1000 1500 1000 120 21
DS 1500 1000 1500 2000 120 21
DS 1500 2000 -1500 2000 120 21
DS -500 2000 -500 1000 120 21
DS -1000 500 -1000 4500 120 21
DS 1000 4500 1000 500 120 21
DS 0 500 0 4500 120 21
DS -1500 2000 -1500 1000 120 21
$PAD
Sh "1" R 600 787 0 0 0
Dr 394 0 98
At STD N 00E0FFFF
Ne 0 ""
Po -1000 500
$EndPAD
$PAD
Sh "2" O 600 787 0 0 0
Dr 394 0 -98
At STD N 00E0FFFF
Ne 0 ""
Po -1000 -500
$EndPAD
$PAD
Sh "3" O 600 787 0 0 0
Dr 394 0 98
At STD N 00E0FFFF
Ne 0 ""
Po 0 500
$EndPAD
$PAD
Sh "4" O 600 787 0 0 0
Dr 394 0 -98
At STD N 00E0FFFF
Ne 0 ""
Po 0 -500
$EndPAD
$PAD
Sh "5" O 600 787 0 0 0
Dr 394 0 98
At STD N 00E0FFFF
Ne 0 ""
Po 1000 500
$EndPAD
$PAD
Sh "6" O 600 787 0 0 0
Dr 394 0 -98
At STD N 00E0FFFF
Ne 0 ""
Po 1000 -500
$EndPAD
$SHAPE3D
Na "walter\pin_strip\pin_strip_3x2-90.wrl"
Sc 1.000000 1.000000 1.000000
Of 0.000000 0.000000 0.000000
Ro 0.000000 0.000000 0.000000
$EndSHAPE3D
$EndMODULE  pin_strip_3x2-90
$MODULE pin_strip_3x2
Po 0 0 0 15 4B90DEF7 00000000 ~~
Li pin_strip_3x2
Cd Pin strip 3x2pin
Kw CONN DEV
Sc 00000000
AR
Op 0 0 0
T0 0 -1500 400 400 0 80 N V 21 N"PIN_STRIP_3x2"
T1 0 -2000 400 350 0 80 N I 21 N"Val**"
DS -1500 -1000 1500 -1000 120 21
DS 1500 -1000 1500 1000 120 21
DS 1500 1000 -1500 1000 120 21
DS -1500 0 -500 0 120 21
DS -500 0 -500 1000 120 21
DS -1500 -1000 -1500 1000 120 21
$PAD
Sh "1" R 600 787 0 0 0
Dr 394 0 98
At STD N 00E0FFFF
Ne 0 ""
Po -1000 500
$EndPAD
$PAD
Sh "2" O 600 787 0 0 0
Dr 394 0 -98
At STD N 00E0FFFF
Ne 0 ""
Po -1000 -500
$EndPAD
$PAD
Sh "3" O 600 787 0 0 0
Dr 394 0 98
At STD N 00E0FFFF
Ne 0 ""
Po 0 500
$EndPAD
$PAD
Sh "4" O 600 787 0 0 0
Dr 394 0 -98
At STD N 00E0FFFF
Ne 0 ""
Po 0 -500
$EndPAD
$PAD
Sh "5" O 600 787 0 0 0
Dr 394 0 98
At STD N 00E0FFFF
Ne 0 ""
Po 1000 500
$EndPAD
$PAD
Sh "6" O 600 787 0 0 0
Dr 394 0 -98
At STD N 00E0FFFF
Ne 0 ""
Po 1000 -500
$EndPAD
$SHAPE3D
Na "walter\pin_strip\pin_strip_3x2.wrl"
Sc 1.000000 1.000000 1.000000
Of 0.000000 0.000000 0.000000
Ro 0.000000 0.000000 0.000000
$EndSHAPE3D
$EndMODULE  pin_strip_3x2
$MODULE pin_strip_2x2-90
Po 0 0 0 15 4B90DF0B 00000000 ~~
Li pin_strip_2x2-90
Cd Pin strip 2x2pin 90
Kw CONN DEV
Sc 00000000
AR
Op 0 0 0
T0 0 -1500 400 400 0 80 N V 21 N"PIN_STRIP_2x2-90"
T1 0 -2000 400 350 0 80 N I 21 N"Val**"
DS 0 2000 -1000 1000 120 21
DS 0 1000 -1000 2000 120 21
DS -1000 1000 1000 1000 120 21
DS 1000 1000 1000 2000 120 21
DS 1000 2000 -1000 2000 120 21
DS -500 500 -500 4500 120 21
DS 500 500 500 4500 120 21
DS -1000 2000 -1000 1000 120 21
$PAD
Sh "1" R 600 787 0 0 0
Dr 394 0 98
At STD N 00E0FFFF
Ne 0 ""
Po -500 500
$EndPAD
$PAD
Sh "2" O 600 787 0 0 0
Dr 394 0 -98
At STD N 00E0FFFF
Ne 0 ""
Po -500 -500
$EndPAD
$PAD
Sh "3" O 600 787 0 0 0
Dr 394 0 98
At STD N 00E0FFFF
Ne 0 ""
Po 500 500
$EndPAD
$PAD
Sh "4" O 600 787 0 0 0
Dr 394 0 -98
At STD N 00E0FFFF
Ne 0 ""
Po 500 -500
$EndPAD
$SHAPE3D
Na "walter\pin_strip\pin_strip_2x2-90.wrl"
Sc 1.000000 1.000000 1.000000
Of 0.000000 0.000000 0.000000
Ro 0.000000 0.000000 0.000000
$EndSHAPE3D
$EndMODULE  pin_strip_2x2-90
$MODULE pin_strip_2x2
Po 0 0 0 15 4B90DF21 00000000 ~~
Li pin_strip_2x2
Cd Pin strip 2x2pin
Kw CONN DEV
Sc 00000000
AR
Op 0 0 0
T0 0 -1500 400 400 0 80 N V 21 N"PIN_STRIP_2x2"
T1 0 -2000 400 350 0 80 N I 21 N"Val**"
DS -1000 -1000 1000 -1000 120 21
DS 1000 -1000 1000 1000 120 21
DS 1000 1000 -1000 1000 120 21
DS -1000 0 0 0 120 21
DS 0 0 0 1000 120 21
DS -1000 -1000 -1000 1000 120 21
$PAD
Sh "1" R 600 787 0 0 0
Dr 394 0 98
At STD N 00E0FFFF
Ne 0 ""
Po -500 500
$EndPAD
$PAD
Sh "2" O 600 787 0 0 0
Dr 394 0 -98
At STD N 00E0FFFF
Ne 0 ""
Po -500 -500
$EndPAD
$PAD
Sh "3" O 600 787 0 0 0
Dr 394 0 98
At STD N 00E0FFFF
Ne 0 ""
Po 500 500
$EndPAD
$PAD
Sh "4" O 600 787 0 0 0
Dr 394 0 -98
At STD N 00E0FFFF
Ne 0 ""
Po 500 -500
$EndPAD
$SHAPE3D
Na "walter\pin_strip\pin_strip_2x2.wrl"
Sc 1.000000 1.000000 1.000000
Of 0.000000 0.000000 0.000000
Ro 0.000000 0.000000 0.000000
$EndSHAPE3D
$EndMODULE  pin_strip_2x2
$MODULE pin_strip_9-90
Po 0 0 0 15 4B90DF42 00000000 ~~
Li pin_strip_9-90
Cd Pin strip 9pin 90
Kw CONN DEV
Sc 00000000
AR
Op 0 0 0
T0 0 -850 400 400 0 80 N V 21 N"PIN_STRIP_9-90"
T1 100 -1400 400 350 0 80 N I 21 N"Val**"
DS -4500 500 4500 500 120 21
DS 4500 500 4500 1500 120 21
DS 4500 1500 -4500 1500 120 21
DS 4000 0 4000 4000 120 21
DS 3000 0 3000 4000 120 21
DS 2000 0 2000 4000 120 21
DS -3500 500 -3500 1500 120 21
DS -4000 0 -4000 4000 120 21
DS 1000 0 1000 4000 120 21
DS 0 0 0 4000 120 21
DS -1000 0 -1000 4000 120 21
DS -2000 4000 -2000 0 120 21
DS -3000 0 -3000 4000 120 21
DS -4500 1500 -4500 500 120 21
$PAD
Sh "1" R 600 866 0 0 0
Dr 394 0 0
At STD N 00E0FFFF
Ne 0 ""
Po -4000 0
$EndPAD
$PAD
Sh "2" O 600 866 0 0 0
Dr 394 0 0
At STD N 00E0FFFF
Ne 0 ""
Po -3000 0
$EndPAD
$PAD
Sh "3" O 600 866 0 0 0
Dr 394 0 0
At STD N 00E0FFFF
Ne 0 ""
Po -2000 0
$EndPAD
$PAD
Sh "4" O 600 866 0 0 0
Dr 394 0 0
At STD N 00E0FFFF
Ne 0 ""
Po -1000 0
$EndPAD
$PAD
Sh "5" O 600 866 0 0 0
Dr 394 0 0
At STD N 00E0FFFF
Ne 0 ""
Po 0 0
$EndPAD
$PAD
Sh "6" O 600 866 0 0 0
Dr 394 0 0
At STD N 00E0FFFF
Ne 0 ""
Po 1000 0
$EndPAD
$PAD
Sh "7" O 600 866 0 0 0
Dr 394 0 0
At STD N 00E0FFFF
Ne 0 ""
Po 2000 0
$EndPAD
$PAD
Sh "8" O 600 866 0 0 0
Dr 394 0 0
At STD N 00E0FFFF
Ne 0 ""
Po 3000 0
$EndPAD
$PAD
Sh "9" O 600 866 0 0 0
Dr 394 0 0
At STD N 00E0FFFF
Ne 0 ""
Po 4000 0
$EndPAD
$SHAPE3D
Na "walter\pin_strip\pin_strip_9-90.wrl"
Sc 1.000000 1.000000 1.000000
Of 0.000000 0.000000 0.000000
Ro 0.000000 0.000000 0.000000
$EndSHAPE3D
$EndMODULE  pin_strip_9-90
$MODULE pin_strip_9
Po 0 0 0 15 4B90DF58 00000000 ~~
Li pin_strip_9
Cd Pin strip 9pin
Kw CONN DEV
Sc 00000000
AR
Op 0 0 0
T0 0 -850 400 400 0 80 N V 21 N"PIN_STRIP_9"
T1 100 -1400 400 350 0 80 N I 21 N"Val**"
DS -3500 -500 -3500 500 120 21
DS -4500 -500 4500 -500 120 21
DS 4500 -500 4500 500 120 21
DS 4500 500 -4500 500 120 21
DS -4500 500 -4500 -500 120 21
$PAD
Sh "1" R 600 866 0 0 0
Dr 394 0 0
At STD N 00E0FFFF
Ne 0 ""
Po -4000 0
$EndPAD
$PAD
Sh "2" O 600 866 0 0 0
Dr 394 0 0
At STD N 00E0FFFF
Ne 0 ""
Po -3000 0
$EndPAD
$PAD
Sh "3" O 600 866 0 0 0
Dr 394 0 0
At STD N 00E0FFFF
Ne 0 ""
Po -2000 0
$EndPAD
$PAD
Sh "4" O 600 866 0 0 0
Dr 394 0 0
At STD N 00E0FFFF
Ne 0 ""
Po -1000 0
$EndPAD
$PAD
Sh "5" O 600 866 0 0 0
Dr 394 0 0
At STD N 00E0FFFF
Ne 0 ""
Po 0 0
$EndPAD
$PAD
Sh "6" O 600 866 0 0 0
Dr 394 0 0
At STD N 00E0FFFF
Ne 0 ""
Po 1000 0
$EndPAD
$PAD
Sh "7" O 600 866 0 0 0
Dr 394 0 0
At STD N 00E0FFFF
Ne 0 ""
Po 2000 0
$EndPAD
$PAD
Sh "8" O 600 866 0 0 0
Dr 394 0 0
At STD N 00E0FFFF
Ne 0 ""
Po 3000 0
$EndPAD
$PAD
Sh "9" O 600 866 0 0 0
Dr 394 0 0
At STD N 00E0FFFF
Ne 0 ""
Po 4000 0
$EndPAD
$SHAPE3D
Na "walter\pin_strip\pin_strip_9.wrl"
Sc 1.000000 1.000000 1.000000
Of 0.000000 0.000000 0.000000
Ro 0.000000 0.000000 0.000000
$EndSHAPE3D
$EndMODULE  pin_strip_9
$MODULE pin_strip_8-90
Po 0 0 0 15 4B90DF80 00000000 ~~
Li pin_strip_8-90
Cd Pin strip 8pin 90
Kw CONN DEV
Sc 00000000
AR
Op 0 0 0
T0 0 -850 400 400 0 80 N V 21 N"PIN_STRIP_8-90"
T1 100 -1400 400 350 0 80 N I 21 N"Val**"
DS -4000 500 4000 500 120 21
DS 4000 500 4000 1500 120 21
DS 4000 1500 -4000 1500 120 21
DS 3500 0 3500 4000 120 21
DS 2500 0 2500 4000 120 21
DS -3000 500 -3000 1500 120 21
DS -3500 0 -3500 4000 120 21
DS 1500 0 1500 4000 120 21
DS 500 0 500 4000 120 21
DS -500 0 -500 4000 120 21
DS -1500 4000 -1500 0 120 21
DS -2500 0 -2500 4000 120 21
DS -4000 1500 -4000 500 120 21
$PAD
Sh "1" R 600 866 0 0 0
Dr 394 0 0
At STD N 00E0FFFF
Ne 0 ""
Po -3500 0
$EndPAD
$PAD
Sh "2" O 600 866 0 0 0
Dr 394 0 0
At STD N 00E0FFFF
Ne 0 ""
Po -2500 0
$EndPAD
$PAD
Sh "3" O 600 866 0 0 0
Dr 394 0 0
At STD N 00E0FFFF
Ne 0 ""
Po -1500 0
$EndPAD
$PAD
Sh "4" O 600 866 0 0 0
Dr 394 0 0
At STD N 00E0FFFF
Ne 0 ""
Po -500 0
$EndPAD
$PAD
Sh "5" O 600 866 0 0 0
Dr 394 0 0
At STD N 00E0FFFF
Ne 0 ""
Po 500 0
$EndPAD
$PAD
Sh "6" O 600 866 0 0 0
Dr 394 0 0
At STD N 00E0FFFF
Ne 0 ""
Po 1500 0
$EndPAD
$PAD
Sh "7" O 600 866 0 0 0
Dr 394 0 0
At STD N 00E0FFFF
Ne 0 ""
Po 2500 0
$EndPAD
$PAD
Sh "8" O 600 866 0 0 0
Dr 394 0 0
At STD N 00E0FFFF
Ne 0 ""
Po 3500 0
$EndPAD
$SHAPE3D
Na "walter\pin_strip\pin_strip_8-90.wrl"
Sc 1.000000 1.000000 1.000000
Of 0.000000 0.000000 0.000000
Ro 0.000000 0.000000 0.000000
$EndSHAPE3D
$EndMODULE  pin_strip_8-90
$MODULE pin_strip_8
Po 0 0 0 15 4B90DF8F 00000000 ~~
Li pin_strip_8
Cd Pin strip 8pin
Kw CONN DEV
Sc 00000000
AR
Op 0 0 0
T0 0 -850 400 400 0 80 N V 21 N"PIN_STRIP_8"
T1 100 -1400 400 350 0 80 N I 21 N"Val**"
DS -3000 -500 -3000 500 120 21
DS -4000 -500 4000 -500 120 21
DS 4000 -500 4000 500 120 21
DS 4000 500 -4000 500 120 21
DS -4000 500 -4000 -500 120 21
$PAD
Sh "1" R 600 866 0 0 0
Dr 394 0 0
At STD N 00E0FFFF
Ne 0 ""
Po -3500 0
$EndPAD
$PAD
Sh "2" O 600 866 0 0 0
Dr 394 0 0
At STD N 00E0FFFF
Ne 0 ""
Po -2500 0
$EndPAD
$PAD
Sh "3" O 600 866 0 0 0
Dr 394 0 0
At STD N 00E0FFFF
Ne 0 ""
Po -1500 0
$EndPAD
$PAD
Sh "4" O 600 866 0 0 0
Dr 394 0 0
At STD N 00E0FFFF
Ne 0 ""
Po -500 0
$EndPAD
$PAD
Sh "5" O 600 866 0 0 0
Dr 394 0 0
At STD N 00E0FFFF
Ne 0 ""
Po 500 0
$EndPAD
$PAD
Sh "6" O 600 866 0 0 0
Dr 394 0 0
At STD N 00E0FFFF
Ne 0 ""
Po 1500 0
$EndPAD
$PAD
Sh "7" O 600 866 0 0 0
Dr 394 0 0
At STD N 00E0FFFF
Ne 0 ""
Po 2500 0
$EndPAD
$PAD
Sh "8" O 600 866 0 0 0
Dr 394 0 0
At STD N 00E0FFFF
Ne 0 ""
Po 3500 0
$EndPAD
$SHAPE3D
Na "walter\pin_strip\pin_strip_8.wrl"
Sc 1.000000 1.000000 1.000000
Of 0.000000 0.000000 0.000000
Ro 0.000000 0.000000 0.000000
$EndSHAPE3D
$EndMODULE  pin_strip_8
$MODULE pin_strip_7-90
Po 0 0 0 15 4B90DF9B 00000000 ~~
Li pin_strip_7-90
Cd Pin strip 7pin 90
Kw CONN DEV
Sc 00000000
AR
Op 0 0 0
T0 0 -850 400 400 0 80 N V 21 N"PIN_STRIP_7-90"
T1 100 -1400 400 350 0 80 N I 21 N"Val**"
DS -3500 500 3500 500 120 21
DS 3500 500 3500 1500 120 21
DS 3500 1500 -3500 1500 120 21
DS 3000 0 3000 4000 120 21
DS -2500 500 -2500 1500 120 21
DS -3000 0 -3000 4000 120 21
DS 2000 0 2000 4000 120 21
DS 1000 0 1000 4000 120 21
DS 0 0 0 4000 120 21
DS -1000 4000 -1000 0 120 21
DS -2000 0 -2000 4000 120 21
DS -3500 1500 -3500 500 120 21
$PAD
Sh "1" R 600 866 0 0 0
Dr 394 0 0
At STD N 00E0FFFF
Ne 0 ""
Po -3000 0
$EndPAD
$PAD
Sh "2" O 600 866 0 0 0
Dr 394 0 0
At STD N 00E0FFFF
Ne 0 ""
Po -2000 0
$EndPAD
$PAD
Sh "3" O 600 866 0 0 0
Dr 394 0 0
At STD N 00E0FFFF
Ne 0 ""
Po -1000 0
$EndPAD
$PAD
Sh "4" O 600 866 0 0 0
Dr 394 0 0
At STD N 00E0FFFF
Ne 0 ""
Po 0 0
$EndPAD
$PAD
Sh "5" O 600 866 0 0 0
Dr 394 0 0
At STD N 00E0FFFF
Ne 0 ""
Po 1000 0
$EndPAD
$PAD
Sh "6" O 600 866 0 0 0
Dr 394 0 0
At STD N 00E0FFFF
Ne 0 ""
Po 2000 0
$EndPAD
$PAD
Sh "7" O 600 866 0 0 0
Dr 394 0 0
At STD N 00E0FFFF
Ne 0 ""
Po 3000 0
$EndPAD
$SHAPE3D
Na "walter\pin_strip\pin_strip_7-90.wrl"
Sc 1.000000 1.000000 1.000000
Of 0.000000 0.000000 0.000000
Ro 0.000000 0.000000 0.000000
$EndSHAPE3D
$EndMODULE  pin_strip_7-90
$MODULE pin_strip_7
Po 0 0 0 15 4B90DFA8 00000000 ~~
Li pin_strip_7
Cd Pin strip 7pin
Kw CONN DEV
Sc 00000000
AR
Op 0 0 0
T0 0 -850 400 400 0 80 N V 21 N"PIN_STRIP_7"
T1 100 -1400 400 350 0 80 N I 21 N"Val**"
DS -2500 -500 -2500 500 120 21
DS -3500 500 3500 500 120 21
DS 3500 -500 -3500 -500 120 21
DS -3500 500 -3500 -500 120 21
DS 3500 -500 3500 500 120 21
$PAD
Sh "1" R 600 866 0 0 0
Dr 394 0 0
At STD N 00E0FFFF
Ne 0 ""
Po -3000 0
$EndPAD
$PAD
Sh "2" O 600 866 0 0 0
Dr 394 0 0
At STD N 00E0FFFF
Ne 0 ""
Po -2000 0
$EndPAD
$PAD
Sh "3" O 600 866 0 0 0
Dr 394 0 0
At STD N 00E0FFFF
Ne 0 ""
Po -1000 0
$EndPAD
$PAD
Sh "4" O 600 866 0 0 0
Dr 394 0 0
At STD N 00E0FFFF
Ne 0 ""
Po 0 0
$EndPAD
$PAD
Sh "5" O 600 866 0 0 0
Dr 394 0 0
At STD N 00E0FFFF
Ne 0 ""
Po 1000 0
$EndPAD
$PAD
Sh "6" O 600 866 0 0 0
Dr 394 0 0
At STD N 00E0FFFF
Ne 0 ""
Po 2000 0
$EndPAD
$PAD
Sh "7" O 600 866 0 0 0
Dr 394 0 0
At STD N 00E0FFFF
Ne 0 ""
Po 3000 0
$EndPAD
$SHAPE3D
Na "walter\pin_strip\pin_strip_7.wrl"
Sc 1.000000 1.000000 1.000000
Of 0.000000 0.000000 0.000000
Ro 0.000000 0.000000 0.000000
$EndSHAPE3D
$EndMODULE  pin_strip_7
$MODULE pin_strip_6-90
Po 0 0 0 15 4B90DFB6 00000000 ~~
Li pin_strip_6-90
Cd Pin strip 6pin 90
Kw CONN DEV
Sc 00000000
AR
Op 0 0 0
T0 0 -850 400 400 0 80 N V 21 N"PIN_STRIP_6-90"
T1 100 -1400 400 350 0 80 N I 21 N"Val**"
DS -2500 0 -2500 4000 150 21
DS 2500 0 2500 4000 150 21
DS 1500 0 1500 4000 150 21
DS 500 0 500 4000 150 21
DS -500 4000 -500 0 150 21
DS -1500 0 -1500 4000 150 21
DS -3000 1500 -3000 500 120 21
DS -3000 500 3000 500 120 21
DS 3000 500 3000 1500 120 21
DS 3000 1500 -3000 1500 120 21
$PAD
Sh "1" R 600 866 0 0 0
Dr 394 0 0
At STD N 00E0FFFF
Ne 0 ""
Po -2500 0
$EndPAD
$PAD
Sh "2" O 600 866 0 0 0
Dr 394 0 0
At STD N 00E0FFFF
Ne 0 ""
Po -1500 0
$EndPAD
$PAD
Sh "3" O 600 866 0 0 0
Dr 394 0 0
At STD N 00E0FFFF
Ne 0 ""
Po -500 0
$EndPAD
$PAD
Sh "4" O 600 866 0 0 0
Dr 394 0 0
At STD N 00E0FFFF
Ne 0 ""
Po 500 0
$EndPAD
$PAD
Sh "5" O 600 866 0 0 0
Dr 394 0 0
At STD N 00E0FFFF
Ne 0 ""
Po 1500 0
$EndPAD
$PAD
Sh "6" O 600 866 0 0 0
Dr 394 0 0
At STD N 00E0FFFF
Ne 0 ""
Po 2500 0
$EndPAD
$SHAPE3D
Na "walter\pin_strip\pin_strip_6-90.wrl"
Sc 1.000000 1.000000 1.000000
Of 0.000000 0.000000 0.000000
Ro 0.000000 0.000000 0.000000
$EndSHAPE3D
$EndMODULE  pin_strip_6-90
$MODULE pin_strip_6
Po 0 0 0 15 4B90DFC4 00000000 ~~
Li pin_strip_6
Cd Pin strip 6pin
Kw CONN DEV
Sc 00000000
AR
Op 0 0 0
T0 0 -850 400 400 0 80 N V 21 N"PIN_STRIP_6"
T1 100 -1400 400 350 0 80 N I 21 N"Val**"
DS -2000 -500 -2000 500 120 21
DS -3000 500 -3000 -500 120 21
DS -3000 -500 3000 -500 120 21
DS 3000 -500 3000 500 120 21
DS 3000 500 -3000 500 120 21
$PAD
Sh "1" R 600 866 0 0 0
Dr 394 0 0
At STD N 00E0FFFF
Ne 0 ""
Po -2500 0
$EndPAD
$PAD
Sh "2" O 600 866 0 0 0
Dr 394 0 0
At STD N 00E0FFFF
Ne 0 ""
Po -1500 0
$EndPAD
$PAD
Sh "3" O 600 866 0 0 0
Dr 394 0 0
At STD N 00E0FFFF
Ne 0 ""
Po -500 0
$EndPAD
$PAD
Sh "4" O 600 866 0 0 0
Dr 394 0 0
At STD N 00E0FFFF
Ne 0 ""
Po 500 0
$EndPAD
$PAD
Sh "5" O 600 866 0 0 0
Dr 394 0 0
At STD N 00E0FFFF
Ne 0 ""
Po 1500 0
$EndPAD
$PAD
Sh "6" O 600 866 0 0 0
Dr 394 0 0
At STD N 00E0FFFF
Ne 0 ""
Po 2500 0
$EndPAD
$SHAPE3D
Na "walter\pin_strip\pin_strip_6.wrl"
Sc 1.000000 1.000000 1.000000
Of 0.000000 0.000000 0.000000
Ro 0.000000 0.000000 0.000000
$EndSHAPE3D
$EndMODULE  pin_strip_6
$MODULE pin_strip_5-90
Po 0 0 0 15 4B90DFD1 00000000 ~~
Li pin_strip_5-90
Cd Pin strip 5pin 90
Kw CONN DEV
Sc 00000000
AR
Op 0 0 0
T0 0 -850 400 400 0 80 N V 21 N"PIN_STRIP_5-90"
T1 100 -1400 400 350 0 80 N I 21 N"Val**"
DS -2500 500 2500 500 120 21
DS 2500 500 2500 1500 120 21
DS 2500 1500 -2500 1500 120 21
DS -1500 500 -1500 1500 120 21
DS -2000 0 -2000 4000 120 21
DS 2000 0 2000 4000 120 21
DS 1000 0 1000 4000 120 21
DS 0 4000 0 0 120 21
DS -1000 0 -1000 4000 120 21
DS -2500 1500 -2500 500 120 21
$PAD
Sh "1" R 600 866 0 0 0
Dr 394 0 0
At STD N 00E0FFFF
Ne 0 ""
Po -2000 0
$EndPAD
$PAD
Sh "2" O 600 866 0 0 0
Dr 394 0 0
At STD N 00E0FFFF
Ne 0 ""
Po -1000 0
$EndPAD
$PAD
Sh "3" O 600 866 0 0 0
Dr 394 0 0
At STD N 00E0FFFF
Ne 0 ""
Po 0 0
$EndPAD
$PAD
Sh "4" O 600 866 0 0 0
Dr 394 0 0
At STD N 00E0FFFF
Ne 0 ""
Po 1000 0
$EndPAD
$PAD
Sh "5" O 600 866 0 0 0
Dr 394 0 0
At STD N 00E0FFFF
Ne 0 ""
Po 2000 0
$EndPAD
$SHAPE3D
Na "walter\pin_strip\pin_strip_5-90.wrl"
Sc 1.000000 1.000000 1.000000
Of 0.000000 0.000000 0.000000
Ro 0.000000 0.000000 0.000000
$EndSHAPE3D
$EndMODULE  pin_strip_5-90
$MODULE pin_strip_5
Po 0 0 0 15 4B90DFE0 00000000 ~~
Li pin_strip_5
Cd Pin strip 5pin
Kw CONN DEV
Sc 00000000
AR
Op 0 0 0
T0 0 -850 400 400 0 80 N V 21 N"PIN_STRIP_5"
T1 100 -1400 400 350 0 80 N I 21 N"Val**"
DS -1500 -500 -1500 500 120 21
DS 2500 500 -2500 500 120 21
DS -2500 -500 2500 -500 120 21
DS -2500 500 -2500 -500 120 21
DS 2500 -500 2500 500 120 21
$PAD
Sh "1" R 600 866 0 0 0
Dr 394 0 0
At STD N 00E0FFFF
Ne 0 ""
Po -2000 0
$EndPAD
$PAD
Sh "2" O 600 866 0 0 0
Dr 394 0 0
At STD N 00E0FFFF
Ne 0 ""
Po -1000 0
$EndPAD
$PAD
Sh "3" O 600 866 0 0 0
Dr 394 0 0
At STD N 00E0FFFF
Ne 0 ""
Po 0 0
$EndPAD
$PAD
Sh "4" O 600 866 0 0 0
Dr 394 0 0
At STD N 00E0FFFF
Ne 0 ""
Po 1000 0
$EndPAD
$PAD
Sh "5" O 600 866 0 0 0
Dr 394 0 0
At STD N 00E0FFFF
Ne 0 ""
Po 2000 0
$EndPAD
$SHAPE3D
Na "walter\pin_strip\pin_strip_5.wrl"
Sc 1.000000 1.000000 1.000000
Of 0.000000 0.000000 0.000000
Ro 0.000000 0.000000 0.000000
$EndSHAPE3D
$EndMODULE  pin_strip_5
$MODULE pin_strip_4-90
Po 0 0 0 15 4B90DFED 00000000 ~~
Li pin_strip_4-90
Cd Pin strip 4pin 90
Kw CONN DEV
Sc 00000000
AR
Op 0 0 0
T0 0 -850 400 400 0 80 N V 21 N"PIN_STRIP_4-90"
T1 100 -1400 400 350 0 80 N I 21 N"Val**"
DS -2000 500 2000 500 120 21
DS 2000 500 2000 1500 120 21
DS 2000 1500 -2000 1500 120 21
DS -1000 500 -1000 1500 120 21
DS -1500 0 -1500 4000 120 21
DS 1500 0 1500 4000 120 21
DS 500 4000 500 0 120 21
DS -500 0 -500 4000 120 21
DS -2000 1500 -2000 500 120 21
$PAD
Sh "1" R 600 866 0 0 0
Dr 394 0 0
At STD N 00E0FFFF
Ne 0 ""
Po -1500 0
$EndPAD
$PAD
Sh "2" O 600 866 0 0 0
Dr 394 0 0
At STD N 00E0FFFF
Ne 0 ""
Po -500 0
$EndPAD
$PAD
Sh "3" O 600 866 0 0 0
Dr 394 0 0
At STD N 00E0FFFF
Ne 0 ""
Po 500 0
$EndPAD
$PAD
Sh "4" O 600 866 0 0 0
Dr 394 0 0
At STD N 00E0FFFF
Ne 0 ""
Po 1500 0
$EndPAD
$SHAPE3D
Na "walter\pin_strip\pin_strip_4-90.wrl"
Sc 1.000000 1.000000 1.000000
Of 0.000000 0.000000 0.000000
Ro 0.000000 0.000000 0.000000
$EndSHAPE3D
$EndMODULE  pin_strip_4-90
$MODULE pin_strip_4
Po 0 0 0 15 4B90DFFC 00000000 ~~
Li pin_strip_4
Cd Pin strip 4pin
Kw CONN DEV
Sc 00000000
AR
Op 0 0 0
T0 0 -850 400 400 0 80 N V 21 N"PIN_STRIP_4"
T1 100 -1400 400 350 0 80 N I 21 N"Val**"
DS -1000 -500 -1000 500 120 21
DS 2000 500 -2000 500 120 21
DS -2000 -500 2000 -500 120 21
DS -2000 500 -2000 -500 120 21
DS 2000 -500 2000 500 120 21
$PAD
Sh "1" R 600 866 0 0 0
Dr 394 0 0
At STD N 00E0FFFF
Ne 0 ""
Po -1500 0
$EndPAD
$PAD
Sh "2" O 600 866 0 0 0
Dr 394 0 0
At STD N 00E0FFFF
Ne 0 ""
Po -500 0
$EndPAD
$PAD
Sh "3" O 600 866 0 0 0
Dr 394 0 0
At STD N 00E0FFFF
Ne 0 ""
Po 500 0
$EndPAD
$PAD
Sh "4" O 600 866 0 0 0
Dr 394 0 0
At STD N 00E0FFFF
Ne 0 ""
Po 1500 0
$EndPAD
$SHAPE3D
Na "walter\pin_strip\pin_strip_4.wrl"
Sc 1.000000 1.000000 1.000000
Of 0.000000 0.000000 0.000000
Ro 0.000000 0.000000 0.000000
$EndSHAPE3D
$EndMODULE  pin_strip_4
$MODULE pin_strip_3-90
Po 0 0 0 15 4B90E00C 00000000 ~~
Li pin_strip_3-90
Cd Pin strip 3pin 90
Kw CONN DEV
Sc 00000000
AR
Op 0 0 0
T0 0 -850 400 400 0 80 N V 21 N"PIN_STRIP_3-90"
T1 100 -1400 400 350 0 80 N I 21 N"Val**"
DS -1500 500 1500 500 120 21
DS 1500 500 1500 1500 120 21
DS 1500 1500 -1500 1500 120 21
DS -500 500 -500 1500 120 21
DS -1000 0 -1000 4000 120 21
DS 1000 4000 1000 0 120 21
DS 0 0 0 4000 120 21
DS -1500 1500 -1500 500 120 21
$PAD
Sh "1" R 600 866 0 0 0
Dr 394 0 0
At STD N 00E0FFFF
Ne 0 ""
Po -1000 0
$EndPAD
$PAD
Sh "2" O 600 866 0 0 0
Dr 394 0 0
At STD N 00E0FFFF
Ne 0 ""
Po 0 0
$EndPAD
$PAD
Sh "3" O 600 866 0 0 0
Dr 394 0 0
At STD N 00E0FFFF
Ne 0 ""
Po 1000 0
$EndPAD
$SHAPE3D
Na "walter\pin_strip\pin_strip_3-90.wrl"
Sc 1.000000 1.000000 1.000000
Of 0.000000 0.000000 0.000000
Ro 0.000000 0.000000 0.000000
$EndSHAPE3D
$EndMODULE  pin_strip_3-90
$MODULE pin_strip_3
Po 0 0 0 15 4B90E017 00000000 ~~
Li pin_strip_3
Cd Pin strip 3pin
Kw CONN DEV
Sc 00000000
AR
Op 0 0 0
T0 0 -850 400 400 0 80 N V 21 N"PIN_STRIP_3"
T1 100 -1400 400 350 0 80 N I 21 N"Val**"
DS -500 500 -500 -500 120 21
DS -1500 -500 1500 -500 120 21
DS 1500 -500 1500 500 120 21
DS 1500 500 -1500 500 120 21
DS -1500 500 -1500 -500 120 21
$PAD
Sh "1" R 600 866 0 0 0
Dr 394 0 0
At STD N 00E0FFFF
Ne 0 ""
Po -1000 0
$EndPAD
$PAD
Sh "2" O 600 866 0 0 0
Dr 394 0 0
At STD N 00E0FFFF
Ne 0 ""
Po 0 0
$EndPAD
$PAD
Sh "3" O 600 866 0 0 0
Dr 394 0 0
At STD N 00E0FFFF
Ne 0 ""
Po 1000 0
$EndPAD
$SHAPE3D
Na "walter\pin_strip\pin_strip_3.wrl"
Sc 1.000000 1.000000 1.000000
Of 0.000000 0.000000 0.000000
Ro 0.000000 0.000000 0.000000
$EndSHAPE3D
$EndMODULE  pin_strip_3
$MODULE pin_strip_2
Po 0 0 0 15 4B90E024 00000000 ~~
Li pin_strip_2
Cd Pin strip 2pin
Kw CONN DEV
Sc 00000000
AR
Op 0 0 0
T0 0 -850 400 400 0 80 N V 21 N"PIN_STRIP_2"
T1 100 -1400 400 350 0 80 N I 21 N"Val**"
DS -1000 500 0 -500 120 21
DS 1000 500 -1000 500 120 21
DS -1000 -500 1000 -500 120 21
DS -1000 500 -1000 -500 120 21
DS 1000 -500 1000 500 120 21
$PAD
Sh "1" R 600 866 0 0 0
Dr 394 0 0
At STD N 00E0FFFF
Ne 0 ""
Po -500 0
$EndPAD
$PAD
Sh "2" O 600 866 0 0 0
Dr 394 0 0
At STD N 00E0FFFF
Ne 0 ""
Po 500 0
$EndPAD
$SHAPE3D
Na "walter\pin_strip\pin_strip_2.wrl"
Sc 1.000000 1.000000 1.000000
Of 0.000000 0.000000 0.000000
Ro 0.000000 0.000000 0.000000
$EndSHAPE3D
$EndMODULE  pin_strip_2
$MODULE pin_strip_2-90
Po 0 0 0 15 4B90E02F 00000000 ~~
Li pin_strip_2-90
Cd Pin strip 2pin 90
Kw CONN DEV
Sc 00000000
AR
Op 0 0 0
T0 0 -850 400 400 0 80 N V 21 N"PIN_STRIP_2-90"
T1 100 -1400 400 350 0 80 N I 21 N"Val**"
DS 0 500 -1000 1500 120 21
DS -1000 1500 1000 1500 120 21
DS 1000 1500 1000 500 120 21
DS 1000 500 -1000 500 120 21
DS -500 0 -500 4000 120 21
DS 500 0 500 4000 120 21
DS -1000 1500 -1000 500 120 21
$PAD
Sh "1" R 600 866 0 0 0
Dr 394 0 0
At STD N 00E0FFFF
Ne 0 ""
Po -500 0
$EndPAD
$PAD
Sh "2" O 600 866 0 0 0
Dr 394 0 0
At STD N 00E0FFFF
Ne 0 ""
Po 500 0
$EndPAD
$SHAPE3D
Na "walter\pin_strip\pin_strip_2-90.wrl"
Sc 1.000000 1.000000 1.000000
Of 0.000000 0.000000 0.000000
Ro 0.000000 0.000000 0.000000
$EndSHAPE3D
$EndMODULE  pin_strip_2-90
$MODULE pin_strip_1
Po 0 0 0 15 4B90E035 00000000 ~~
Li pin_strip_1
Cd Pin strip 1pin
Kw CONN DEV
Sc 00000000
AR 
Op 0 0 0
T0 0 -850 400 400 0 80 N V 21 N"PIN_STRIP_1"
T1 100 -1400 400 350 0 80 N I 21 N"Val**"
DS 500 500 -500 500 120 21
DS -500 -500 500 -500 120 21
DS -500 500 -500 -500 120 21
DS 500 -500 500 500 120 21
$PAD
Sh "1" R 600 866 0 0 0
Dr 394 0 0
At STD N 00E0FFFF
Ne 0 ""
Po 0 0
$EndPAD
$SHAPE3D
Na "walter\pin_strip\pin_strip_1.wrl"
Sc 1.000000 1.000000 1.000000
Of 0.000000 0.000000 0.000000
Ro 0.000000 0.000000 0.000000
$EndSHAPE3D
$EndMODULE  pin_strip_1
$EndLIBRARY
