PCBNEW-LibModule-V1  29.5.2012 8:39:25
# encoding utf-8
$INDEX
SMA
$EndINDEX
$MODULE SMA
Po 0 0 0 15 4FC46EBC 00000000 ~~
Li SMA
Kw SMA Connector
Sc 00000000
AR SMA
Op 0 0 0
T0 0 2000 394 394 0 79 N V 21 N "SMA"
T1 0 2559 394 394 0 79 N I 21 N "Value"
DS 1047 -4589 1047 -4961 150 21
DS -1047 -4589 -1047 -4961 150 21
DS -1047 -1240 -1047 -2728 150 21
DS 1047 -1240 1047 -2728 150 21
DS -1257 -4465 105 -4589 150 21
DS 1257 -2976 -1047 -2728 150 21
DS -1257 -2976 1257 -3224 150 21
DS -1257 -3224 1257 -3472 150 21
DS -1257 -3472 1257 -3720 150 21
DS -1257 -3720 1257 -3969 150 21
DS -1257 -3969 1257 -4217 150 21
DS -1257 -4217 1257 -4465 150 21
DS -1257 -4465 -1047 -4589 150 21
DS -1047 -4589 1047 -4589 150 21
DS 1047 -4589 1257 -4465 150 21
DS 1257 -4465 1257 -2852 150 21
DS 1257 -2852 1047 -2728 150 21
DS 1047 -2728 -1047 -2728 150 21
DS -1047 -2728 -1257 -2852 150 21
DS -1257 -2852 -1257 -4465 150 21
DS 1047 -4961 -1047 -4961 150 21
DS -1240 -1240 1240 -1240 150 21
DS 1240 -1240 1240 1240 150 21
DS 1240 1240 -1240 1240 150 21
DS -1240 1240 -1240 -1240 150 21
$PAD
Sh "1" C 787 787 0 0 0
Dr 394 0 0
At STD N 00E0FFFF
Ne 0 ""
Po 0 0
$EndPAD
$PAD
Sh "3" C 787 787 0 0 0
Dr 394 0 0
At STD N 00E0FFFF
Ne 0 ""
Po 1063 -1063
$EndPAD
$PAD
Sh "2" C 787 787 0 0 0
Dr 394 0 0
At STD N 00E0FFFF
Ne 0 ""
Po -1063 -1063
$EndPAD
$PAD
Sh "5" C 787 787 0 0 0
Dr 394 0 0
At STD N 00E0FFFF
Ne 0 ""
Po -1063 1063
$EndPAD
$PAD
Sh "4" C 787 787 0 0 0
Dr 394 0 0
At STD N 00E0FFFF
Ne 0 ""
Po 1063 1063
$EndPAD
$SHAPE3D
Na "connectors/sma.wrl"
Sc 0.390000 0.390000 0.390000
Of 0.000000 0.000000 0.000000
Ro -90.000000 0.000000 -90.000000
$EndSHAPE3D
$SHAPE3D
Na "connectors\\BNC\\sma.wrl"
Sc 0.390000 0.390000 0.390000
Of 0.000000 0.000000 0.000000
Ro -90.000000 0.000000 -90.000000
$EndSHAPE3D
$EndMODULE  SMA
$EndLIBRARY
