PCBNEW-LibModule-V1  So 8. prosinec 2012, 18:25:01 CET
# encoding utf-8
Units deci-mils
$INDEX
LED-0603
LED-0805
LED-1206
LED-3MM
LED-5MM
LED-8MM
$EndINDEX
$MODULE LED-0603
Po 0 0 0 15 4E16AFB4 00000000 ~~
Li LED-0603
Cd LED 0603 smd package
Kw LED led 0603 SMD smd SMT smt smdled SMDLED smtled SMTLED
Sc 0
AR 
Op 0 0 0
At SMD
T0 0 -400 200 200 0 50 N V 21 N "LED-0603"
T1 0 400 200 200 0 50 N V 21 N "VAL***"
DS 177 -177 177 177 26 21
DS 177 177 334 177 26 21
DS 334 -177 334 177 26 21
DS 177 -177 334 -177 26 21
DS -334 -177 -334 177 26 21
DS -334 177 -177 177 26 21
DS -177 -177 -177 177 26 21
DS -334 -177 -177 -177 26 21
DS 0 -177 0 -118 26 21
DS 0 -118 118 -118 26 21
DS 118 -177 118 -118 26 21
DS 0 -177 118 -177 26 21
DS 0 118 0 177 26 21
DS 0 177 118 177 26 21
DS 118 118 118 177 26 21
DS 0 118 118 118 26 21
DS 0 -59 0 59 26 21
DS 0 59 118 59 26 21
DS 118 -59 118 59 26 21
DS 0 -59 118 -59 26 21
DS 177 -157 -177 -157 40 21
DS 177 157 -177 157 40 21
$PAD
Sh "1" R 314 314 0 0 0
Dr 0 0 0
At SMD N 00888000
Ne 0 ""
Po -295 0
$EndPAD
$PAD
Sh "2" R 314 314 0 0 0
Dr 0 0 0
At SMD N 00888000
Ne 0 ""
Po 295 0
$EndPAD
$EndMODULE LED-0603
$MODULE LED-0805
Po 0 0 0 15 49DC4C0B 00000000 ~~
Li LED-0805
Cd LED 0805 smd package
Kw LED 0805 SMD
Sc 0
AR 
Op 0 0 0
At SMD
T0 0 -500 300 300 0 50 N V 21 N "LED-0805"
T1 0 500 300 300 0 50 N V 21 N "Val*"
DS 196 118 196 246 26 21
DS 196 246 393 246 26 21
DS 393 118 393 246 26 21
DS 196 118 393 118 26 21
DS 196 -127 196 -68 26 21
DS 196 -68 295 -68 26 21
DS 295 -127 295 -68 26 21
DS 196 -127 295 -127 26 21
DS 196 68 196 127 26 21
DS 196 127 295 127 26 21
DS 295 68 295 127 26 21
DS 196 68 295 68 26 21
DS 196 -78 196 78 26 21
DS 196 78 265 78 26 21
DS 265 -78 265 78 26 21
DS 196 -78 265 -78 26 21
DS -393 118 -393 246 26 21
DS -393 246 -196 246 26 21
DS -196 118 -196 246 26 21
DS -393 118 -196 118 26 21
DS -393 -246 -393 -118 26 21
DS -393 -118 -196 -118 26 21
DS -196 -246 -196 -118 26 21
DS -393 -246 -196 -246 26 21
DS -295 68 -295 127 26 21
DS -295 127 -196 127 26 21
DS -196 68 -196 127 26 21
DS -295 68 -196 68 26 21
DS -295 -127 -295 -68 26 21
DS -295 -68 -196 -68 26 21
DS -196 -127 -196 -68 26 21
DS -295 -127 -196 -127 26 21
DS -265 -78 -265 78 26 21
DS -265 78 -196 78 26 21
DS -196 -78 -196 78 26 21
DS -265 -78 -196 -78 26 21
DS 0 -39 0 39 26 21
DS 0 39 78 39 26 21
DS 78 -39 78 39 26 21
DS 0 -39 78 -39 26 21
DS 196 -236 196 -118 26 21
DS 196 -118 314 -118 26 21
DS 314 -236 314 -118 26 21
DS 196 -236 314 -236 26 21
DS 364 -246 364 -157 26 21
DS 364 -157 393 -157 26 21
DS 393 -246 393 -157 26 21
DS 364 -246 393 -246 26 21
DS 206 226 -206 226 40 21
DS -196 -226 364 -226 40 21
DC 334 -177 354 -197 20 21
DA 393 0 393 137 1800 40 21
DA -393 0 -393 -137 1800 40 21
$PAD
Sh "1" R 472 472 0 0 0
Dr 0 0 0
At SMD N 00888000
Ne 0 ""
Po -413 0
$EndPAD
$PAD
Sh "2" R 472 472 0 0 0
Dr 0 0 0
At SMD N 00888000
Ne 0 ""
Po 413 0
$EndPAD
$EndMODULE LED-0805
$MODULE LED-1206
Po 0 0 0 15 50C37796 00000000 ~~
Li LED-1206
Cd LED 1206 smd package
Kw LED1206 SMD
Sc 0
AR 
Op 0 0 0
At SMD
T0 0 -827 394 394 0 79 N V 21 N "LED-1206"
T1 0 906 394 394 0 79 N I 21 N "Value"
T2 1299 0 392 392 0 77 N V 21 N "C"
T2 -1339 0 392 392 0 77 N V 21 N "A"
DS 118 -236 118 236 79 21
DS 118 0 -118 236 79 21
DS -118 236 -118 -236 79 21
DS 118 0 -118 -236 79 21
DS -1024 -512 1024 -512 79 21
DS 1024 -512 1024 512 79 21
DS 1024 512 -1024 512 79 21
DS -1024 512 -1024 -512 79 21
$PAD
Sh "1" R 629 709 0 0 0
Dr 0 0 0
At SMD N 00888000
Ne 0 ""
Po -559 0
$EndPAD
$PAD
Sh "2" R 629 709 0 0 0
Dr 0 0 0
At SMD N 00888000
Ne 0 ""
Po 559 0
$EndPAD
$SHAPE3D
Na "LED/LED1206.wrl"
Sc 1 1 1
Of 0 0 0
Ro 0 0 0
$EndSHAPE3D
$EndMODULE LED-1206
$MODULE LED-3MM
Po 0 0 0 15 49BFA23B 00000000 ~~
Li LED-3MM
Cd LED 3mm - Lead pitch 100mil (2,54mm)
Kw LED led 3mm 3MM 100mil 2,54mm
Sc 0
AR 
Op 0 0 0
T0 700 -1100 300 300 0 35 N V 21 N "LED-3MM"
T1 0 1000 300 300 0 35 N V 21 N "VAL***"
DS 720 500 720 -500 100 21
DA 100 0 -500 0 398 60 21
DA 100 0 -348 398 416 60 21
DA 100 0 555 -390 406 60 21
DA 100 0 700 0 398 60 21
DA 100 0 100 -600 544 60 21
DA 100 0 -380 -360 531 60 21
DA 100 0 573 368 521 60 21
DA 100 0 100 600 521 60 21
DA 100 0 -150 0 900 60 21
DA 100 0 -300 0 900 60 21
DA 100 0 350 0 900 60 21
DA 100 0 500 0 900 60 21
DA 100 0 100 -800 501 100 21
DA 100 0 -605 -376 619 100 21
DA 100 0 710 516 497 100 21
DA 100 0 100 800 602 100 21
DA 100 0 -700 0 283 100 21
DA 100 0 -581 419 316 100 21
$PAD
Sh "1" C 660 660 0 0 0
Dr 320 0 0
At STD N 00A8FFFF
Ne 0 ""
Po -500 0
$EndPAD
$PAD
Sh "2" C 660 660 0 0 0
Dr 320 0 0
At STD N 00A8FFFF
Ne 0 ""
Po 500 0
$EndPAD
$SHAPE3D
Na "discret/leds/led3_vertical_verde.wrl"
Sc 1 1 1
Of 0 0 0
Ro 0 0 0
$EndSHAPE3D
$EndMODULE LED-3MM
$MODULE LED-5MM
Po 0 0 0 15 49BFA269 00000000 ~~
Li LED-5MM
Cd LED 5mm - Lead pitch 100mil (2,54mm)
Kw LED led 5mm 5MM 100mil 2,54mm
Sc 0
AR 
Op 0 0 0
T0 0 -1500 300 300 0 35 N V 21 N "LED-5MM"
T1 0 1500 300 300 0 35 N V 21 N "VAL***"
DS 1120 750 1120 -750 80 21
DC 100 0 -400 500 30 21
DA 100 0 1100 750 2862 100 21
DA 100 0 -350 0 900 60 21
DA 100 0 550 0 900 60 21
DA 100 0 -550 0 900 60 21
DA 100 0 750 0 900 60 21
DA 100 0 -750 0 900 60 21
DA 100 0 950 0 900 60 21
$PAD
Sh "1" C 660 660 0 0 0
Dr 320 0 0
At STD N 00A8FFFF
Ne 0 ""
Po -500 0
$EndPAD
$PAD
Sh "2" C 660 660 0 0 0
Dr 320 0 0
At STD N 00A8FFFF
Ne 0 ""
Po 500 0
$EndPAD
$SHAPE3D
Na "discret/leds/led5_vertical_verde.wrl"
Sc 1 1 1
Of 0 0 0
Ro 0 0 0
$EndSHAPE3D
$EndMODULE LED-5MM
$MODULE LED-8MM
Po 0 0 0 15 4C61250C 00000000 ~~
Li LED-8MM
Cd LED 8mm - Lead pitch 100mil (2,54mm)
Kw LED led 5mm 5MM 100mil 2,54mm
Sc 0
AR 
Op 0 0 0
T0 0 -2000 300 300 0 35 N V 21 N "LED-8MM"
T1 250 2000 300 300 0 35 N V 21 N "VAL***"
DC 0 0 500 1000 100 21
DS 1500 -1000 1500 1000 100 21
DS 1250 1250 1500 1000 100 21
DS 1250 -1250 1500 -1000 100 21
DA 0 0 1250 1250 900 100 21
DA 0 0 -1250 -1250 900 100 21
DA 0 0 0 1750 900 100 21
DA 0 0 -1750 0 900 100 21
$PAD
Sh "1" C 660 660 0 0 0
Dr 320 0 0
At STD N 00A8FFFF
Ne 0 ""
Po -500 0
$EndPAD
$PAD
Sh "2" C 660 660 0 0 0
Dr 320 0 0
At STD N 00A8FFFF
Ne 0 ""
Po 500 0
$EndPAD
$EndMODULE LED-8MM
$EndLIBRARY
