(module Symbol:Symbol_HighVoltage_Type2_CopperTop_VerySmall (layer F.Cu) (tedit 5C43921D)
  (descr "Symbol, High Voltage, Type 2, Copper Top, Very Small,")
  (tags "Symbol, High Voltage, Type 2, Copper Top, Very Small,")
  (attr virtual)
  (fp_text reference REF** (at -0.127 -5.715) (layer F.SilkS)
    (effects (font (size 1 1) (thickness 0.15)))
  )
  (fp_text value Symbol_HighVoltage_Type2_CopperTop_VerySmall (at -0.381 4.572) (layer F.Fab)
    (effects (font (size 1 1) (thickness 0.15)))
  )
  (fp_line (start -0.49784 2.19964) (end 0.70104 -0.89916) (layer F.SilkS) (width 0.381))
  (fp_line (start 0.70104 -0.89916) (end 0.1016 -0.50038) (layer F.SilkS) (width 0.381))
  (fp_line (start -0.89916 0.20066) (end 0.40132 -2.60096) (layer F.SilkS) (width 0.381))
  (fp_line (start -0.49784 2.19964) (end 0.1016 1.50114) (layer F.SilkS) (width 0.381))
  (fp_line (start -0.09906 -2.79908) (end -0.89916 0.20066) (layer F.SilkS) (width 0.381))
  (fp_line (start -0.89916 0.20066) (end 0.29972 -0.59944) (layer F.SilkS) (width 0.381))
  (fp_line (start 0.29972 -0.59944) (end -0.49784 2.19964) (layer F.SilkS) (width 0.381))
  (fp_line (start -0.49784 2.19964) (end -0.59944 1.30048) (layer F.SilkS) (width 0.381))
  (fp_line (start 0 -4.191) (end 4.699 2.794) (layer F.SilkS) (width 0.381))
  (fp_line (start 4.699 2.794) (end -4.699 2.794) (layer F.SilkS) (width 0.381))
  (fp_line (start -4.699 2.794) (end 0 -4.191) (layer F.SilkS) (width 0.381))
)
