PCBNEW-LibModule-V1  St 27. březen 2013, 17:45:53 CET
# encoding utf-8
Units mm
$INDEX
BUZ3-5
C1
C1-1
C1.5V8H
C1.5V8V
C1V5
C1V5H
C1V7
C1V7H
C1V8
C2
C2V10
C2V8
CP10
CP12
CP14
CP16
CP18
CP20
CP36V
CP4
CP5
CP6
CP8
CPR10X16
CR1220
CR2032H
CR2032V
CV3-30PF
CVAR3X2
D3
D4
D5
D6
D6.5
DO-35
DO-41
EMI_FILTER
FUSE5-20
HC-18UH
HC-18UV
HC-33UH
HC-33UV
HC-49V
INDUCTOR_V
KSA
LCD4
LEDV
LM16255
LM2931
LM78LXX
LM78XX
LM78XX-TO92
LM78XXV
LM79LXX
LM79XX
MICROSWITCH_SPST
MICROSWITCH_SPST_H
MIRE
OSC_DIP8
PUSH_BUTT_SHAPE1
QMONTRE
R1
R3
R3-5
R3-LARGE_PADS
R4
R4-5
R4-LARGE_PADS
R5
R6
R7
RV2
RV2X4
SELF1408
SELF1418
SUBCLICK
SUPER_CAP
SWDIP4
SWDIP8
SW_PUSH
SW_PUSH-12mm
SW_PUSH_SMALL
SW_SPDT
TEST_POINT_2PADS
TO18CBE
TO18EBC
TO18GSD
TO220
TO220GDS
TO220_VERT
TO3
TO39EBC
TO92
TO92-123
TO92-CBE
TO92-EBC
TO92-INVERT
TO92DGS
TO92GSD
TO92H
TO92_INVERT_H
VP0808
microswitch_Nikkai
r_pack8
r_pack9
swdip3
$EndINDEX
$MODULE BUZ3-5
Po 0 0 0 15 4C5ED5E7 00000000 ~~
Li BUZ3-5
Sc 0
AR 
Op 0 0 0
T0 -0.508 -3.048 1.524 1.524 0 0.3048 N V 21 N "BUZ3-5"
T1 0 3.302 1.524 1.524 0 0.3048 N V 21 N "VAL**"
DC 0 0 -6.35 0 0.3175 21
$PAD
Sh "1" R 1.4224 1.4224 0 0 0
Dr 0.8128 0 0
At STD N 00E0FFFF
Ne 0 ""
Po -3.81 0
$EndPAD
$PAD
Sh "2" C 1.4224 1.4224 0 0 0
Dr 0.8128 0 0
At STD N 00E0FFFF
Ne 0 ""
Po 3.81 0
$EndPAD
$EndMODULE BUZ3-5
$MODULE C1
Po 0 0 0 15 3F92C496 00000000 ~~
Li C1
Cd Condensateur e = 1 pas
Kw C
Sc 0
AR 
Op 0 0 0
T0 0.254 -2.286 1.016 1.016 0 0.2032 N V 21 N "C1"
T1 0 -2.286 1.016 1.016 0 0.2032 N I 21 N "V***"
DS -2.4892 -1.27 2.54 -1.27 0.3048 21
DS 2.54 -1.27 2.54 1.27 0.3048 21
DS 2.54 1.27 -2.54 1.27 0.3048 21
DS -2.54 1.27 -2.54 -1.27 0.3048 21
DS -2.54 -0.635 -1.905 -1.27 0.3048 21
$PAD
Sh "1" C 1.397 1.397 0 0 0
Dr 0.8128 0 0
At STD N 00E0FFFF
Ne 0 ""
Po -1.27 0
$EndPAD
$PAD
Sh "2" C 1.397 1.397 0 0 0
Dr 0.8128 0 0
At STD N 00E0FFFF
Ne 0 ""
Po 1.27 0
$EndPAD
$SHAPE3D
Na "discret/capa_1_pas.wrl"
Sc 1 1 1
Of 0 0 0
Ro 0 0 0
$EndSHAPE3D
$EndMODULE C1
$MODULE C1-1
Po 0 0 0 15 00200000 00000000 ~~
Li C1-1
Cd Condensateur e = 1 ou 2 pas
Kw C
Sc 0
AR 
Op 0 0 0
T0 0 2.032 1.016 1.016 0 0.2032 N V 21 N "C1-1"
T1 0 2.032 1.016 1.016 0 0.2032 N I 21 N "C***"
DS -3.556 -1.016 3.556 -1.016 0.3048 21
DS 3.556 -1.016 3.556 1.016 0.3048 21
DS 3.556 1.016 -3.556 1.016 0.3048 21
DS -3.556 1.016 -3.556 -1.016 0.3048 21
DS -3.556 -0.508 -3.048 -1.016 0.3048 21
$PAD
Sh "1" C 1.397 1.397 0 0 0
Dr 0.8128 0 0
At STD N 00E0FFFF
Ne 0 ""
Po -2.54 0
$EndPAD
$PAD
Sh "2" C 1.397 1.397 0 0 0
Dr 0.8128 0 0
At STD N 00E0FFFF
Ne 0 ""
Po 2.54 0
$EndPAD
$PAD
Sh "2" C 1.397 1.397 0 0 0
Dr 0.8128 0 0
At STD N 00E0FFFF
Ne 0 ""
Po 0 0
$EndPAD
$SHAPE3D
Na "discret/capa_2pas_5x5mm.wrl"
Sc 1 1 1
Of 0 0 0
Ro 0 0 0
$EndSHAPE3D
$EndMODULE C1-1
$MODULE C1.5V8H
Po 0 0 0 15 41AF2D97 00000000 ~~
Li C1.5V8H
Sc 0
AR 
Op 0 0 0
T0 0.381 6.985 1.016 1.016 0 0.2032 N V 21 N "C1.5V8H"
T1 0.127 11.684 1.016 1.016 0 0.2032 N V 21 N "VAL**"
T2 1.905 3.683 1.524 1.524 0 0.3048 N V 21 N "+"
DS -4.064 15.24 4.064 15.24 0.381 21
DS 4.064 2.54 -4.064 2.54 0.381 21
DS -4.064 2.54 -4.064 15.24 0.381 21
DS 4.064 2.54 4.064 15.24 0.381 21
DS -1.905 0 -1.905 2.54 0.381 21
DS 1.905 0 1.905 2.54 0.381 21
$PAD
Sh "1" R 1.651 1.651 0 0 0
Dr 0.8128 0 0
At STD N 00E0FFFF
Ne 0 ""
Po 1.905 0
$EndPAD
$PAD
Sh "2" C 1.651 1.651 0 0 0
Dr 0.8128 0 0
At STD N 00E0FFFF
Ne 0 ""
Po -1.905 0
$EndPAD
$SHAPE3D
Na "discret/c_horiz_c1v7.wrl"
Sc 1.5 1.5 1.5
Of 0 0 0
Ro 0 0 0
$EndSHAPE3D
$EndMODULE C1.5V8H
$MODULE C1.5V8V
Po 0 0 0 15 4512B232 00000000 ~~
Li C1.5V8V
Sc 0
AR 
Op 0 0 0
T0 0 2.286 1.016 1.016 0 0.2032 N V 21 N "C1.5V8V"
T1 0 -2.286 1.016 1.016 0 0.2032 N V 21 N "V***"
T2 -3.429 -0.127 1.524 1.524 0 0.3048 N V 21 N "+"
DC 0 0 0 4.445 0.381 21
$PAD
Sh "1" R 1.397 1.397 0 0 0
Dr 0.8128 0 0
At STD N 00E0FFFF
Ne 0 ""
Po -1.905 0
$EndPAD
$PAD
Sh "2" C 1.397 1.397 0 0 0
Dr 0.8128 0 0
At STD N 00E0FFFF
Ne 0 ""
Po 1.905 0
$EndPAD
$SHAPE3D
Na "discret/c_vert_c1v8.wrl"
Sc 1.5 1.5 1
Of 0 0 0
Ro 0 0 0
$EndSHAPE3D
$EndMODULE C1.5V8V
$MODULE C1V5
Po 0 0 0 15 3E070CF4 00000000 ~~
Li C1V5
Cd Condensateur e = 1 pas
Kw C
Sc 0
AR 
Op 0 0 0
T0 0 -1.26746 0.762 0.762 0 0.127 N V 21 N "C1V5"
T1 0 1.27 0.762 0.635 0 0.127 N V 21 N "C***"
T2 -2.286 0 0.762 0.762 0 0.2032 N V 21 N "+"
DC 0 0 0.127 -2.54 0.127 21
$PAD
Sh "1" R 1.397 1.397 0 0 0
Dr 0.8128 0 0
At STD N 00E0FFFF
Ne 0 ""
Po -1.27 0
$EndPAD
$PAD
Sh "2" C 1.397 1.397 0 0 0
Dr 0.8128 0 0
At STD N 00E0FFFF
Ne 0 ""
Po 1.27 0
$EndPAD
$SHAPE3D
Na "discret/c_vert_c1v5.wrl"
Sc 1 1 1
Of 0 0 0
Ro 0 0 0
$EndSHAPE3D
$EndMODULE C1V5
$MODULE C1V5H
Po 0 0 0 15 47FF7B42 00000000 ~~
Li C1V5H
Cd Condensateur e = 1 pas
Kw C
Sc 0
AR 
Op 0 0 0
T0 -1.27 7.62 0.889 0.889 900 0.127 N V 21 N "C1V5H"
T1 1.27 7.62 0.889 0.889 900 0.127 N V 21 N "C***"
DS -3.048 12.7 3.048 12.7 0.381 21
DS -3.048 1.27 3.048 1.27 0.381 21
DS -3.048 12.7 -3.048 1.27 0.381 21
DS 3.048 1.27 3.048 12.7 0.381 21
DS -1.27 0 -1.27 1.27 0.381 21
DS 1.27 0 1.27 1.27 0.381 21
T2 -1.27 2.54 0.762 0.762 0 0.2032 N V 21 N "+"
$PAD
Sh "1" R 1.397 1.397 0 0 0
Dr 0.8128 0 0
At STD N 00E0FFFF
Ne 0 ""
Po -1.27 0
$EndPAD
$PAD
Sh "2" C 1.397 1.397 0 0 0
Dr 0.8128 0 0
At STD N 00E0FFFF
Ne 0 ""
Po 1.27 0
$EndPAD
$SHAPE3D
Na "discret/c_horiz_c1v5.wrl"
Sc 1 1 1
Of 0 0 0
Ro 0 0 0
$EndSHAPE3D
$EndMODULE C1V5H
$MODULE C1V7
Po 0 0 0 15 00200000 00000000 ~~
Li C1V7
Sc 0
AR 
Op 0 0 0
T0 0 1.524 1.143 0.889 0 0.2032 N V 21 N "C1V7"
T1 0 -1.524 1.143 0.889 0 0.2032 N V 21 N "Val**"
T2 -2.54 0 1.143 1.143 0 0.3048 N V 21 N "+"
DC 0 0 3.175 0 0.127 21
$PAD
Sh "1" R 1.524 1.524 0 0 0
Dr 0.8128 0 0
At STD N 00E0FFFF
Ne 0 ""
Po -1.27 0
$EndPAD
$PAD
Sh "2" C 1.524 1.524 0 0 0
Dr 0.8128 0 0
At STD N 00E0FFFF
Ne 0 ""
Po 1.27 0
$EndPAD
$SHAPE3D
Na "discret/c_vert_c1v7.wrl"
Sc 1 1 1
Of 0 0 0
Ro 0 0 0
$EndSHAPE3D
$EndMODULE C1V7
$MODULE C1V7H
Po 0 0 0 15 3DD3A83D 00000000 ~~
Li C1V7H
Sc 0
AR 
Op 0 0 0
T0 -1.26746 7.62 1.524 0.8636 900 0.2032 N V 21 N "C1V7H"
T1 1.27 7.62 1.27 1.016 900 0.2032 N V 21 N "Val**"
T2 -1.524 2.667 1.524 1.524 0 0.3048 N V 21 N "+"
DS 3.81 1.905 -3.81 1.905 0.2032 21
DS -3.81 1.905 -3.81 12.7 0.2032 21
DS -3.81 12.7 3.81 12.7 0.2032 21
DS 3.81 12.7 3.81 1.905 0.2032 21
DS -1.27 0 -1.27 1.905 0.2032 21
DS 1.27 0 1.27 1.905 0.2032 21
$PAD
Sh "1" R 1.651 1.651 0 0 0
Dr 0.8128 0 0
At STD N 00E0FFFF
Ne 0 ""
Po -1.27 0
$EndPAD
$PAD
Sh "2" C 1.651 1.651 0 0 0
Dr 0.8128 0 0
At STD N 00E0FFFF
Ne 0 ""
Po 1.27 0
$EndPAD
$SHAPE3D
Na "discret/c_horiz_c1v7.wrl"
Sc 1 1 1
Of 0 0 0
Ro 0 0 0
$EndSHAPE3D
$EndMODULE C1V7H
$MODULE C1V8
Po 0 0 0 15 3DD3A719 00000000 ~~
Li C1V8
Sc 0
AR 
Op 0 0 0
T0 0 2.032 1.016 0.889 0 0.2032 N V 21 N "C1V8"
T1 0 -1.77546 1.016 0.889 0 0.2032 N V 21 N "Val**"
T2 -3.04546 0 1.524 1.524 0 0.2032 N V 21 N "+"
DC 0 0 4.064 0 0.2032 21
$PAD
Sh "1" R 1.651 1.651 0 0 0
Dr 0.8128 0 0
At STD N 00E0FFFF
Ne 0 ""
Po -1.27 0
$EndPAD
$PAD
Sh "2" C 1.651 1.651 0 0 0
Dr 0.8128 0 0
At STD N 00E0FFFF
Ne 0 ""
Po 1.27 0
$EndPAD
$SHAPE3D
Na "discret/c_vert_c1v8.wrl"
Sc 1 1 1
Of 0 0 0
Ro 0 0 0
$EndSHAPE3D
$EndMODULE C1V8
$MODULE C2
Po 0 0 0 15 00200000 00000000 ~~
Li C2
Cd Condensateur = 2 pas
Kw C
Sc 0
AR 
Op 0 0 0
T0 0 0 1.016 1.016 0 0.2032 N V 21 N "C2"
T1 0 0 1.016 1.016 0 0.2032 N I 21 N "C***"
DS -3.556 -1.016 3.556 -1.016 0.3048 21
DS 3.556 -1.016 3.556 1.016 0.3048 21
DS 3.556 1.016 -3.556 1.016 0.3048 21
DS -3.556 1.016 -3.556 -1.016 0.3048 21
DS -3.556 -0.508 -3.048 -1.016 0.3048 21
$PAD
Sh "1" C 1.397 1.397 0 0 0
Dr 0.8128 0 0
At STD N 00E0FFFF
Ne 0 ""
Po -2.54 0
$EndPAD
$PAD
Sh "2" C 1.397 1.397 0 0 0
Dr 0.8128 0 0
At STD N 00E0FFFF
Ne 0 ""
Po 2.54 0
$EndPAD
$SHAPE3D
Na "discret/capa_2pas_5x5mm.wrl"
Sc 1 1 1
Of 0 0 0
Ro 0 0 0
$EndSHAPE3D
$EndMODULE C2
$MODULE C2V10
Po 0 0 0 15 41854742 00000000 ~~
Li C2V10
Cd Condensateur polarise
Kw CP
Sc 0
AR 
Op 0 0 0
T0 0 2.54 1.27 1.27 0 0.254 N V 21 N "C2V10"
T1 0 -2.54 1.27 1.27 0 0.254 N V 21 N "C***"
DC 0 0 4.826 -2.794 0.3048 21
$PAD
Sh "1" R 1.778 1.778 0 0 0
Dr 1.016 0 0
At STD N 00E0FFFF
Ne 0 ""
Po -2.54 0
$EndPAD
$PAD
Sh "2" C 1.778 1.778 0 0 0
Dr 1.016 0 0
At STD N 00E0FFFF
Ne 0 ""
Po 2.54 0
$EndPAD
$SHAPE3D
Na "discret/c_vert_c2v10.wrl"
Sc 1 1 1
Of 0 0 0
Ro 0 0 0
$EndSHAPE3D
$EndMODULE C2V10
$MODULE C2V8
Po 0 0 0 15 46544AA3 00000000 ~~
Li C2V8
Cd Condensateur polarise
Kw CP
Sc 0
AR 
Op 0 0 0
T0 0 2.54 1.016 1.016 0 0.2032 N V 21 N "C2V8"
T1 0 -2.54 1.016 1.016 0 0.2032 N V 21 N "C***"
DC 0 0 -4.445 0 0.3048 21
$PAD
Sh "1" R 1.778 1.778 0 0 0
Dr 1.016 0 0
At STD N 00E0FFFF
Ne 0 ""
Po -2.54 0
$EndPAD
$PAD
Sh "2" C 1.778 1.778 0 0 0
Dr 1.016 0 0
At STD N 00E0FFFF
Ne 0 ""
Po 2.54 0
$EndPAD
$SHAPE3D
Na "discret/c_vert_c2v10.wrl"
Sc 1 1 1
Of 0 0 0
Ro 0 0 0
$EndSHAPE3D
$EndMODULE C2V8
$MODULE CP10
Po 0 0 0 15 00200000 00000000 ~~
Li CP10
Cd Condensateur polarise
Kw CP
Sc 0
AR 
Op 0 0 0
T0 2.54 1.27 1.524 1.524 0 0.3048 N V 21 N "CP10"
T1 -1.905 -1.27 1.524 1.524 0 0.3048 N V 21 N "C***"
DS 12.7 0 10.16 0 0.3048 21
DS 10.16 0 10.16 2.54 0.3048 21
DS 10.16 2.54 -7.62 2.54 0.3048 21
DS -7.62 2.54 -7.62 -2.54 0.3048 21
DS -7.62 -2.54 10.16 -2.54 0.3048 21
DS 10.16 -2.54 10.16 0 0.3048 21
DS -7.62 -1.27 -10.16 -1.27 0.3048 21
DS -10.16 -1.27 -10.16 1.27 0.3048 21
DS -10.16 1.27 -7.62 1.27 0.3048 21
DS -12.7 0 -10.16 0 0.3048 21
$PAD
Sh "2" C 1.778 1.778 0 0 0
Dr 0.8128 0 0
At STD N 00E0FFFF
Ne 0 ""
Po 12.7 0
$EndPAD
$PAD
Sh "1" R 1.778 1.778 0 0 0
Dr 0.8128 0 0
At STD N 00E0FFFF
Ne 0 ""
Po -12.7 0
$EndPAD
$SHAPE3D
Na "discret/c_pol.wrl"
Sc 1 1 1
Of 0 0 0
Ro 0 0 0
$EndSHAPE3D
$EndMODULE CP10
$MODULE CP12
Po 0 0 0 15 00200000 00000000 ~~
Li CP12
Cd Condensateur polarise
Kw CP
Sc 0
AR 
Op 0 0 0
T0 1.27 1.905 2.286 2.54 0 0.3048 N V 21 N "CP12"
T1 1.27 -1.905 2.286 1.6002 0 0.3048 N V 21 N "C***"
DS -15.24 0 -13.97 0 0.3048 21
DS -12.7 1.27 -13.97 1.27 0.3048 21
DS -13.97 1.27 -13.97 -1.27 0.3048 21
DS -13.97 -1.27 -12.7 -1.27 0.3048 21
DS -12.7 -3.81 13.97 -3.81 0.3048 21
DS 13.97 -3.81 13.97 3.81 0.3048 21
DS 13.97 3.81 -12.7 3.81 0.3048 21
DS 13.97 0 15.24 0 0.3048 21
DS -10.16 -3.81 -10.16 3.81 0.3048 21
DS -8.89 -3.81 -8.89 3.81 0.3048 21
DS -12.7 -3.81 -12.7 3.81 0.3048 21
$PAD
Sh "1" R 1.778 1.778 0 0 0
Dr 1.016 0 0
At STD N 00E0FFFF
Ne 0 ""
Po -15.24 0
$EndPAD
$PAD
Sh "2" C 1.778 1.778 0 0 0
Dr 1.016 0 0
At STD N 00E0FFFF
Ne 0 ""
Po 15.24 0
$EndPAD
$SHAPE3D
Na "discret/c_pol.wrl"
Sc 1.2 1.2 1.2
Of 0 0 0
Ro 0 0 0
$EndSHAPE3D
$EndMODULE CP12
$MODULE CP14
Po 0 0 0 15 00200000 00000000 ~~
Li CP14
Cd Condensateur polarise
Kw CP
Sc 0
AR 
Op 0 0 0
T0 -5.08 -2.54 2.58064 1.50114 0 0.3048 N V 21 N "C***"
T1 3.81 2.54 3.37566 2.87274 0 0.3048 N V 21 N "CP14"
DS 15.24 0 17.78 0 0.381 21
DS -13.97 -3.81 -12.7 -5.08 0.381 21
DS -12.7 -5.08 13.97 -5.08 0.381 21
DS 13.97 -5.08 15.24 -3.81 0.381 21
DS 15.24 -3.81 15.24 3.81 0.381 21
DS 15.24 3.81 13.97 5.08 0.381 21
DS 13.97 5.08 -12.7 5.08 0.381 21
DS -12.7 5.08 -13.97 3.81 0.381 21
DS -13.97 3.81 -13.97 -3.81 0.381 21
DS -10.16 5.08 -10.16 -5.08 0.381 21
DS -13.97 -1.27 -15.24 -1.27 0.381 21
DS -15.24 -1.27 -15.24 1.27 0.381 21
DS -15.24 1.27 -13.97 1.27 0.381 21
DS -15.24 0 -17.78 0 0.381 21
DS -11.43 5.08 -11.43 -5.08 0.381 21
$PAD
Sh "1" R 3.048 3.048 0 0 0
Dr 1.27 0 0
At STD N 00F0FFFF
Ne 0 ""
Po -17.78 0
$EndPAD
$PAD
Sh "2" C 3.048 3.048 0 0 0
Dr 1.27 0 0
At STD N 00F0FFFF
Ne 0 ""
Po 17.78 0
$EndPAD
$SHAPE3D
Na "discret/c_pol.wrl"
Sc 1.4 1.4 1.4
Of 0 0 0
Ro 0 0 0
$EndSHAPE3D
$EndMODULE CP14
$MODULE CP16
Po 0 0 0 15 00200000 00000000 ~~
Li CP16
Cd Condensateur polarise
Kw CP
Sc 0
AR 
Op 0 0 0
T0 -5.08 -3.81 3.13944 1.81864 0 0.3048 N V 21 N "C***"
T1 3.81 2.54 2.5527 3.2004 0 0.3048 N V 21 N "CP16"
DS -15.24 2.54 -15.24 -6.35 0.381 21
DS 16.51 5.08 16.51 -6.35 0.381 21
DS 16.51 -6.35 15.24 -7.62 0.381 21
DS 15.24 -7.62 -13.97 -7.62 0.381 21
DS 16.51 5.08 16.51 6.35 0.381 21
DS 16.51 6.35 15.24 7.62 0.381 21
DS 15.24 7.62 -13.97 7.62 0.381 21
DS -13.97 7.62 -15.24 6.35 0.381 21
DS -15.24 6.35 -15.24 2.54 0.381 21
DS -17.78 0 -20.32 0 0.381 21
DS 20.32 0 16.51 0 0.381 21
DS -12.7 7.62 -12.7 -7.62 0.381 21
DS -11.43 7.62 -11.43 -7.62 0.381 21
DS -15.24 -1.27 -17.78 -1.27 0.381 21
DS -17.78 -1.27 -17.78 1.27 0.381 21
DS -17.78 1.27 -15.24 1.27 0.381 21
DS -15.24 -6.35 -13.97 -7.62 0.381 21
$PAD
Sh "1" R 3.556 3.556 0 0 0
Dr 1.524 0 0
At STD N 00F0FFFF
Ne 0 ""
Po -20.32 0
$EndPAD
$PAD
Sh "2" C 3.556 3.556 0 0 0
Dr 1.524 0 0
At STD N 00F0FFFF
Ne 0 ""
Po 20.32 0
$EndPAD
$SHAPE3D
Na "discret/c_pol.wrl"
Sc 1.6 1.6 1.6
Of 0 0 0
Ro 0 0 0
$EndSHAPE3D
$EndMODULE CP16
$MODULE CP18
Po 0 0 0 15 00200000 00000000 ~~
Li CP18
Cd Condensateur polarise
Kw CP
Sc 0
AR 
Op 0 0 0
T0 -6.35 -5.08 3.08864 1.75768 0 0.3048 N V 21 N "C***"
T1 0 3.81 2.88544 3.41376 0 0.3048 N V 21 N "CP18"
DS -17.78 -7.62 -16.51 -8.89 0.3048 21
DS -16.51 -8.89 17.78 -8.89 0.3048 21
DS 17.78 -8.89 19.05 -7.62 0.3048 21
DS 19.05 -7.62 19.05 7.62 0.3048 21
DS 19.05 7.62 17.78 8.89 0.3048 21
DS 17.78 8.89 -16.51 8.89 0.3048 21
DS -16.51 8.89 -17.78 7.62 0.3048 21
DS -20.32 0 -22.86 0 0.3048 21
DS 19.05 0 22.86 0 0.3048 21
DS -17.78 -1.27 -20.32 -1.27 0.3048 21
DS -20.32 -1.27 -20.32 1.27 0.3048 21
DS -20.32 1.27 -17.78 1.27 0.3048 21
DS -17.78 -7.62 -17.78 7.62 0.3048 21
DS -15.24 -8.89 -15.24 8.89 0.3048 21
DS -13.97 -8.89 -13.97 8.89 0.3048 21
$PAD
Sh "1" R 3.556 3.556 0 0 0
Dr 1.524 0 0
At STD N 00E0FFFF
Ne 0 ""
Po -22.86 0
$EndPAD
$PAD
Sh "2" C 3.556 3.556 0 0 0
Dr 1.524 0 0
At STD N 00E0FFFF
Ne 0 ""
Po 22.86 0
$EndPAD
$SHAPE3D
Na "discret/c_pol.wrl"
Sc 1.8 1.8 1.8
Of 0 0 0
Ro 0 0 0
$EndSHAPE3D
$EndMODULE CP18
$MODULE CP20
Po 0 0 0 15 00200000 00000000 ~~
Li CP20
Cd Condenstateur polarise
Kw CP
Sc 0
AR 
Op 0 0 0
T0 -8.89 -7.62 3.16738 1.6256 0 0.3048 N V 21 N "C***"
T1 8.89 3.81 3.57632 3.29692 0 0.3048 N V 21 N "CP20"
DS -25.4 0 -20.32 0 0.3048 21
DS 25.4 0 20.32 0 0.3048 21
DS 20.32 0 20.32 -11.43 0.3048 21
DS 20.32 -11.43 -20.32 -11.43 0.3048 21
DS -20.32 -11.43 -20.32 11.43 0.3048 21
DS -20.32 11.43 20.32 11.43 0.3048 21
DS 20.32 11.43 20.32 0 0.3048 21
DS -16.51 -11.43 -16.51 11.43 0.3048 21
DS -15.24 11.43 -15.24 -11.43 0.3048 21
$PAD
Sh "1" R 3.556 3.556 0 0 0
Dr 1.524 0 0
At STD N 00F0FFFF
Ne 0 ""
Po -25.4 0
$EndPAD
$PAD
Sh "2" C 3.556 3.556 0 0 0
Dr 1.524 0 0
At STD N 00F0FFFF
Ne 0 ""
Po 25.4 0
$EndPAD
$SHAPE3D
Na "discret/c_pol.wrl"
Sc 2 2 2
Of 0 0 0
Ro 0 0 0
$EndSHAPE3D
$EndMODULE CP20
$MODULE CP36V
Po 0 0 0 15 3F94E337 00000000 ~~
Li CP36V
Cd Condensateur polarise vertical
Kw CP
Sc 0
AR 
Op 0 0 0
T0 0 -15.24 3.12166 2.0447 0 0.3048 N V 21 N "C***"
T1 1.27 15.24 3.16992 2.70764 0 0.3048 N V 21 N "CP36"
DC 0 0 19.05 1.905 0.381 21
$PAD
Sh "2" C 10.16 10.16 0 0 0
Dr 4.064 0 0
At STD N 00E0FFFF
Ne 0 ""
Po 6.35 0
$EndPAD
$PAD
Sh "1" R 10.16 10.16 0 0 0
Dr 4.064 0 0
At STD N 00E0FFFF
Ne 0 ""
Po -6.35 0
$EndPAD
$SHAPE3D
Na "discret/c_vert_big.wrl"
Sc 1 1 1
Of 0 0 0
Ro 0 0 0
$EndSHAPE3D
$EndMODULE CP36V
$MODULE CP4
Po 0 0 0 15 00200000 00000000 ~~
Li CP4
Cd Condensateur polarise
Kw CP
Sc 0
AR 
Op 0 0 0
T0 0.508 0 1.27 1.397 0 0.254 N V 21 N "CP4"
T1 0.508 0 1.27 1.143 0 0.254 N I 21 N "C***"
DS 5.08 0 4.064 0 0.3048 21
DS 4.064 0 4.064 1.016 0.3048 21
DS 4.064 1.016 -3.556 1.016 0.3048 21
DS -3.556 1.016 -3.556 -1.016 0.3048 21
DS -3.556 -1.016 4.064 -1.016 0.3048 21
DS 4.064 -1.016 4.064 0 0.3048 21
DS -5.08 0 -4.064 0 0.3048 21
DS -3.556 0.508 -4.064 0.508 0.3048 21
DS -4.064 0.508 -4.064 -0.508 0.3048 21
DS -4.064 -0.508 -3.556 -0.508 0.3048 21
$PAD
Sh "1" R 1.397 1.397 0 0 0
Dr 0.8128 0 0
At STD N 00E0FFFF
Ne 0 ""
Po -5.08 0
$EndPAD
$PAD
Sh "2" C 1.397 1.397 0 0 0
Dr 0.8128 0 0
At STD N 00E0FFFF
Ne 0 ""
Po 5.08 0
$EndPAD
$SHAPE3D
Na "discret/c_pol.wrl"
Sc 0.4 0.4 0.4
Of 0 0 0
Ro 0 0 0
$EndSHAPE3D
$EndMODULE CP4
$MODULE CP5
Po 0 0 0 15 00200000 00000000 ~~
Li CP5
Cd Condensateur polarise
Kw CP
Sc 0
AR 
Op 0 0 0
T0 0 0 1.524 1.524 0 0.3048 N V 21 N "CP5"
T1 0 0 1.524 1.3335 0 0.3048 N I 21 N "C***"
DS -4.445 -1.27 -4.445 -1.27 0.3048 21
DS -4.445 -1.27 -4.445 -1.27 0.3048 21
DS -4.445 -1.27 -4.445 -1.27 0.3048 21
DS -4.445 -1.27 5.08 -1.27 0.3048 21
DS 5.08 -1.27 5.08 1.27 0.3048 21
DS 5.08 1.27 -4.445 1.27 0.3048 21
DS -4.445 1.27 -4.445 -1.27 0.3048 21
DS -4.445 -0.635 -4.445 -0.635 0.3048 21
DS -4.445 -0.635 -5.08 -0.635 0.3048 21
DS -5.08 -0.635 -5.08 0.635 0.3048 21
DS -5.08 0.635 -4.445 0.635 0.3048 21
DS -6.35 0 -6.35 0 0.3048 21
DS -6.35 0 -5.08 0 0.3048 21
DS -5.08 0 -5.08 0 0.3048 21
DS -5.08 0 -5.08 0 0.3048 21
DS 5.08 0 5.08 0 0.3048 21
DS 5.08 0 5.08 0 0.3048 21
DS 5.08 0 6.35 0 0.3048 21
DS 6.35 0 6.35 0 0.3048 21
DS 6.35 0 6.35 0 0.3048 21
DS 6.35 0 6.35 0 0.3048 21
$PAD
Sh "1" R 1.397 1.397 0 0 0
Dr 0.8128 0 0
At STD N 00E0FFFF
Ne 0 ""
Po -6.35 0
$EndPAD
$PAD
Sh "2" C 1.397 1.397 0 0 0
Dr 0.8128 0 0
At STD N 00E0FFFF
Ne 0 ""
Po 6.35 0
$EndPAD
$SHAPE3D
Na "discret/c_pol.wrl"
Sc 0.5 0.5 0.5
Of 0 0 0
Ro 0 0 0
$EndSHAPE3D
$EndMODULE CP5
$MODULE CP6
Po 0 0 0 15 00200000 00000000 ~~
Li CP6
Cd Condensateur polarise
Kw CP
Sc 0
AR 
Op 0 0 0
T0 0 0 1.524 1.524 0 0.3048 N V 21 N "CP6"
T1 0.635 0 1.524 1.524 0 0.3048 N I 21 N "C***"
DS -7.62 0 -6.604 0 0.3048 21
DS -6.096 0.508 -6.604 0.508 0.3048 21
DS -6.604 0.508 -6.604 -0.508 0.3048 21
DS -6.604 -0.508 -6.096 -0.508 0.3048 21
DS 7.62 0 6.604 0 0.3048 21
DS 6.604 0 6.604 -1.524 0.3048 21
DS 6.604 -1.524 -6.096 -1.524 0.3048 21
DS -6.096 -1.524 -6.096 1.524 0.3048 21
DS -6.096 1.524 6.604 1.524 0.3048 21
DS 6.604 1.524 6.604 0 0.3048 21
$PAD
Sh "1" R 1.397 1.397 0 0 0
Dr 0.8128 0 0
At STD N 00E0FFFF
Ne 0 ""
Po -7.62 0
$EndPAD
$PAD
Sh "2" C 1.397 1.397 0 0 0
Dr 0.8128 0 0
At STD N 00E0FFFF
Ne 0 ""
Po 7.62 0
$EndPAD
$SHAPE3D
Na "discret/c_pol.wrl"
Sc 0.6 0.6 0.6
Of 0 0 0
Ro 0 0 0
$EndSHAPE3D
$EndMODULE CP6
$MODULE CP8
Po 0 0 0 15 00200000 00000000 ~~
Li CP8
Cd Condensateur polarise
Kw CP
Sc 0
AR 
Op 0 0 0
T0 1.27 1.27 1.524 1.524 0 0.3048 N V 21 N "CP8"
T1 1.27 -1.27 1.524 1.524 0 0.3048 N V 21 N "C***"
DS -10.16 0 -8.89 0 0.3048 21
DS -7.62 1.27 -8.89 1.27 0.3048 21
DS -8.89 1.27 -8.89 -1.27 0.3048 21
DS -8.89 -1.27 -7.62 -1.27 0.3048 21
DS -7.62 2.54 -7.62 -2.54 0.3048 21
DS -7.62 -2.54 8.89 -2.54 0.3048 21
DS 8.89 -2.54 8.89 2.54 0.3048 21
DS 8.89 2.54 -7.62 2.54 0.3048 21
DS 8.89 0 10.16 0 0.3048 21
DS -5.08 -2.54 -5.08 2.54 0.3048 21
DS -6.35 2.54 -6.35 -2.54 0.3048 21
$PAD
Sh "1" R 1.778 1.778 0 0 0
Dr 0.8128 0 0
At STD N 00E0FFFF
Ne 0 ""
Po -10.16 0
$EndPAD
$PAD
Sh "2" C 1.778 1.778 0 0 0
Dr 0.8128 0 0
At STD N 00E0FFFF
Ne 0 ""
Po 10.16 0
$EndPAD
$SHAPE3D
Na "discret/c_pol.wrl"
Sc 0.8 0.8 0.8
Of 0 0 0
Ro 0 0 0
$EndSHAPE3D
$EndMODULE CP8
$MODULE CPR10X16
Po 0 0 0 15 416BBCDD 00000000 ~~
Li CPR10X16
Cd Condensateur polarise couche
Kw CP
Sc 0
AR 
Op 0 0 0
T0 -10.16 -2.54 1.524 1.27 0 0.2032 N V 21 N "C***"
T1 -10.16 2.54 1.524 1.27 0 0.2032 N V 21 N "CPR10X16"
DS -2.54 -5.207 -19.05 -5.207 0.3048 21
DS -19.05 -5.207 -19.05 4.953 0.3048 21
DS -19.05 4.953 -2.54 4.953 0.3048 21
DS -2.54 4.953 -2.54 -5.207 0.3048 21
DS -2.54 -3.937 -1.27 -3.937 0.3048 21
DS -1.27 -3.937 -1.27 -1.397 0.3048 21
DS -1.27 -1.397 -2.54 -1.397 0.3048 21
DS -1.27 -2.667 0 -2.667 0.3048 21
DS -2.54 2.413 0 2.413 0.3048 21
$PAD
Sh "1" R 1.778 1.778 0 0 0
Dr 1.016 0 0
At STD N 00F0FFFF
Ne 0 ""
Po 0 -2.667
$EndPAD
$PAD
Sh "2" C 1.778 1.778 0 0 0
Dr 1.016 0 0
At STD N 00F0FFFF
Ne 0 ""
Po 0 2.413
$EndPAD
$SHAPE3D
Na "discret/c_horiz_c2v10.wrl"
Sc 1 1 1
Of 0 0 0
Ro 0 0 0
$EndSHAPE3D
$EndMODULE CPR10X16
$MODULE CR1220
Po 0 0 0 15 45129998 00000000 ~~
Li CR1220
Sc 0
AR 
Op 0 0 0
T0 6.858 0 1.524 1.016 900 0.2032 N V 21 N "CR1220"
T1 2.286 0 1.27 1.016 900 0.2032 N I 21 N "VAL**"
DS -6.35 2.54 -2.667 2.54 0.2032 21
DS -6.35 -2.54 -2.667 -2.54 0.2032 21
DS -6.35 2.54 -7.62 1.27 0.2032 21
DS -7.62 1.27 -7.62 -1.27 0.2032 21
DS -7.62 -1.27 -6.35 -2.54 0.2032 21
DS 8.001 -4.318 9.525 -5.588 0.2032 21
DS 8.001 4.318 9.525 5.588 0.2032 21
DC 4.445 0 -1.143 0 0.2032 21
DC 4.445 0 -2.667 2.54 0.2032 21
$PAD
Sh "1" C 3.556 3.556 0 0 0
Dr 2.54 0 0
At STD N 00E0FFFF
Ne 2 "N-000135"
Po -5.08 0
$EndPAD
$PAD
Sh "2" C 2.54 2.54 0 0 0
Dr 1.016 0 0
At STD N 00E0FFFF
Ne 1 "GND"
Po 4.445 0
$EndPAD
$PAD
Sh "" C 2.159 2.159 0 0 0
Dr 2.032 0 0
At STD N 00E0FFFF
Ne 0 ""
Po 4.445 5.08
$EndPAD
$PAD
Sh "" C 2.159 2.159 0 0 0
Dr 2.032 0 0
At STD N 00E0FFFF
Ne 0 ""
Po 8.89 -2.54
$EndPAD
$PAD
Sh "" C 2.159 2.159 0 0 0
Dr 2.032 0 0
At STD N 00E0FFFF
Ne 0 ""
Po 0 -2.54
$EndPAD
$EndMODULE CR1220
$MODULE CR2032H
Po 0 0 0 15 4C5E6DB1 00000000 ~~
Li CR2032H
Sc 0
AR 
Op 0 0 0
T0 0 -12.7 1.524 1.524 0 0.3048 N V 21 N "CR2032H"
T1 0 12.7 1.524 1.524 0 0.3048 N V 21 N "VAL**"
DS 15.24 3.81 15.24 5.08 0.381 21
DS 14.605 4.445 15.875 4.445 0.381 21
DS 10.795 -2.54 17.145 -2.54 0.381 21
DS 17.145 -2.54 17.145 2.54 0.381 21
DS 17.145 2.54 10.795 2.54 0.381 21
DS 17.145 -3.175 17.78 -3.175 0.381 21
DS 17.78 -3.175 17.78 3.175 0.381 21
DS 17.78 3.175 17.145 3.175 0.381 21
DS 15.875 -3.175 17.145 -3.175 0.381 21
DS 17.145 3.175 10.795 3.175 0.381 21
DS 10.795 -3.175 15.875 -3.175 0.381 21
DC 0 0 -1.27 -8.89 0.381 21
DC 0 0 6.35 8.89 0.381 21
$PAD
Sh "2" C 2.286 2.286 0 0 0
Dr 1.016 0 0
At STD N 00E0FFFF
Ne 0 ""
Po -7.62 0
$EndPAD
$PAD
Sh "1" C 2.286 2.286 0 0 0
Dr 1.016 0 0
At STD N 00E0FFFF
Ne 0 ""
Po 15.24 0
$EndPAD
$EndMODULE CR2032H
$MODULE CR2032V
Po 0 0 0 15 4C5E7411 00000000 ~~
Li CR2032V
Sc 0
AR 
Op 0 0 0
T0 -7.62 -5.08 1.524 1.524 0 0.3048 N V 21 N "CR2032V"
T1 0 5.08 1.524 1.524 0 0.3048 N V 21 N "VAL**"
DS -12.065 -3.302 12.065 -3.302 0.381 21
DS 1.778 -1.778 2.794 -1.778 0.381 21
DS 7.874 2.286 7.874 1.27 0.381 21
DS 7.366 1.778 8.382 1.778 0.381 21
DS 12.065 3.175 12.065 -3.175 0.381 21
DS 12.065 -2.667 -12.065 -2.667 0.381 21
DS -12.065 -3.175 -12.065 3.175 0.381 21
DS -12.065 3.175 12.065 3.175 0.381 21
$PAD
Sh "1" C 2.286 2.286 0 0 0
Dr 1.27 0 0
At STD N 00E0FFFF
Ne 0 ""
Po -5.08 1.778
$EndPAD
$PAD
Sh "1" C 2.286 2.286 0 0 0
Dr 1.27 0 0
At STD N 00E0FFFF
Ne 0 ""
Po 5.08 1.778
$EndPAD
$PAD
Sh "2" C 2.286 2.286 0 0 0
Dr 1.27 0 0
At STD N 00E0FFFF
Ne 0 ""
Po 0 -1.524
$EndPAD
$EndMODULE CR2032V
$MODULE CV3-30PF
Po 175.26 203.2 0 15 00200000 00000000 ~~
Li CV3-30PF
Cd Condensateur ajustable miniature
Kw C DEV
Sc 0
AR 
Op 0 0 0
T0 0 4.445 1.016 1.016 0 0.2032 N V 21 N "CV3-30PF"
T1 0 4.445 1.016 1.016 0 0.2032 N I 21 N "VAL*"
DC 0 0 3.175 0 0.381 21
DC 0 0 0.635 0.635 0.381 21
$PAD
Sh "1" C 1.524 1.524 0 0 0
Dr 0.8128 0 0
At STD N 00E0FFFF
Ne 0 ""
Po 2.54 0
$EndPAD
$PAD
Sh "2" C 1.524 1.524 0 0 0
Dr 0.8128 0 0
At STD N 00E0FFFF
Ne 0 ""
Po -2.54 0
$EndPAD
$EndMODULE CV3-30PF
$MODULE CVAR3X2
Po 162.56 203.2 0 15 00200000 00000000 ~~
Li CVAR3X2
Cd Condensateur ajustable
Kw C DEV
Sc 0
AR 
Op 0 0 0
T0 0 0.889 1.524 1.27 0 0.3048 N V 21 N "CV3x2"
T1 0.127 -1.27 1.524 1.27 0 0.3048 N V 21 N "VAL*"
DS 2.54 -5.08 -2.54 -5.08 0.3048 21
DS -2.54 -5.08 -5.08 -2.54 0.3048 21
DS -5.08 -2.54 -5.08 3.81 0.3048 21
DS -5.08 3.81 -3.81 5.08 0.3048 21
DS -3.81 5.08 3.81 5.08 0.3048 21
DS 3.81 5.08 5.08 3.81 0.3048 21
DS 5.08 3.81 5.08 -2.54 0.3048 21
DS 5.08 -2.54 2.54 -5.08 0.3048 21
$PAD
Sh "1" C 2.54 2.54 0 0 0
Dr 1.3208 0 0
At STD N 00E0FFFF
Ne 0 ""
Po 0 -3.81
$EndPAD
$PAD
Sh "2" C 2.54 2.54 0 0 0
Dr 1.3208 0 0
At STD N 00E0FFFF
Ne 0 ""
Po 2.54 3.81
$EndPAD
$PAD
Sh "3" C 2.54 2.54 0 0 0
Dr 1.3208 0 0
At STD N 00E0FFFF
Ne 0 ""
Po -2.54 3.81
$EndPAD
$EndMODULE CVAR3X2
$MODULE D3
Po 0 0 0 15 00200000 00000000 ~~
Li D3
Cd Diode 3 pas
Kw DIODE DEV
Sc 0
AR 
Op 0 0 0
T0 0 0 1.016 1.016 0 0.2032 N V 21 N "D3"
T1 0 0 1.016 1.016 0 0.2032 N I 21 N "D***"
DS 3.81 0 3.048 0 0.3048 21
DS 3.048 0 3.048 -1.016 0.3048 21
DS 3.048 -1.016 -3.048 -1.016 0.3048 21
DS -3.048 -1.016 -3.048 0 0.3048 21
DS -3.048 0 -3.81 0 0.3048 21
DS -3.048 0 -3.048 1.016 0.3048 21
DS -3.048 1.016 3.048 1.016 0.3048 21
DS 3.048 1.016 3.048 0 0.3048 21
DS 2.54 -1.016 2.54 1.016 0.3048 21
DS 2.286 1.016 2.286 -1.016 0.3048 21
$PAD
Sh "2" R 1.397 1.397 0 0 0
Dr 0.8128 0 0
At STD N 00E0FFFF
Ne 0 ""
Po 3.81 0
$EndPAD
$PAD
Sh "1" C 1.397 1.397 0 0 0
Dr 0.8128 0 0
At STD N 00E0FFFF
Ne 0 ""
Po -3.81 0
$EndPAD
$SHAPE3D
Na "discret/diode.wrl"
Sc 0.3 0.3 0.3
Of 0 0 0
Ro 0 0 0
$EndSHAPE3D
$EndMODULE D3
$MODULE D4
Po 0 0 0 15 00200000 00000000 ~~
Li D4
Cd Diode 4 pas
Kw DIODE DEV
Sc 0
AR 
Op 0 0 0
T0 0 0 1.27 1.016 0 0.2032 N V 21 N "D4"
T1 0 0 1.27 1.016 0 0.2032 N I 21 N "D***"
DS -3.81 -1.27 3.81 -1.27 0.3048 21
DS 3.81 -1.27 3.81 1.27 0.3048 21
DS 3.81 1.27 -3.81 1.27 0.3048 21
DS -3.81 1.27 -3.81 -1.27 0.3048 21
DS 3.175 -1.27 3.175 1.27 0.3048 21
DS 2.54 1.27 2.54 -1.27 0.3048 21
DS -3.81 0 -5.08 0 0.3048 21
DS 3.81 0 5.08 0 0.3048 21
$PAD
Sh "1" C 1.778 1.778 0 0 0
Dr 1.016 0 0
At STD N 00E0FFFF
Ne 0 ""
Po -5.08 0
$EndPAD
$PAD
Sh "2" R 1.778 1.778 0 0 0
Dr 1.016 0 0
At STD N 00E0FFFF
Ne 0 ""
Po 5.08 0
$EndPAD
$SHAPE3D
Na "discret/diode.wrl"
Sc 0.4 0.4 0.4
Of 0 0 0
Ro 0 0 0
$EndSHAPE3D
$EndMODULE D4
$MODULE D5
Po 0 0 0 15 00200000 00000000 ~~
Li D5
Cd Diode 5 pas
Kw DIODE DEV
Sc 0
AR 
Op 0 0 0
T0 0 0 1.524 1.016 0 0.3048 N V 21 N "D5"
T1 -0.254 0 1.524 1.016 0 0.3048 N I 21 N "D***"
DS 6.35 0 5.08 0 0.3048 21
DS 5.08 0 5.08 -1.27 0.3048 21
DS 5.08 -1.27 -5.08 -1.27 0.3048 21
DS -5.08 -1.27 -5.08 0 0.3048 21
DS -5.08 0 -6.35 0 0.3048 21
DS -5.08 0 -5.08 1.27 0.3048 21
DS -5.08 1.27 5.08 1.27 0.3048 21
DS 5.08 1.27 5.08 0 0.3048 21
DS 3.81 -1.27 3.81 1.27 0.3048 21
DS 4.064 -1.27 4.064 1.27 0.3048 21
$PAD
Sh "1" C 1.778 1.778 0 0 0
Dr 1.143 0 0
At STD N 00E0FFFF
Ne 0 ""
Po -6.35 0
$EndPAD
$PAD
Sh "2" R 1.778 1.778 0 0 0
Dr 1.143 0 0
At STD N 00E0FFFF
Ne 0 ""
Po 6.35 0
$EndPAD
$SHAPE3D
Na "discret/diode.wrl"
Sc 0.5 0.5 0.5
Of 0 0 0
Ro 0 0 0
$EndSHAPE3D
$EndMODULE D5
$MODULE D6
Po 0 0 0 15 00200000 00000000 ~~
Li D6
Cd Diode 6 pas
Kw DIODE
Sc 0
AR 
Op 0 0 0
T0 -0.635 1.27 1.524 1.016 0 0.3048 N V 21 N "D6"
T1 -0.635 -1.27 1.524 1.016 0 0.3048 N V 21 N "D***"
DS -5.715 -3.175 -5.715 3.175 0.3048 21
DS -5.715 3.175 5.715 3.175 0.3048 21
DS 5.715 3.175 5.715 -3.175 0.3048 21
DS 5.715 -3.175 -5.715 -3.175 0.3048 21
DS 5.08 -3.175 5.08 3.175 0.3048 21
DS 4.445 3.175 4.445 -3.175 0.3048 21
DS 5.715 0 7.62 0 0.3048 21
DS -5.715 0 -7.62 0 0.3048 21
$PAD
Sh "1" C 2.54 2.54 0 0 0
Dr 1.27 0 0
At STD N 00E0FFFF
Ne 0 ""
Po -7.62 0
$EndPAD
$PAD
Sh "2" R 2.54 2.54 0 0 0
Dr 1.27 0 0
At STD N 00E0FFFF
Ne 0 ""
Po 7.62 0
$EndPAD
$SHAPE3D
Na "discret/diode.wrl"
Sc 0.6 0.6 0.6
Of 0 0 0
Ro 0 0 0
$EndSHAPE3D
$EndMODULE D6
$MODULE D6.5
Po 0 0 0 15 451BB076 00000000 ~~
Li D6.5
Sc 0
AR 
Op 0 0 0
T0 0 -1.27 1.524 1.27 0 0.2032 N V 21 N "D6.5"
T1 0 1.27 1.524 1.27 0 0.2032 N V 21 N "VAL***"
DS 6.985 3.175 -6.35 3.175 0.3048 21
DS -6.35 3.175 -6.35 -3.175 0.3048 21
DS -6.35 -3.175 6.985 -3.175 0.3048 21
DS -8.89 0 -6.35 0 0.3048 21
DS 6.985 3.175 6.985 -3.175 0.3048 21
DS 6.35 -3.175 6.35 3.175 0.3048 21
DS 5.715 3.175 5.715 -3.175 0.3048 21
DS 6.985 0 8.89 0 0.3048 21
$PAD
Sh "1" C 2.159 2.159 0 0 0
Dr 1.397 0 0
At STD N 00E0FFFF
Ne 1 "GND"
Po -8.89 0
$EndPAD
$PAD
Sh "2" R 2.159 2.159 0 0 0
Dr 1.397 0 0
At STD N 00E0FFFF
Ne 6 "+BATT_1"
Po 8.89 0
$EndPAD
$SHAPE3D
Na "discret/diode.wrl"
Sc 0.7 0.7 0.7
Of 0 0 0
Ro 0 0 0
$EndSHAPE3D
$EndMODULE D6.5
$MODULE DO-35
Po 0 0 0 15 4C5F69DC 00000000 ~~
Li DO-35
Cd Diode 3 pas
Kw DIODE DEV
Sc 0
AR 
Op 0 0 0
T0 0 0 1.016 1.016 0 0.2032 N V 21 N "DO-35"
T1 0 0 1.016 1.016 0 0.2032 N I 21 N "D***"
DS 2.032 0 3.81 0 0.3175 21
DS -2.032 0 -3.81 0 0.3175 21
DS 1.524 -1.016 1.524 1.016 0.3175 21
DS -2.032 -1.016 -2.032 1.016 0.3175 21
DS -2.032 1.016 2.032 1.016 0.3175 21
DS 2.032 1.016 2.032 -1.016 0.3175 21
DS 2.032 -1.016 -2.032 -1.016 0.3175 21
$PAD
Sh "2" R 1.4224 1.4224 0 0 0
Dr 0.6096 0 0
At STD N 00E0FFFF
Ne 0 ""
Po 3.81 0
$EndPAD
$PAD
Sh "1" C 1.4224 1.4224 0 0 0
Dr 0.6096 0 0
At STD N 00E0FFFF
Ne 0 ""
Po -3.81 0
$EndPAD
$SHAPE3D
Na "discret/diode.wrl"
Sc 0.3 0.3 0.3
Of 0 0 0
Ro 0 0 0
$EndSHAPE3D
$EndMODULE DO-35
$MODULE DO-41
Po 0 0 0 15 4C5F69ED 00000000 ~~
Li DO-41
Cd Diode 3 pas
Kw DIODE DEV
Sc 0
AR 
Op 0 0 0
T0 0 0 1.016 1.016 0 0.2032 N V 21 N "DO-41"
T1 0 0 1.016 1.016 0 0.2032 N I 21 N "D***"
DS -3.81 0 -5.08 0 0.3175 21
DS 3.81 0 5.08 0 0.3175 21
DS 3.81 0 3.048 0 0.3175 21
DS 3.048 0 3.048 -1.016 0.3048 21
DS 3.048 -1.016 -3.048 -1.016 0.3048 21
DS -3.048 -1.016 -3.048 0 0.3048 21
DS -3.048 0 -3.81 0 0.3048 21
DS -3.048 0 -3.048 1.016 0.3048 21
DS -3.048 1.016 3.048 1.016 0.3048 21
DS 3.048 1.016 3.048 0 0.3048 21
DS 2.54 -1.016 2.54 1.016 0.3048 21
DS 2.286 1.016 2.286 -1.016 0.3048 21
$PAD
Sh "2" R 1.524 1.524 0 0 0
Dr 0.889 0 0
At STD N 00E0FFFF
Ne 0 ""
Po 5.08 0
$EndPAD
$PAD
Sh "1" C 1.524 1.524 0 0 0
Dr 0.889 0 0
At STD N 00E0FFFF
Ne 0 ""
Po -5.08 0
$EndPAD
$EndMODULE DO-41
$MODULE EMI_FILTER
Po 0 0 0 15 4512C014 00000000 ~~
Li EMI_FILTER
Sc 0
AR 
Op 0 0 0
T0 0 0 1.524 0.889 0 0.1524 N V 21 N "EMI_FILTER"
T1 0 0 1.27 0.889 0 0.1524 N I 21 N "Val**"
DS 4.064 1.27 4.064 -1.27 0.2032 21
DS -4.064 1.27 -4.064 -1.27 0.2032 21
DS 4.064 1.27 -4.064 1.27 0.2032 21
DS -4.064 -1.27 4.064 -1.27 0.2032 21
$PAD
Sh "VI" R 1.27 2.54 0 0 0
Dr 0 0 0
At SMD N 00888000
Ne 0 ""
Po -3.429 0
$EndPAD
$PAD
Sh "GND" R 2.54 2.54 0 0 0
Dr 0 0 0
At SMD N 00888000
Ne 0 ""
Po 0 0
$EndPAD
$PAD
Sh "VO" R 1.27 2.54 0 0 0
Dr 0 0 0
At SMD N 00888000
Ne 0 ""
Po 3.429 0
$EndPAD
$SHAPE3D
Na "discret/emi_filter.wrl"
Sc 0.4 0.4 0.4
Of 0 0 0
Ro 0 0 0
$EndSHAPE3D
$EndMODULE EMI_FILTER
$MODULE FUSE5-20
Po 0 0 0 15 40C496F0 00000000 ~~
Li FUSE5-20
Cd Support fusible 5 x 20
Kw DEV
Sc 0
AR 
Op 0 0 0
T0 1.016 5.08 2.83464 1.59512 0 0.3048 N V 21 N "F1"
T1 1.27 -5.08 2.54 2.032 0 0.3048 N V 21 N "FUSE"
DS -12.7 -2.54 12.7 -2.54 0.3048 21
DS 12.7 -2.54 12.7 2.54 0.3048 21
DS 12.7 2.54 -12.7 2.54 0.3048 21
DS -12.7 2.54 -12.7 -2.54 0.3048 21
DS -5.08 -2.54 -5.08 2.54 0.3048 21
DS 5.08 -2.54 5.08 2.54 0.3048 21
$PAD
Sh "1" C 3.81 3.81 0 0 0
Dr 1.397 0 0
At STD N 00E0FFFF
Ne 12 "N-000013"
Po -10.16 0
$EndPAD
$PAD
Sh "1" C 3.81 3.81 0 0 0
Dr 1.397 0 0
At STD N 00E0FFFF
Ne 12 "N-000013"
Po -5.08 0
$EndPAD
$PAD
Sh "2" C 3.81 3.81 0 0 0
Dr 1.397 0 0
At STD N 00E0FFFF
Ne 11 "N-000015"
Po 5.08 0
$EndPAD
$PAD
Sh "2" C 3.81 3.81 0 0 0
Dr 1.397 0 0
At STD N 00E0FFFF
Ne 11 "N-000015"
Po 10.16 0
$EndPAD
$EndMODULE FUSE5-20
$MODULE HC-18UH
Po 0 0 0 15 00200000 00000000 ~~
Li HC-18UH
Cd Quartz boitier HC-18 horizontal
Kw QUARTZ DEV
Sc 0
AR 
Op 0 0 0
T0 0 6.35 1.524 1.524 0 0.3048 N V 21 N "HC-18UH"
T1 0 11.43 1.524 1.524 0 0.3048 N V 21 N "X***"
DS 6.35 2.794 -6.35 2.794 0.3048 21
DS 5.842 2.794 5.842 15.24 0.3048 21
DS -6.35 2.794 -6.35 2.032 0.3048 21
DS 6.35 2.794 6.35 2.032 0.3048 21
DS 6.35 2.032 -6.35 2.032 0.3048 21
DS -2.54 0 -2.54 2.032 0.3048 21
DS 2.54 0 2.54 2.032 0.3048 21
DS -5.842 2.794 -5.842 15.24 0.3048 21
DS 5.842 15.24 5.334 15.748 0.3048 21
DS 5.334 15.748 -5.334 15.748 0.3048 21
DS -5.334 15.748 -5.842 15.24 0.3048 21
$PAD
Sh "1" C 1.778 1.778 0 0 0
Dr 0.8128 0 0
At STD N 00E0FFFF
Ne 0 ""
Po -2.54 0
$EndPAD
$PAD
Sh "2" C 1.778 1.778 0 0 0
Dr 0.8128 0 0
At STD N 00E0FFFF
Ne 0 ""
Po 2.54 0
$EndPAD
$SHAPE3D
Na "discret/crystal_hc18u_horizontal.wrl"
Sc 1 1 1
Of 0 0 0
Ro 0 0 0
$EndSHAPE3D
$EndMODULE HC-18UH
$MODULE HC-18UV
Po 0 0 0 15 42899E71 00000000 ~~
Li HC-18UV
Cd Quartz boitier HC-18U vertical
Kw QUARTZ DEV
Sc 0
AR 
Op 0 A 0
T0 -0.127 -1.778 1.143 1.27 0 0.1524 N V 21 N "X***"
T1 0 1.651 1.143 1.27 0 0.1524 N V 21 N "HC-18UV"
DS -6.985 -1.27 -5.715 -2.54 0.1524 21
DS 5.715 -2.54 6.985 -1.27 0.1524 21
DS 6.985 1.27 5.715 2.54 0.1524 21
DS -6.985 1.27 -5.715 2.54 0.1524 21
DS -5.715 -2.54 5.715 -2.54 0.1524 21
DS -6.985 -1.27 -6.985 1.27 0.1524 21
DS -5.715 2.54 5.715 2.54 0.1524 21
DS 6.985 1.27 6.985 -1.27 0.1524 21
$PAD
Sh "1" C 1.778 1.778 0 0 0
Dr 0.8128 0 0
At STD N 00E0FFFF
Ne 0 ""
Po -2.54 0
$EndPAD
$PAD
Sh "2" C 1.778 1.778 0 0 0
Dr 0.8128 0 0
At STD N 00E0FFFF
Ne 0 ""
Po 2.54 0
$EndPAD
$SHAPE3D
Na "discret/crystal_hc18u_vertical.wrl"
Sc 1 1 1
Of 0 0 0
Ro 0 0 0
$EndSHAPE3D
$EndMODULE HC-18UV
$MODULE HC-33UH
Po 0 0 0 15 00200000 00000000 ~~
Li HC-33UH
Cd Quartz boitier HC-33U Horizontal
Kw QUARTZ DEV
Sc 0
AR 
Op 0 0 0
T0 1.27 11.43 1.524 1.524 0 0.3048 N V 21 N "HC-33UH"
T1 1.27 17.78 1.524 1.524 0 0.3048 N V 21 N "X***"
DS 15.24 4.445 -15.875 4.445 0.3048 21
DS -6.35 0 -6.35 4.445 0.3048 21
DS 6.35 0 6.35 4.445 0.3048 21
DS 15.24 4.445 15.24 6.35 0.3048 21
DS 15.24 6.35 -15.875 6.35 0.3048 21
DS -15.875 6.35 -15.875 4.445 0.3048 21
DS 14.605 6.35 14.605 31.75 0.3048 21
DS 14.605 31.75 13.335 33.02 0.3048 21
DS 13.335 33.02 -13.97 33.02 0.3048 21
DS -13.97 33.02 -15.24 31.75 0.3048 21
DS -15.24 31.75 -15.24 6.35 0.3048 21
$PAD
Sh "1" C 1.778 1.778 0 0 0
Dr 1.016 0 0
At STD N 00E0FFFF
Ne 0 ""
Po -6.35 0
$EndPAD
$PAD
Sh "2" C 1.778 1.778 0 0 0
Dr 1.016 0 0
At STD N 00E0FFFF
Ne 0 ""
Po 6.35 0
$EndPAD
$SHAPE3D
Na "discret/crystal_hc18u_horizontal.wrl"
Sc 2 2 2
Of 0 0 0
Ro 0 0 0
$EndSHAPE3D
$EndMODULE HC-33UH
$MODULE HC-33UV
Po 0 0 0 15 3F93D049 00000000 ~~
Li HC-33UV
Cd Quartz boitier HC-33U Vertical
Kw QUARTZ DEV
Sc 0
AR 
Op 0 A 0
T0 0 -2.54 1.524 1.524 0 0.3048 N V 21 N "HC-33UV"
T1 0.635 2.54 1.524 1.524 0 0.3048 N V 21 N "V***"
DS 5.08 4.445 -5.08 4.445 0.2032 21
DA 5.08 0 9.525 0 900 0.2032 21
DS -5.08 -4.445 5.08 -4.445 0.2032 21
DA 5.08 0 5.08 -4.445 900 0.2032 21
DA -5.08 0 -5.08 4.445 900 0.2032 21
DA -5.08 0 -9.525 0 900 0.2032 21
$PAD
Sh "1" C 2.032 2.032 0 0 0
Dr 1.016 0 0
At STD N 00E0FFFF
Ne 0 ""
Po -5.08 0
$EndPAD
$PAD
Sh "2" C 1.778 1.778 0 0 0
Dr 1.016 0 0
At STD N 00E0FFFF
Ne 0 ""
Po 5.08 0
$EndPAD
$SHAPE3D
Na "discret/crystal_hc18u_vertical.wrl"
Sc 2 2 2
Of 0 0 0
Ro 0 0 0
$EndSHAPE3D
$EndMODULE HC-33UV
$MODULE HC-49V
Po 0 0 0 15 4C5EC450 00000000 ~~
Li HC-49V
Cd Quartz boitier HC-49 Vertical
Kw QUARTZ DEV
Sc 0
AR 
Op 0 A 0
T0 0 -3.81 1.524 1.524 0 0.3048 N V 21 N "HC-49V"
T1 0 3.81 1.524 1.524 0 0.3048 N V 21 N "V***"
DS -3.175 2.54 3.175 2.54 0.3175 21
DS -3.175 -2.54 3.175 -2.54 0.3175 21
DA 3.175 0 3.175 -2.54 900 0.3175 21
DA 3.175 0 5.715 0 900 0.3175 21
DA -3.175 0 -5.715 0 900 0.3175 21
DA -3.175 0 -3.175 2.54 900 0.3175 21
$PAD
Sh "1" C 1.4224 1.4224 0 0 0
Dr 0.762 0 0
At STD N 00E0FFFF
Ne 0 ""
Po -2.54 0
$EndPAD
$PAD
Sh "2" C 1.4224 1.4224 0 0 0
Dr 0.762 0 0
At STD N 00E0FFFF
Ne 0 ""
Po 2.54 0
$EndPAD
$SHAPE3D
Na "device/crystal_low_profile.wrl"
Sc 0.4 0.4 0.4
Of 0 0 0
Ro 0 0 0
$EndSHAPE3D
$EndMODULE HC-49V
$MODULE INDUCTOR_V
Po 0 0 0 15 443CBA90 00000000 ~~
Li INDUCTOR_V
Cd Inductor (vertical)
Kw INDUCTOR
Sc 0
AR 
Op 0 0 0
T0 0.508 2.032 1.524 1.524 0 0.2032 N V 21 N "L**"
T1 0.254 -2.032 1.27 1.27 0 0.2032 N V 21 N "Val***"
DC 0 0 3.81 0 0.381 21
$PAD
Sh "1" R 1.905 1.905 0 0 0
Dr 0.8128 0 0
At STD N 00E0FFFF
Ne 1 "N-000007"
Po -2.54 0
$EndPAD
$PAD
Sh "2" C 1.905 1.905 0 0 0
Dr 0.8128 0 0
At STD N 00E0FFFF
Ne 2 "VCC"
Po 2.54 0
$EndPAD
$SHAPE3D
Na "discret/inductorV.wrl"
Sc 2 2 2
Of 0 0 0
Ro 0 0 0
$EndSHAPE3D
$EndMODULE INDUCTOR_V
$MODULE KSA
Po 193.04 219.71 0 15 00200000 00000000 ~~
Li KSA
Cd Bouton poussoir KSA
Kw SWITCH DEV
Sc 0
AR 
Op 0 0 0
T0 0.381 4.699 1.524 1.016 0 0.2032 N V 21 N "VAL*"
T1 -0.127 -4.953 1.524 1.016 0 0.2032 N V 21 N "KSA"
DS -3.81 3.81 5.08 3.81 0.3048 21
DS 5.08 3.81 5.08 -3.81 0.3048 21
DS 5.08 -3.81 -5.08 -3.81 0.3048 21
DS -5.08 -3.81 -5.08 3.81 0.3048 21
DS -5.08 3.81 -3.81 3.81 0.3048 21
DC 0 0 1.905 0.635 0.3048 21
$PAD
Sh "1" C 1.778 1.778 0 0 0
Dr 1.143 0 0
At STD N 00E0FFFF
Ne 0 ""
Po 3.81 -2.54
$EndPAD
$PAD
Sh "2" C 1.778 1.778 0 0 0
Dr 1.143 0 0
At STD N 00E0FFFF
Ne 0 ""
Po 3.81 2.54
$EndPAD
$PAD
Sh "3" C 1.778 1.778 0 0 0
Dr 1.143 0 0
At STD N 00E0FFFF
Ne 0 ""
Po -3.81 2.54
$EndPAD
$PAD
Sh "4" C 1.778 1.778 0 0 0
Dr 1.143 0 0
At STD N 00E0FFFF
Ne 0 ""
Po -3.81 0
$EndPAD
$PAD
Sh "5" C 1.778 1.778 0 0 0
Dr 1.143 0 0
At STD N 00E0FFFF
Ne 0 ""
Po -3.81 -2.54
$EndPAD
$EndMODULE KSA
$MODULE LCD4
Po 167.005 59.69 0 15 00200000 00000000 ~~
Li LCD4
Cd Afficheur LCD 4 digits
Kw LCD
Sc 0
AR 
Op 0 0 0
T0 0 6.35 3.81 3.81 0 0.3048 N V 21 N "LCD4"
T1 0 -6.35 2.54 2.54 0 0.3048 N V 21 N "AFFICH*"
DS 26.67 -16.51 -26.67 -16.51 0.381 21
DS -26.67 -16.51 -26.67 16.51 0.381 21
DS -26.67 16.51 26.67 16.51 0.381 21
DS 26.67 16.51 26.67 -16.51 0.381 21
$PAD
Sh "1" R 1.524 1.524 0 0 0
Dr 0.7874 0 0
At STD N 00E0FFFF
Ne 0 ""
Po -24.13 16.51
$EndPAD
$PAD
Sh "2" C 1.524 1.524 0 0 0
Dr 0.7874 0 0
At STD N 00E0FFFF
Ne 0 ""
Po -21.59 16.51
$EndPAD
$PAD
Sh "3" C 1.524 1.524 0 0 0
Dr 0.7874 0 0
At STD N 00E0FFFF
Ne 0 ""
Po -19.05 16.51
$EndPAD
$PAD
Sh "4" C 1.524 1.524 0 0 0
Dr 0.7874 0 0
At STD N 00E0FFFF
Ne 0 ""
Po -16.51 16.51
$EndPAD
$PAD
Sh "5" C 1.524 1.524 0 0 0
Dr 0.7874 0 0
At STD N 00E0FFFF
Ne 0 ""
Po -13.97 16.51
$EndPAD
$PAD
Sh "6" C 1.524 1.524 0 0 0
Dr 0.7874 0 0
At STD N 00E0FFFF
Ne 0 ""
Po -11.43 16.51
$EndPAD
$PAD
Sh "7" C 1.524 1.524 0 0 0
Dr 0.7874 0 0
At STD N 00E0FFFF
Ne 0 ""
Po -8.89 16.51
$EndPAD
$PAD
Sh "8" C 1.524 1.524 0 0 0
Dr 0.7874 0 0
At STD N 00E0FFFF
Ne 0 ""
Po -6.35 16.51
$EndPAD
$PAD
Sh "9" C 1.524 1.524 0 0 0
Dr 0.7874 0 0
At STD N 00E0FFFF
Ne 0 ""
Po -3.81 16.51
$EndPAD
$PAD
Sh "10" C 1.524 1.524 0 0 0
Dr 0.7874 0 0
At STD N 00E0FFFF
Ne 0 ""
Po -1.27 16.51
$EndPAD
$PAD
Sh "11" C 1.524 1.524 0 0 0
Dr 0.7874 0 0
At STD N 00E0FFFF
Ne 0 ""
Po 1.27 16.51
$EndPAD
$PAD
Sh "12" C 1.524 1.524 0 0 0
Dr 0.7874 0 0
At STD N 00E0FFFF
Ne 0 ""
Po 3.81 16.51
$EndPAD
$PAD
Sh "13" C 1.524 1.524 0 0 0
Dr 0.7874 0 0
At STD N 00E0FFFF
Ne 0 ""
Po 6.35 16.51
$EndPAD
$PAD
Sh "14" C 1.524 1.524 0 0 0
Dr 0.7874 0 0
At STD N 00E0FFFF
Ne 0 ""
Po 8.89 16.51
$EndPAD
$PAD
Sh "15" C 1.524 1.524 0 0 0
Dr 0.7874 0 0
At STD N 00E0FFFF
Ne 0 ""
Po 11.43 16.51
$EndPAD
$PAD
Sh "16" C 1.524 1.524 0 0 0
Dr 0.7874 0 0
At STD N 00E0FFFF
Ne 0 ""
Po 13.97 16.51
$EndPAD
$PAD
Sh "17" C 1.524 1.524 0 0 0
Dr 0.7874 0 0
At STD N 00E0FFFF
Ne 0 ""
Po 16.51 16.51
$EndPAD
$PAD
Sh "18" C 1.524 1.524 0 0 0
Dr 0.7874 0 0
At STD N 00E0FFFF
Ne 0 ""
Po 19.05 16.51
$EndPAD
$PAD
Sh "19" C 1.524 1.524 0 0 0
Dr 0.7874 0 0
At STD N 00E0FFFF
Ne 0 ""
Po 21.59 16.51
$EndPAD
$PAD
Sh "20" C 1.524 1.524 0 0 0
Dr 0.7874 0 0
At STD N 00E0FFFF
Ne 0 ""
Po 24.13 16.51
$EndPAD
$PAD
Sh "21" C 1.524 1.524 0 0 0
Dr 0.7874 0 0
At STD N 00E0FFFF
Ne 0 ""
Po 24.13 -16.51
$EndPAD
$PAD
Sh "22" C 1.524 1.524 0 0 0
Dr 0.7874 0 0
At STD N 00E0FFFF
Ne 0 ""
Po 21.59 -16.51
$EndPAD
$PAD
Sh "23" C 1.524 1.524 0 0 0
Dr 0.7874 0 0
At STD N 00E0FFFF
Ne 0 ""
Po 19.05 -16.51
$EndPAD
$PAD
Sh "24" C 1.524 1.524 0 0 0
Dr 0.7874 0 0
At STD N 00E0FFFF
Ne 0 ""
Po 16.51 -16.51
$EndPAD
$PAD
Sh "25" C 1.524 1.524 0 0 0
Dr 0.7874 0 0
At STD N 00E0FFFF
Ne 0 ""
Po 13.97 -16.51
$EndPAD
$PAD
Sh "26" C 1.524 1.524 0 0 0
Dr 0.7874 0 0
At STD N 00E0FFFF
Ne 0 ""
Po 11.43 -16.51
$EndPAD
$PAD
Sh "27" C 1.524 1.524 0 0 0
Dr 0.7874 0 0
At STD N 00E0FFFF
Ne 0 ""
Po 8.89 -16.51
$EndPAD
$PAD
Sh "28" C 1.524 1.524 0 0 0
Dr 0.7874 0 0
At STD N 00E0FFFF
Ne 0 ""
Po 6.35 -16.51
$EndPAD
$PAD
Sh "29" C 1.524 1.524 0 0 0
Dr 0.7874 0 0
At STD N 00E0FFFF
Ne 0 ""
Po 3.81 -16.51
$EndPAD
$PAD
Sh "30" C 1.524 1.524 0 0 0
Dr 0.7874 0 0
At STD N 00E0FFFF
Ne 0 ""
Po 1.27 -16.51
$EndPAD
$PAD
Sh "31" C 1.524 1.524 0 0 0
Dr 0.7874 0 0
At STD N 00E0FFFF
Ne 0 ""
Po -1.27 -16.51
$EndPAD
$PAD
Sh "32" C 1.524 1.524 0 0 0
Dr 0.7874 0 0
At STD N 00E0FFFF
Ne 0 ""
Po -3.81 -16.51
$EndPAD
$PAD
Sh "33" C 1.524 1.524 0 0 0
Dr 0.7874 0 0
At STD N 00E0FFFF
Ne 0 ""
Po -6.35 -16.51
$EndPAD
$PAD
Sh "34" C 1.524 1.524 0 0 0
Dr 0.7874 0 0
At STD N 00E0FFFF
Ne 0 ""
Po -8.89 -16.51
$EndPAD
$PAD
Sh "35" C 1.524 1.524 0 0 0
Dr 0.7874 0 0
At STD N 00E0FFFF
Ne 0 ""
Po -11.43 -16.51
$EndPAD
$PAD
Sh "36" C 1.524 1.524 0 0 0
Dr 0.7874 0 0
At STD N 00E0FFFF
Ne 0 ""
Po -13.97 -16.51
$EndPAD
$PAD
Sh "37" C 1.524 1.524 0 0 0
Dr 0.7874 0 0
At STD N 00E0FFFF
Ne 0 ""
Po -16.51 -16.51
$EndPAD
$PAD
Sh "38" C 1.524 1.524 0 0 0
Dr 0.7874 0 0
At STD N 00E0FFFF
Ne 0 ""
Po -19.05 -16.51
$EndPAD
$PAD
Sh "39" C 1.524 1.524 0 0 0
Dr 0.7874 0 0
At STD N 00E0FFFF
Ne 0 ""
Po -21.59 -16.51
$EndPAD
$PAD
Sh "40" C 1.524 1.524 0 0 0
Dr 0.7874 0 0
At STD N 00E0FFFF
Ne 0 ""
Po -24.13 -16.51
$EndPAD
$EndMODULE LCD4
$MODULE LEDV
Po 0 0 0 15 00200000 00000000 ~~
Li LEDV
Cd Led verticale diam 6mm
Kw LED DEV
Sc 0
AR 
Op 0 0 0
T0 0 -3.81 1.524 1.524 0 0.3048 N V 21 N "LEDV"
T1 0 -3.81 1.524 1.524 0 0.3048 N I 21 N "D***"
DC 0 0 -2.54 0 0.3048 21
DS 2.54 -0.635 1.905 -0.635 0.3048 21
DS 1.905 -0.635 1.905 0.635 0.3048 21
DS 1.905 0.635 2.54 0.635 0.3048 21
$PAD
Sh "1" R 1.397 1.397 0 0 0
Dr 0.8128 0 0
At STD N 00E0FFFF
Ne 0 ""
Po -1.27 0
$EndPAD
$PAD
Sh "2" C 1.397 1.397 0 0 0
Dr 0.8128 0 0
At STD N 00E0FFFF
Ne 0 ""
Po 1.27 0
$EndPAD
$SHAPE3D
Na "discret/led5_vertical.wrl"
Sc 1 1 1
Of 0 0 0
Ro 0 0 0
$EndSHAPE3D
$EndMODULE LEDV
$MODULE LM16255
Po 62.23 78.74 0 15 00200000 00000000 ~~
Li LM16255
Cd Afficher LCD LM16255 2 lignes de 16 car.
Kw LCD
Sc 0
AR 
Op 0 0 0
T0 17.145 -33.655 4.53136 4.01828 0 0.3048 N V 21 N "LM16255"
T1 17.145 -7.62 2.94894 2.64922 0 0.3048 N V 21 N "AFFICH**"
DS -17.78 1.27 -17.78 -1.27 0.381 21
DS -17.78 -1.27 17.78 -1.27 0.381 21
DS 17.78 -1.27 17.78 1.27 0.381 21
DS -27.305 1.27 -27.305 -41.275 0.381 21
DS -27.305 -41.275 57.785 -41.275 0.381 21
DS 57.785 -41.275 57.785 1.27 0.381 21
DS 57.785 1.27 -27.305 1.27 0.381 21
DS -23.495 -34.29 -19.685 -38.1 0.381 21
DS -19.685 -38.1 50.165 -38.1 0.381 21
DS 50.165 -38.1 53.975 -34.29 0.381 21
DS 53.975 -34.29 53.975 -5.08 0.381 21
DS 53.975 -5.08 52.705 -5.08 0.381 21
DS 52.705 -5.08 52.705 -3.81 0.381 21
DS 52.705 -3.81 -22.225 -3.81 0.381 21
DS -22.225 -3.81 -22.225 -5.08 0.381 21
DS -22.225 -5.08 -23.495 -5.08 0.381 21
DS -23.495 -5.08 -23.495 -34.29 0.381 21
DS -15.875 -29.21 46.99 -29.21 0.381 21
DS 46.99 -29.21 46.99 -12.7 0.381 21
DS 46.99 -12.7 -15.875 -12.7 0.381 21
DS -15.875 -12.7 -15.875 -29.21 0.381 21
$PAD
Sh "HOLE" C 3.81 3.81 0 0 0
Dr 2.54 0 0
At STD N 00E0FFFF
Ne 0 ""
Po 55.88 -36.83
$EndPAD
$PAD
Sh "HOLE" C 3.81 3.81 0 0 0
Dr 2.54 0 0
At STD N 00E0FFFF
Ne 0 ""
Po 53.34 -1.27
$EndPAD
$PAD
Sh "HOLE" C 3.81 3.81 0 0 0
Dr 2.54 0 0
At STD N 00E0FFFF
Ne 0 ""
Po -25.4 -36.83
$EndPAD
$PAD
Sh "HOLE" C 3.81 3.81 0 0 0
Dr 2.54 0 0
At STD N 00E0FFFF
Ne 0 ""
Po -22.86 -1.27
$EndPAD
$PAD
Sh "1" R 1.524 1.524 0 0 0
Dr 1.016 0 0
At STD N 00E0FFFF
Ne 0 ""
Po 16.51 0
$EndPAD
$PAD
Sh "2" C 1.524 1.524 0 0 0
Dr 1.016 0 0
At STD N 00E0FFFF
Ne 0 ""
Po 13.97 0
$EndPAD
$PAD
Sh "3" C 1.524 1.524 0 0 0
Dr 1.016 0 0
At STD N 00E0FFFF
Ne 0 ""
Po 11.43 0
$EndPAD
$PAD
Sh "4" C 1.524 1.524 0 0 0
Dr 1.016 0 0
At STD N 00E0FFFF
Ne 0 ""
Po 8.89 0
$EndPAD
$PAD
Sh "5" C 1.524 1.524 0 0 0
Dr 1.016 0 0
At STD N 00E0FFFF
Ne 0 ""
Po 6.35 0
$EndPAD
$PAD
Sh "6" C 1.524 1.524 0 0 0
Dr 1.016 0 0
At STD N 00E0FFFF
Ne 0 ""
Po 3.81 0
$EndPAD
$PAD
Sh "7" C 1.524 1.524 0 0 0
Dr 1.016 0 0
At STD N 00E0FFFF
Ne 0 ""
Po 1.27 0
$EndPAD
$PAD
Sh "8" C 1.524 1.524 0 0 0
Dr 1.016 0 0
At STD N 00E0FFFF
Ne 0 ""
Po -1.27 0
$EndPAD
$PAD
Sh "9" C 1.524 1.524 0 0 0
Dr 1.016 0 0
At STD N 00E0FFFF
Ne 0 ""
Po -3.81 0
$EndPAD
$PAD
Sh "10" C 1.524 1.524 0 0 0
Dr 1.016 0 0
At STD N 00E0FFFF
Ne 0 ""
Po -6.35 0
$EndPAD
$PAD
Sh "11" C 1.524 1.524 0 0 0
Dr 1.016 0 0
At STD N 00E0FFFF
Ne 0 ""
Po -8.89 0
$EndPAD
$PAD
Sh "12" C 1.524 1.524 0 0 0
Dr 1.016 0 0
At STD N 00E0FFFF
Ne 0 ""
Po -11.43 0
$EndPAD
$PAD
Sh "13" C 1.524 1.524 0 0 0
Dr 1.016 0 0
At STD N 00E0FFFF
Ne 0 ""
Po -13.97 0
$EndPAD
$PAD
Sh "14" C 1.524 1.524 0 0 0
Dr 1.016 0 0
At STD N 00E0FFFF
Ne 0 ""
Po -16.51 0
$EndPAD
$EndMODULE LM16255
$MODULE LM2931
Po 0 0 0 15 3F95266A 00000000 ~~
Li LM2931
Cd Regulateur TO92 type lm2931
Kw TR TO92
Sc 0
AR 
Op 0 0 0
T0 0 3.429 1.016 1.016 0 0.2032 N V 21 N "LM2931"
T1 -0.381 -4.572 1.016 1.016 0 0.2032 N V 21 N "VAL**"
DS -1.27 2.54 2.54 -1.27 0.3048 21
DS 2.54 -1.27 2.54 -2.54 0.3048 21
DS 2.54 -2.54 1.27 -3.81 0.3048 21
DS 1.27 -3.81 -1.27 -3.81 0.3048 21
DS -1.27 -3.81 -3.81 -1.27 0.3048 21
DS -3.81 -1.27 -3.81 1.27 0.3048 21
DS -3.81 1.27 -2.54 2.54 0.3048 21
DS -2.54 2.54 -1.27 2.54 0.3048 21
$PAD
Sh "1" R 1.397 1.397 0 0 0
Dr 0.8128 0 0
At STD N 00E0FFFF
Ne 0 ""
Po 1.27 -1.27
$EndPAD
$PAD
Sh "2" C 1.397 1.397 0 0 0
Dr 0.8128 0 0
At STD N 00E0FFFF
Ne 0 ""
Po -1.27 1.27
$EndPAD
$PAD
Sh "3" C 1.397 1.397 0 0 0
Dr 0.8128 0 0
At STD N 00E0FFFF
Ne 0 ""
Po -1.27 -1.27
$EndPAD
$SHAPE3D
Na "discret/to98.wrl"
Sc 1 1 1
Of 0 0 0
Ro 0 0 0
$EndSHAPE3D
$EndMODULE LM2931
$MODULE LM78LXX
Po 0 0 0 15 00200000 00000000 ~~
Li LM78LXX
Cd Regulateur TO92 serie LM78Lxx
Kw TR TO92
Sc 0
AR 
Op 0 0 0
T0 -1.905 3.81 1.016 1.016 0 0.2032 N V 21 N "LM78LXX"
T1 -1.27 -5.08 1.016 1.016 0 0.2032 N V 21 N "VAL**"
DS -1.27 2.54 2.54 -1.27 0.3048 21
DS 2.54 -1.27 2.54 -2.54 0.3048 21
DS 2.54 -2.54 1.27 -3.81 0.3048 21
DS 1.27 -3.81 -1.27 -3.81 0.3048 21
DS -1.27 -3.81 -3.81 -1.27 0.3048 21
DS -3.81 -1.27 -3.81 1.27 0.3048 21
DS -3.81 1.27 -2.54 2.54 0.3048 21
DS -2.54 2.54 -1.27 2.54 0.3048 21
$PAD
Sh "VI" C 1.397 1.397 0 0 0
Dr 0.8128 0 0
At STD N 00E0FFFF
Ne 0 ""
Po 1.27 -1.27
$EndPAD
$PAD
Sh "GND" R 1.397 1.397 0 0 0
Dr 0.8128 0 0
At STD N 00E0FFFF
Ne 0 ""
Po -1.27 -1.27
$EndPAD
$PAD
Sh "VO" C 1.397 1.397 0 0 0
Dr 0.8128 0 0
At STD N 00E0FFFF
Ne 0 ""
Po -1.27 1.27
$EndPAD
$SHAPE3D
Na "discret/to98.wrl"
Sc 1 1 1
Of 0 0 0
Ro 0 0 0
$EndSHAPE3D
$EndMODULE LM78LXX
$MODULE LM78XX
Po 0 0 0 15 00200000 00000000 ~~
Li LM78XX
Cd Regulateur TO220 serie LM78xx
Kw TR TO220
Sc 0
AR 
Op 0 0 0
T0 7.62 0 1.524 1.016 900 0.2032 N V 21 N "LM78XX"
T1 10.668 0.127 1.524 1.016 900 0.2032 N V 21 N "VAL*"
DS 0 -2.54 5.08 -2.54 0.3048 21
DS 0 0 5.08 0 0.3048 21
DS 0 2.54 5.08 2.54 0.3048 21
DS 5.08 -3.81 5.08 5.08 0.3048 21
DS 5.08 5.08 20.32 5.08 0.3048 21
DS 20.32 5.08 20.32 -5.08 0.3048 21
DS 5.08 -3.81 5.08 -5.08 0.3048 21
DS 12.7 3.81 12.7 -5.08 0.3048 21
DS 12.7 3.81 12.7 5.08 0.3048 21
DS 5.08 -5.08 20.32 -5.08 0.3048 21
$PAD
Sh "4" R 8.89 8.89 0 0 0
Dr 3.048 0 0
At STD N 00F0FFFF
Ne 0 ""
Po 16.51 0
$EndPAD
$PAD
Sh "VI" C 1.778 1.778 0 0 0
Dr 1.143 0 0
At STD N 00E0FFFF
Ne 0 ""
Po 0 -2.54
$EndPAD
$PAD
Sh "GND" R 1.778 1.778 0 0 0
Dr 1.143 0 0
At STD N 00E0FFFF
Ne 0 ""
Po 0 0
$EndPAD
$PAD
Sh "VO" C 1.778 1.778 0 0 0
Dr 1.143 0 0
At STD N 00E0FFFF
Ne 0 ""
Po 0 2.54
$EndPAD
$SHAPE3D
Na "discret/to220_horiz.wrl"
Sc 1 1 1
Of 0 0 0
Ro 0 0 0
$EndSHAPE3D
$EndMODULE LM78XX
$MODULE LM78XX-TO92
Po 0 0 0 15 4C5F8B36 00000000 ~~
Li LM78XX-TO92
Cd 7805
Kw TR TO92
Sc 0
AR 
Op 0 0 0
T0 -1.27 3.81 1.016 1.016 0 0.2032 N V 21 N "LM78XX-TO92"
T1 -1.27 -5.08 1.016 1.016 0 0.2032 N V 21 N "VAL**"
DS -1.27 2.54 2.54 -1.27 0.3048 21
DS 2.54 -1.27 2.54 -2.54 0.3048 21
DS 2.54 -2.54 1.27 -3.81 0.3048 21
DS 1.27 -3.81 -1.27 -3.81 0.3048 21
DS -1.27 -3.81 -3.81 -1.27 0.3048 21
DS -3.81 -1.27 -3.81 1.27 0.3048 21
DS -3.81 1.27 -2.54 2.54 0.3048 21
DS -2.54 2.54 -1.27 2.54 0.3048 21
$PAD
Sh "VI" R 1.397 1.397 0 0 0
Dr 0.8128 0 0
At STD N 00E0FFFF
Ne 0 ""
Po 1.27 -1.27
$EndPAD
$PAD
Sh "GND" C 1.397 1.397 0 0 0
Dr 0.8128 0 0
At STD N 00E0FFFF
Ne 0 ""
Po -1.27 -1.27
$EndPAD
$PAD
Sh "VO" C 1.397 1.397 0 0 0
Dr 0.8128 0 0
At STD N 00E0FFFF
Ne 0 ""
Po -1.27 1.27
$EndPAD
$SHAPE3D
Na "discret/to98.wrl"
Sc 1 1 1
Of 0 0 0
Ro 0 0 0
$EndSHAPE3D
$EndMODULE LM78XX-TO92
$MODULE LM78XXV
Po 0 0 0 15 4C5EE157 00000000 ~~
Li LM78XXV
Cd Regulateur TO220 serie LM78xx
Kw TR TO220
Sc 0
AR 
Op 0 0 0
T0 3.81 0 1.524 1.016 900 0.2032 N V 21 N "LM78XXV"
T1 -3.175 -0.635 1.524 1.016 900 0.2032 N V 21 N "VAL*"
DS 1.905 -4.445 2.54 -4.445 0.254 21
DS 2.54 -4.445 2.54 4.445 0.254 21
DS 2.54 4.445 1.905 4.445 0.254 21
DS -1.905 -4.445 1.905 -4.445 0.254 21
DS 1.905 -4.445 1.905 4.445 0.254 21
DS 1.905 4.445 -1.905 4.445 0.254 21
DS -1.905 4.445 -1.905 -4.445 0.254 21
$PAD
Sh "VI" C 1.778 1.778 0 0 0
Dr 1.143 0 0
At STD N 00E0FFFF
Ne 0 ""
Po 0 -2.54
$EndPAD
$PAD
Sh "GND" R 1.778 1.778 0 0 0
Dr 1.143 0 0
At STD N 00E0FFFF
Ne 0 ""
Po 0 0
$EndPAD
$PAD
Sh "VO" C 1.778 1.778 0 0 0
Dr 1.143 0 0
At STD N 00E0FFFF
Ne 0 ""
Po 0 2.54
$EndPAD
$EndMODULE LM78XXV
$MODULE LM79LXX
Po 0 0 0 15 00200000 00000000 ~~
Li LM79LXX
Cd Regulateur TO92 serie LM79Lxx
Kw TR TO92
Sc 0
AR 
Op 0 0 0
T0 -1.27 3.81 1.016 1.016 0 0.2032 N V 21 N "LM79LXX"
T1 -0.635 -5.08 1.016 1.016 0 0.2032 N V 21 N "VAL**"
DS -1.27 2.54 2.54 -1.27 0.3048 21
DS 2.54 -1.27 2.54 -2.54 0.3048 21
DS 2.54 -2.54 1.27 -3.81 0.3048 21
DS 1.27 -3.81 -1.27 -3.81 0.3048 21
DS -1.27 -3.81 -3.81 -1.27 0.3048 21
DS -3.81 -1.27 -3.81 1.27 0.3048 21
DS -3.81 1.27 -2.54 2.54 0.3048 21
DS -2.54 2.54 -1.27 2.54 0.3048 21
$PAD
Sh "VI" C 1.397 1.397 0 0 0
Dr 0.8128 0 0
At STD N 00E0FFFF
Ne 0 ""
Po -1.27 -1.27
$EndPAD
$PAD
Sh "VO" C 1.397 1.397 0 0 0
Dr 0.8128 0 0
At STD N 00E0FFFF
Ne 0 ""
Po 1.27 -1.27
$EndPAD
$PAD
Sh "GND" R 1.397 1.397 0 0 0
Dr 0.8128 0 0
At STD N 00E0FFFF
Ne 0 ""
Po -1.27 1.27
$EndPAD
$SHAPE3D
Na "discret/to98.wrl"
Sc 1 1 1
Of 0 0 0
Ro 0 0 0
$EndSHAPE3D
$EndMODULE LM79LXX
$MODULE LM79XX
Po 0 0 0 15 00200000 00000000 ~~
Li LM79XX
Cd Regulateur TO220 serie LM79xx
Kw TR TO220
Sc 0
AR 
Op 0 0 0
T0 7.239 -0.127 1.524 1.016 900 0.2032 N V 21 N "LM79XX"
T1 10.922 -0.127 1.524 1.016 900 0.2032 N V 21 N "VAL*"
DS 0 -2.54 5.08 -2.54 0.3048 21
DS 0 0 5.08 0 0.3048 21
DS 0 2.54 5.08 2.54 0.3048 21
DS 5.08 -3.81 5.08 5.08 0.3048 21
DS 5.08 5.08 20.32 5.08 0.3048 21
DS 20.32 5.08 20.32 -5.08 0.3048 21
DS 20.32 -5.08 5.08 -5.08 0.3048 21
DS 5.08 -5.08 5.08 -3.81 0.3048 21
DS 12.7 3.81 12.7 -5.08 0.3048 21
DS 12.7 3.81 12.7 5.08 0.3048 21
$PAD
Sh "VO" C 1.778 1.778 0 0 0
Dr 1.143 0 0
At STD N 00E0FFFF
Ne 0 ""
Po 0 2.54
$EndPAD
$PAD
Sh "GND" R 1.778 1.778 0 0 0
Dr 1.143 0 0
At STD N 00E0FFFF
Ne 0 ""
Po 0 -2.54
$EndPAD
$PAD
Sh "VI" C 1.778 1.778 0 0 0
Dr 1.143 0 0
At STD N 00E0FFFF
Ne 0 ""
Po 0 0
$EndPAD
$PAD
Sh "4" R 8.89 8.89 0 0 0
Dr 3.048 0 0
At STD N 00F0FFFF
Ne 0 ""
Po 16.51 0
$EndPAD
$SHAPE3D
Na "discret/to220_horiz.wrl"
Sc 1 1 1
Of 0 0 0
Ro 0 0 0
$EndSHAPE3D
$EndMODULE LM79XX
$MODULE MICROSWITCH_SPST
Po 0 0 0 15 48075FE7 00000000 ~~
Li MICROSWITCH_SPST
Cd Connecteur 3 pins
Kw CONN DEV
Sc 0
AR 
Op 0 0 0
T0 0 -2.54 1.016 1.016 0 0.254 N V 21 N "MICROSWITCH_SPST"
T1 0 -2.54 1.016 1.016 0 0.254 N I 21 N "Val**"
DS -3.81 1.27 -3.81 -1.27 0.3048 21
DS -3.81 -1.27 3.81 -1.27 0.3048 21
DS 3.81 -1.27 3.81 1.27 0.3048 21
DS 3.81 1.27 -3.81 1.27 0.3048 21
DS -1.27 -1.27 -1.27 1.27 0.3048 21
$PAD
Sh "1" R 1.397 1.397 0 0 0
Dr 0.8128 0 0
At STD N 00E0FFFF
Ne 0 ""
Po -2.54 0
$EndPAD
$PAD
Sh "2" C 1.397 1.397 0 0 0
Dr 0.8128 0 0
At STD N 00E0FFFF
Ne 0 ""
Po 0 0
$EndPAD
$PAD
Sh "3" C 1.397 1.397 0 0 0
Dr 0.8128 0 0
At STD N 00E0FFFF
Ne 0 ""
Po 2.54 0
$EndPAD
$SHAPE3D
Na "device/switch_slide_straight_terminal.wrl"
Sc 0.33 0.33 0.33
Of 0 0 0
Ro 0 0 0
$EndSHAPE3D
$EndMODULE MICROSWITCH_SPST
$MODULE MICROSWITCH_SPST_H
Po 0 0 0 15 48119E63 00000000 ~~
Li MICROSWITCH_SPST_H
Cd Connecteur 3 pins
Kw CONN DEV
Sc 0
AR 
Op 0 0 0
T0 0 2.794 1.016 1.016 0 0.254 N V 21 N "MICROSWITCH_SPST"
T1 0 5.08 1.016 1.016 0 0.254 N V 21 N "Val**"
DS 5.08 6.858 -5.08 6.858 0.2032 21
DS -5.08 1.27 5.08 1.27 0.2032 21
DS 0.508 7.366 0.508 9.398 0.2032 21
DS -1.524 7.366 -1.524 9.398 0.2032 21
DS -3.556 6.858 -3.556 7.366 0.2032 21
DS -3.556 7.366 2.032 7.366 0.2032 21
DS 2.032 7.366 2.032 6.858 0.2032 21
DS -1.524 9.398 0.508 9.398 0.2032 21
DS 2.54 0 2.54 1.27 0.2032 21
DS 0 0 0 1.27 0.2032 21
DS -2.54 0 -2.54 1.27 0.2032 21
DS 5.08 1.27 5.08 6.858 0.2032 21
DS -5.08 1.27 -5.08 6.858 0.2032 21
$PAD
Sh "1" R 1.397 1.397 0 0 0
Dr 0.8128 0 0
At STD N 00E0FFFF
Ne 0 ""
Po -2.54 0
$EndPAD
$PAD
Sh "2" C 1.397 1.397 0 0 0
Dr 0.8128 0 0
At STD N 00E0FFFF
Ne 0 ""
Po 0 0
$EndPAD
$PAD
Sh "3" C 1.397 1.397 0 0 0
Dr 0.8128 0 0
At STD N 00E0FFFF
Ne 0 ""
Po 2.54 0
$EndPAD
$SHAPE3D
Na "device/switch_slide_right_angle_terminal.wrl"
Sc 0.33 0.33 0.33
Of 0 0 0
Ro 0 0 0
$EndSHAPE3D
$EndMODULE MICROSWITCH_SPST_H
$MODULE MIRE
Po 41.148 117.856 0 15 00200000 00000000 ~~
Li MIRE
Sc 0
AR 
Op 0 0 0
T0 -0.127 4.572 1.016 1.016 0 0.2032 N I 21 N "MIRE"
T1 3.302 2.794 1.524 1.524 0 0.2032 N I 21 N "*"
DC 0 0 2.54 1.905 0.381 21
$PAD
Sh "" R 2.794 0.254 0 0 0
Dr 0 0 0
At STD N 00E0FFFF
Ne 0 ""
Po -1.524 0
$EndPAD
$PAD
Sh "" R 0.254 2.794 0 0 0
Dr 0 0 0
At STD N 00E0FFFF
Ne 0 ""
Po 0 -1.524
$EndPAD
$PAD
Sh "" C 0.254 0.254 0 0 0
Dr 0.0508 0 0
At STD N 00C0FFFF
Ne 0 ""
Po 0 0
$EndPAD
$PAD
Sh "" R 2.286 0.254 0 0 0
Dr 0 0 0
At STD N 00E0FFFF
Ne 0 ""
Po -1.524 0
$EndPAD
$PAD
Sh "" R 0.254 2.794 0 0 0
Dr 0 0 0
At STD N 00E0FFFF
Ne 0 ""
Po 0 1.524
$EndPAD
$PAD
Sh "" R 2.794 0.254 0 0 0
Dr 0 0 0
At STD N 00E0FFFF
Ne 0 ""
Po 1.524 0
$EndPAD
$EndMODULE MIRE
$MODULE OSC_DIP8
Po 44.45 127 0 15 00200000 00000000 ~~
Li OSC_DIP8
Cd Oscillateur - taille DIP8
Sc 0
AR 
Op 0 0 0
T0 0 -1.27 1.524 1.016 0 0.2032 N V 21 N "X***"
T1 0 1.27 1.524 1.016 0 0.2032 N V 21 N "OSC_DIP8"
DS -5.715 -5.969 -5.969 -5.715 0.2032 21
DS -5.969 -5.715 -5.969 5.715 0.2032 21
DS -5.969 5.715 -5.715 5.969 0.2032 21
DS -5.715 5.969 5.715 5.969 0.2032 21
DS 5.715 5.969 5.969 5.715 0.2032 21
DS 5.969 5.715 5.969 -5.715 0.2032 21
DS 5.969 -5.715 5.715 -5.969 0.2032 21
DS 5.715 -5.969 -5.715 -5.969 0.2032 21
DS -5.715 -6.604 -6.604 -5.715 0.2032 21
DS -6.604 -5.715 -6.604 6.604 0.2032 21
DS -6.604 6.604 5.715 6.604 0.2032 21
DS 5.715 6.604 6.604 5.715 0.2032 21
DS 6.604 5.715 6.604 -5.715 0.2032 21
DS 6.604 -5.715 5.715 -6.604 0.2032 21
DS 5.715 -6.604 -5.715 -6.604 0.2032 21
$PAD
Sh "1" R 1.651 1.651 0 0 0
Dr 0.8128 0 0
At STD N 00E0FFFF
Ne 0 ""
Po -3.81 3.81
$EndPAD
$PAD
Sh "8" C 1.651 1.651 0 0 0
Dr 0.8128 0 0
At STD N 00E0FFFF
Ne 0 ""
Po -3.81 -3.81
$EndPAD
$PAD
Sh "5" C 1.651 1.651 0 0 0
Dr 0.8128 0 0
At STD N 00E0FFFF
Ne 0 ""
Po 3.81 -3.81
$EndPAD
$PAD
Sh "4" C 1.651 1.651 0 0 0
Dr 0.8128 0 0
At STD N 00E0FFFF
Ne 0 ""
Po 3.81 3.81
$EndPAD
$EndMODULE OSC_DIP8
$MODULE PUSH_BUTT_SHAPE1
Po 0 0 0 15 440C0DAE 00000000 ~~
Li PUSH_BUTT_SHAPE1
Sc 0
AR 
Op 0 0 0
T0 0 0 1.00076 1.00076 0 0.09906 N V 21 N "PUSH_BUTT_SHAPE1"
T1 0 -4.54914 1.27 1.27 0 0.2032 N V 21 N "VAL**"
DC 0 0 2.60096 5.84962 0.381 21
DS 2.60096 5.84962 -2.60096 5.84962 0.381 21
$PAD
Sh "1" C 1.99898 1.99898 0 0 0
Dr 0.508 0 0
At STD N 00E0FFFF
Ne 0 ""
Po -2.49936 -2.49936
$EndPAD
$PAD
Sh "2" C 1.99898 1.99898 0 0 0
Dr 0.508 0 0
At STD N 00E0FFFF
Ne 0 ""
Po 2.49936 -2.49936
$EndPAD
$PAD
Sh "4" C 1.99898 1.99898 0 0 0
Dr 0.508 0 0
At STD N 00E0FFFF
Ne 0 ""
Po 2.49936 2.49936
$EndPAD
$PAD
Sh "3" C 1.99898 1.99898 0 0 0
Dr 0.508 0 0
At STD N 00E0FFFF
Ne 0 ""
Po -2.49936 2.49936
$EndPAD
$SHAPE3D
Na "discret/push_butt_shape1_blue.wrl"
Sc 1 1 1
Of 0 0 0
Ro 0 0 0
$EndSHAPE3D
$EndMODULE PUSH_BUTT_SHAPE1
$MODULE QMONTRE
Po 0 0 0 15 5153222D 00000000 ~~
Li QMONTRE
Sc 0
AR 
Op 0 0 0
T0 -0.889 5.969 1 1 900 0.12 N V 21 N "QMONTRE"
T1 0.889 6.096 1 1 900 0.12 N I 21 N "VAL***"
DS -1.905 1.905 1.905 1.905 0.2032 21
DS 1.905 1.905 1.905 10.16 0.2032 21
DS 1.905 10.16 -1.905 10.16 0.2032 21
DS -1.905 10.16 -1.905 1.905 0.2032 21
DS -1.27 0 -1.27 1.905 0.2032 21
DS 1.27 0 1.27 1.905 0.2032 21
$PAD
Sh "1" C 1.27 1.27 0 0 0
Dr 0.8128 0 0
At STD N 00E0FFFF
Ne 2 "N-000130"
Po -1.27 0
$EndPAD
$PAD
Sh "2" C 1.27 1.27 0 0 0
Dr 0.8128 0 0
At STD N 00E0FFFF
Ne 1 "N-000129"
Po 1.27 0
$EndPAD
$SHAPE3D
Na "Devices/Crystal6.2x2.1.wrl"
Sc 1 1 1
Of 0 0 0
Ro 0 0 0
$EndSHAPE3D
$EndMODULE QMONTRE
$MODULE R1
Po 0 0 0 15 00200000 00000000 ~~
Li R1
Cd Resistance verticale
Kw R
Sc 0
AR 
Op A A 0
T0 -1.016 2.54 1.397 1.27 0 0.2032 N V 21 N "R1"
T1 -1.143 2.54 1.397 1.27 0 0.2032 N I 21 N "VAL*"
DS -1.27 0 1.27 0 0.381 21
DC -1.27 0 -0.635 1.27 0.381 21
$PAD
Sh "1" C 1.397 1.397 0 0 0
Dr 0.8128 0 0
At STD N 00E0FFFF
Ne 0 ""
Po -1.27 0
$EndPAD
$PAD
Sh "2" C 1.397 1.397 0 0 0
Dr 0.8128 0 0
At STD N 00E0FFFF
Ne 0 ""
Po 1.27 0
$EndPAD
$SHAPE3D
Na "discret/verti_resistor.wrl"
Sc 1 1 1
Of 0 0 0
Ro 0 0 0
$EndSHAPE3D
$EndMODULE R1
$MODULE R3
Po 0 0 0 15 4E4C0E65 00000000 ~~
Li R3
Cd Resitance 3 pas
Kw R
Sc 0
AR R3
Op 0 A 0
T0 0 0.127 1.397 1.27 0 0.2032 N I 21 N "R3"
T1 0 0.127 1.397 1.27 0 0.2032 N V 21 N "Val*"
DS -3.81 0 -3.302 0 0.2032 21
DS 3.81 0 3.302 0 0.2032 21
DS 3.302 0 3.302 -1.016 0.2032 21
DS 3.302 -1.016 -3.302 -1.016 0.2032 21
DS -3.302 -1.016 -3.302 1.016 0.2032 21
DS -3.302 1.016 3.302 1.016 0.2032 21
DS 3.302 1.016 3.302 0 0.2032 21
DS -3.302 -0.508 -2.794 -1.016 0.2032 21
$PAD
Sh "1" C 1.397 1.397 0 0 0
Dr 0.8128 0 0
At STD N 00E0FFFF
Ne 0 ""
Po -3.81 0
$EndPAD
$PAD
Sh "2" C 1.397 1.397 0 0 0
Dr 0.8128 0 0
At STD N 00E0FFFF
Ne 0 ""
Po 3.81 0
$EndPAD
$SHAPE3D
Na "discret/resistor.wrl"
Sc 0.3 0.3 0.3
Of 0 0 0
Ro 0 0 0
$EndSHAPE3D
$EndMODULE R3
$MODULE R3-5
Po 0 0 0 15 3F979F9F 00000000 ~~
Li R3-5
Sc 0
AR 
Op 0 0 0
T0 0 0 1.27 1.016 0 0.1524 N V 21 N "R3-5"
T1 0 0 1.27 1.016 0 0.1524 N I 21 N "Val*"
DS -3.81 -0.635 -3.81 1.27 0.127 21
DS -3.81 1.27 3.81 1.27 0.127 21
DS 3.81 1.27 3.81 -1.27 0.127 21
DS 3.81 -1.27 -3.81 -1.27 0.127 21
DS -3.81 -1.27 -3.81 -0.635 0.127 21
DS -4.445 0 -3.81 0 0.127 21
DS 3.81 0 4.445 0 0.127 21
DS -3.81 -0.635 -3.175 -1.27 0.127 21
$PAD
Sh "1" C 1.397 1.397 0 0 0
Dr 0.8128 0 0
At STD N 00E0FFFF
Ne 148 "N-000285"
Po -4.445 0
$EndPAD
$PAD
Sh "2" C 1.397 1.397 0 0 0
Dr 0.8128 0 0
At STD N 00E0FFFF
Ne 141 "N-000286"
Po 4.445 0
$EndPAD
$SHAPE3D
Na "discret/resistor.wrl"
Sc 0.35 0.35 0.3
Of 0 0 0
Ro 0 0 0
$EndSHAPE3D
$EndMODULE R3-5
$MODULE R3-LARGE_PADS
Po 0 0 0 15 47E26765 00000000 ~~
Li R3-LARGE_PADS
Cd Resitance 3 pas
Kw R
Sc 0
AR 
Op 0 A 0
T0 0 0 1.397 1.27 0 0.2032 N V 21 N "R3-LARGE_PADS"
T1 0 0 1.397 1.27 0 0.2032 N I 21 N "Val*"
DS -3.81 0 -3.302 0 0.3048 21
DS 3.81 0 3.302 0 0.3048 21
DS 3.302 0 3.302 -1.016 0.3048 21
DS 3.302 -1.016 -3.302 -1.016 0.3048 21
DS -3.302 -1.016 -3.302 1.016 0.3048 21
DS -3.302 1.016 3.302 1.016 0.3048 21
DS 3.302 1.016 3.302 0 0.3048 21
DS -3.302 -0.508 -2.794 -1.016 0.3048 21
$PAD
Sh "1" C 1.651 1.651 0 0 0
Dr 0.8128 0 0
At STD N 00E0FFFF
Ne 0 ""
Po -3.81 0
$EndPAD
$PAD
Sh "2" C 1.651 1.651 0 0 0
Dr 0.8128 0 0
At STD N 00E0FFFF
Ne 0 ""
Po 3.81 0
$EndPAD
$SHAPE3D
Na "discret/resistor.wrl"
Sc 0.3 0.3 0.3
Of 0 0 0
Ro 0 0 0
$EndSHAPE3D
$EndMODULE R3-LARGE_PADS
$MODULE R4
Po 0 0 0 15 00200000 00000000 ~~
Li R4
Cd Resitance 4 pas
Kw R
Sc 0
AR 
Op 0 A 0
T0 0 0 1.397 1.27 0 0.2032 N V 21 N "R4"
T1 0 0 1.397 1.27 0 0.2032 N I 21 N "Val*"
DS -5.08 0 -4.064 0 0.3048 21
DS -4.064 0 -4.064 -1.016 0.3048 21
DS -4.064 -1.016 4.064 -1.016 0.3048 21
DS 4.064 -1.016 4.064 1.016 0.3048 21
DS 4.064 1.016 -4.064 1.016 0.3048 21
DS -4.064 1.016 -4.064 0 0.3048 21
DS -4.064 -0.508 -3.556 -1.016 0.3048 21
DS 5.08 0 4.064 0 0.3048 21
$PAD
Sh "1" C 1.524 1.524 0 0 0
Dr 0.8128 0 0
At STD N 00E0FFFF
Ne 0 ""
Po -5.08 0
$EndPAD
$PAD
Sh "2" C 1.524 1.524 0 0 0
Dr 0.8128 0 0
At STD N 00E0FFFF
Ne 0 ""
Po 5.08 0
$EndPAD
$SHAPE3D
Na "discret/resistor.wrl"
Sc 0.4 0.4 0.4
Of 0 0 0
Ro 0 0 0
$EndSHAPE3D
$EndMODULE R4
$MODULE R4-5
Po 0 0 0 15 416E8E97 00000000 ~~
Li R4-5
Sc 0
AR 
Op 0 0 0
T0 0 0 1.524 1.016 0 0.3048 N V 21 N "Val*"
T1 0 0 1.524 1.016 0 0.3048 N I 21 N "R4-5"
DS -4.445 -1.27 -4.445 1.27 0.3048 21
DS -4.445 1.27 4.445 1.27 0.3048 21
DS 4.445 1.27 4.445 -1.27 0.3048 21
DS 4.445 -1.27 -4.445 -1.27 0.3048 21
DS -4.445 -0.635 -3.81 -1.27 0.3048 21
DS -4.445 0 -5.715 0 0.3048 21
DS 4.445 0 5.715 0 0.3048 21
$PAD
Sh "1" C 1.524 1.524 0 0 0
Dr 1.016 0 0
At STD N 00E0FFFF
Ne 1 "MASSE"
Po -5.715 0
$EndPAD
$PAD
Sh "2" C 1.524 1.524 0 0 0
Dr 1.016 0 0
At STD N 00E0FFFF
Ne 22 "GND"
Po 5.715 0
$EndPAD
$SHAPE3D
Na "discret/resistor.wrl"
Sc 0.45 0.45 0.45
Of 0 0 0
Ro 0 0 0
$EndSHAPE3D
$EndMODULE R4-5
$MODULE R4-LARGE_PADS
Po 0 0 0 15 47E2673E 00000000 ~~
Li R4-LARGE_PADS
Cd Resitance 4 pas
Kw R
Sc 0
AR 
Op 0 A 0
T0 0 0 1.397 1.27 0 0.2032 N V 21 N "R4-LARGE_PADS"
T1 0 0 1.397 1.27 0 0.2032 N I 21 N "Val*"
DS -5.08 0 -4.064 0 0.3048 21
DS -4.064 0 -4.064 -1.016 0.3048 21
DS -4.064 -1.016 4.064 -1.016 0.3048 21
DS 4.064 -1.016 4.064 1.016 0.3048 21
DS 4.064 1.016 -4.064 1.016 0.3048 21
DS -4.064 1.016 -4.064 0 0.3048 21
DS -4.064 -0.508 -3.556 -1.016 0.3048 21
DS 5.08 0 4.064 0 0.3048 21
$PAD
Sh "1" C 1.778 1.778 0 0 0
Dr 0.8128 0 0
At STD N 00E0FFFF
Ne 0 ""
Po -5.08 0
$EndPAD
$PAD
Sh "2" C 1.778 1.778 0 0 0
Dr 0.8128 0 0
At STD N 00E0FFFF
Ne 0 ""
Po 5.08 0
$EndPAD
$SHAPE3D
Na "discret/resistor.wrl"
Sc 0.4 0.4 0.4
Of 0 0 0
Ro 0 0 0
$EndSHAPE3D
$EndMODULE R4-LARGE_PADS
$MODULE R5
Po 0 0 0 15 00200000 00000000 ~~
Li R5
Cd Resistance 5 pas
Kw R
Sc 0
AR 
Op 0 A 0
T0 0 0 1.397 1.27 0 0.2032 N V 21 N "R5"
T1 0 0 1.397 1.27 0 0.2032 N I 21 N "Val*"
DS -6.35 0 -5.334 0 0.3048 21
DS 6.35 0 5.334 0 0.3048 21
DS 5.334 -1.27 5.334 1.27 0.3048 21
DS 5.334 1.27 -5.334 1.27 0.3048 21
DS -5.334 1.27 -5.334 -1.27 0.3048 21
DS -5.334 -1.27 5.334 -1.27 0.3048 21
DS -5.334 -0.762 -4.826 -1.27 0.3048 21
$PAD
Sh "1" C 1.524 1.524 0 0 0
Dr 0.8128 0 0
At STD N 00E0FFFF
Ne 0 ""
Po -6.35 0
$EndPAD
$PAD
Sh "2" C 1.524 1.524 0 0 0
Dr 0.8128 0 0
At STD N 00E0FFFF
Ne 0 ""
Po 6.35 0
$EndPAD
$SHAPE3D
Na "discret/resistor.wrl"
Sc 0.5 0.5 0.5
Of 0 0 0
Ro 0 0 0
$EndSHAPE3D
$EndMODULE R5
$MODULE R6
Po 0 0 0 15 00200000 00000000 ~~
Li R6
Cd Resistance 6 pas
Kw R
Sc 0
AR 
Op 0 A 0
T0 0 0 1.397 1.27 0 0.2032 N V 21 N "R6"
T1 0.254 0 1.397 1.27 0 0.2032 N I 21 N "Val*"
DS -6.35 -1.27 6.35 -1.27 0.3048 21
DS 6.35 -1.27 6.35 1.27 0.3048 21
DS 6.35 1.27 -6.35 1.27 0.3048 21
DS 6.35 0 7.62 0 0.3048 21
DS -7.62 0 -6.35 0 0.3048 21
DS -6.35 -0.508 -5.588 -1.27 0.3048 21
DS -6.35 -1.27 -6.35 1.27 0.3048 21
$PAD
Sh "1" C 1.778 1.778 0 0 0
Dr 1.143 0 0
At STD N 00E0FFFF
Ne 0 ""
Po -7.62 0
$EndPAD
$PAD
Sh "2" C 1.778 1.778 0 0 0
Dr 1.143 0 0
At STD N 00E0FFFF
Ne 0 ""
Po 7.62 0
$EndPAD
$SHAPE3D
Na "discret/resistor.wrl"
Sc 0.6 0.6 0.6
Of 0 0 0
Ro 0 0 0
$EndSHAPE3D
$EndMODULE R6
$MODULE R7
Po 0 0 0 15 00200000 00000000 ~~
Li R7
Cd Resitance 7 pas
Kw R
Sc 0
AR 
Op 0 A 0
T0 2.286 1.016 1.397 1.27 0 0.2032 N V 21 N "R7"
T1 -2.286 -1.27 1.397 1.27 0 0.2032 N V 21 N "Val*"
DS -8.89 0 -8.89 0 0.3048 21
DS -8.89 0 -8.89 0 0.3048 21
DS 6.985 0 8.89 0 0.3048 21
DS 8.89 0 8.89 0 0.3048 21
DS 6.985 2.54 -6.985 2.54 0.3048 21
DS -6.985 -2.54 6.985 -2.54 0.3048 21
DS -6.985 -1.27 -5.715 -2.54 0.3048 21
DS 6.985 -2.54 6.985 2.54 0.3048 21
DS -6.985 -2.54 -6.985 2.54 0.3048 21
DS -8.89 0 -6.985 0 0.3048 21
$PAD
Sh "1" C 1.778 1.778 0 0 0
Dr 1.27 0 0
At STD N 00E0FFFF
Ne 0 ""
Po -8.89 0
$EndPAD
$PAD
Sh "2" C 1.778 1.778 0 0 0
Dr 1.27 0 0
At STD N 00E0FFFF
Ne 0 ""
Po 8.89 0
$EndPAD
$SHAPE3D
Na "discret/resistor.wrl"
Sc 0.7 0.7 0.7
Of 0 0 0
Ro 0 0 0
$EndSHAPE3D
$EndMODULE R7
$MODULE RV2
Po 0 0 0 15 3FA15781 00000000 ~~
Li RV2
Cd Resistance variable / potentiometre
Kw R
Sc 0
AR 
Op A A 0
T0 0 -5.08 1.397 1.27 0 0.2032 N V 21 N "Val*"
T1 -0.254 5.207 1.397 1.27 0 0.2032 N V 21 N "RV2"
DC 0 0.381 0 -3.175 0.2032 21
$PAD
Sh "1" C 1.524 1.524 0 0 0
Dr 0.8128 0 0
At STD N 00E0FFFF
Ne 0 ""
Po -2.54 1.27
$EndPAD
$PAD
Sh "2" C 1.524 1.524 0 0 0
Dr 0.8128 0 0
At STD N 00E0FFFF
Ne 0 ""
Po 0 -1.27
$EndPAD
$PAD
Sh "3" C 1.524 1.524 0 0 0
Dr 0.8128 0 0
At STD N 00E0FFFF
Ne 0 ""
Po 2.54 1.27
$EndPAD
$SHAPE3D
Na "discret/adjustable_rx2.wrl"
Sc 1 1 1
Of 0 0 0
Ro 0 0 0
$EndSHAPE3D
$EndMODULE RV2
$MODULE RV2X4
Po 0 0 0 15 00200000 00000000 ~~
Li RV2X4
Cd Resistance variable / Potentiometre
Kw R
Sc 0
AR 
Op 0 0 0
T0 -2.54 -5.08 1.397 1.27 0 0.2032 N V 21 N "Val*"
T1 -1.651 5.461 1.397 1.27 0 0.2032 N V 21 N "RV2X4"
DS -7.62 -3.81 3.81 -3.81 0.3048 21
DS 3.81 -3.81 6.35 -1.27 0.3048 21
DS 6.35 -1.27 6.35 1.27 0.3048 21
DS 6.35 1.27 3.81 3.81 0.3048 21
DS 3.81 3.81 -7.62 3.81 0.3048 21
DS -7.62 3.81 -7.62 -3.81 0.3048 21
DS 0.762 -3.81 1.905 -3.81 0.3048 21
DS 1.651 3.81 0.762 3.81 0.3048 21
DS -2.54 -0.508 4.953 -0.508 0.3048 21
DS -2.54 0.508 4.953 0.508 0.3048 21
DC 1.27 0 -2.54 -0.635 0.3048 21
$PAD
Sh "1" C 2.032 2.032 0 0 0
Dr 1.27 0 0
At STD N 00E0FFFF
Ne 0 ""
Po -5.08 -2.54
$EndPAD
$PAD
Sh "2" C 2.032 2.032 0 0 0
Dr 1.27 0 0
At STD N 00E0FFFF
Ne 0 ""
Po 5.08 0
$EndPAD
$PAD
Sh "3" C 2.032 2.032 0 0 0
Dr 1.27 0 0
At STD N 00E0FFFF
Ne 0 ""
Po -5.08 2.54
$EndPAD
$SHAPE3D
Na "discret/adjustable_rx2v4.wrl"
Sc 1 1 1
Of 0 0 0
Ro 0 0 0
$EndSHAPE3D
$EndMODULE RV2X4
$MODULE SELF1408
Po 151.13 284.48 0 15 00200000 00000000 ~~
Li SELF1408
Cd Self Ferrite 14 - 08
Kw SELF
Sc 0
AR 
Op 0 0 0
T0 0 -5.08 2.54 1.27 0 0.3048 N V 21 N "S***"
T1 0 0 2.54 1.27 0 0.3048 N V 21 N "SELF1408"
DS -7.62 -3.81 -7.62 3.81 0.381 21
DS -7.62 3.81 -3.81 7.62 0.381 21
DS -3.81 7.62 3.81 7.62 0.381 21
DS 3.81 7.62 7.62 3.81 0.381 21
DS 7.62 3.81 7.62 -3.81 0.381 21
DS 7.62 -3.81 3.81 -7.62 0.381 21
DS 3.81 -7.62 -3.81 -7.62 0.381 21
DS -3.81 -7.62 -7.62 -3.81 0.381 21
$PAD
Sh "1" C 2.032 2.032 0 0 0
Dr 1.27 0 0
At STD N 00E0FFFF
Ne 0 ""
Po -7.62 0
$EndPAD
$PAD
Sh "1" C 2.032 2.032 0 0 0
Dr 1.27 0 0
At STD N 00E0FFFF
Ne 0 ""
Po -5.08 2.54
$EndPAD
$PAD
Sh "1" C 2.032 2.032 0 0 0
Dr 1.27 0 0
At STD N 00E0FFFF
Ne 0 ""
Po -5.08 -2.54
$EndPAD
$PAD
Sh "2" C 2.032 2.032 0 0 0
Dr 1.27 0 0
At STD N 00E0FFFF
Ne 0 ""
Po 5.08 -2.54
$EndPAD
$PAD
Sh "2" C 2.032 2.032 0 0 0
Dr 1.27 0 0
At STD N 00E0FFFF
Ne 0 ""
Po 7.62 0
$EndPAD
$PAD
Sh "2" C 2.032 2.032 0 0 0
Dr 1.27 0 0
At STD N 00E0FFFF
Ne 0 ""
Po 5.08 2.54
$EndPAD
$PAD
Sh "0" C 2.032 2.032 0 0 0
Dr 1.27 0 0
At STD N 00E0FFFF
Ne 0 ""
Po 0 7.62
$EndPAD
$EndMODULE SELF1408
$MODULE SELF1418
Po 151.13 260.35 0 15 00200000 00000000 ~~
Li SELF1418
Cd Self Ferrite 14 - 18
Kw SELF
Sc 0
AR 
Op 0 0 0
T0 0 -7.62 1.524 1.016 0 0.3048 N V 21 N "S***"
T1 0 0 1.524 1.016 0 0.3048 N V 21 N "SELF1418"
DS -10.16 -5.08 -10.16 5.08 0.381 21
DS -10.16 5.08 -5.08 10.16 0.381 21
DS -5.08 10.16 5.08 10.16 0.381 21
DS 5.08 10.16 10.16 5.08 0.381 21
DS 10.16 5.08 10.16 -5.08 0.381 21
DS 10.16 -5.08 5.08 -10.16 0.381 21
DS 5.08 -10.16 -5.08 -10.16 0.381 21
DS -5.08 -10.16 -10.16 -5.08 0.381 21
$PAD
Sh "" C 2.032 2.032 0 0 0
Dr 1.27 0 0
At STD N 00E0FFFF
Ne 0 ""
Po -7.62 0
$EndPAD
$PAD
Sh "" C 2.032 2.032 0 0 0
Dr 1.27 0 0
At STD N 00E0FFFF
Ne 0 ""
Po 7.62 0
$EndPAD
$PAD
Sh "1" C 2.032 2.032 0 0 0
Dr 1.27 0 0
At STD N 00E0FFFF
Ne 0 ""
Po -5.08 -2.54
$EndPAD
$PAD
Sh "1" C 2.032 2.032 0 0 0
Dr 1.27 0 0
At STD N 00E0FFFF
Ne 0 ""
Po -5.08 -5.08
$EndPAD
$PAD
Sh "2" C 2.032 2.032 0 0 0
Dr 1.27 0 0
At STD N 00E0FFFF
Ne 0 ""
Po 5.08 -2.54
$EndPAD
$PAD
Sh "2" C 2.032 2.032 0 0 0
Dr 1.27 0 0
At STD N 00E0FFFF
Ne 0 ""
Po 5.08 -5.08
$EndPAD
$PAD
Sh "3" C 2.032 2.032 0 0 0
Dr 1.27 0 0
At STD N 00E0FFFF
Ne 0 ""
Po 5.08 5.08
$EndPAD
$PAD
Sh "3" C 2.032 2.032 0 0 0
Dr 1.27 0 0
At STD N 00E0FFFF
Ne 0 ""
Po 5.08 2.54
$EndPAD
$PAD
Sh "4" C 2.032 2.032 0 0 0
Dr 1.27 0 0
At STD N 00E0FFFF
Ne 0 ""
Po -5.08 5.08
$EndPAD
$PAD
Sh "4" C 2.032 2.032 0 0 0
Dr 1.27 0 0
At STD N 00E0FFFF
Ne 0 ""
Po -5.08 2.54
$EndPAD
$EndMODULE SELF1418
$MODULE SUBCLICK
Po 0 0 0 15 416BBA18 00000000 ~~
Li SUBCLICK
Cd Connecteur Subclick
Kw CONN DEV
Sc 0
AR 
Op 0 0 0
T0 0 6.35 1.524 1.016 0 0.3048 N V 21 N "SUBCLICK"
T1 -0.254 -6.35 2.032 1.27 0 0.3048 N V 21 N "P***"
DS -2.54 -1.27 -1.27 -2.54 0.3048 21
DS -1.27 -2.54 17.78 -2.54 0.3048 21
DS 17.78 -2.54 17.78 2.54 0.3048 21
DS 17.78 2.54 -1.27 2.54 0.3048 21
DS -1.27 2.54 -2.54 1.27 0.3048 21
DS -2.54 1.27 -2.54 -1.27 0.3048 21
DS -3.81 -5.08 3.81 -5.08 0.3048 21
DS 3.81 -5.08 5.08 -3.81 0.3048 21
DS 5.08 -3.81 5.08 3.81 0.3048 21
DS 5.08 3.81 3.81 5.08 0.3048 21
DS 3.81 5.08 -3.81 5.08 0.3048 21
DS -3.81 5.08 -5.08 3.81 0.3048 21
DS -5.08 3.81 -5.08 -3.81 0.3048 21
DS -5.08 -3.81 -3.81 -5.08 0.3048 21
$PAD
Sh "1" C 1.778 1.778 0 0 0
Dr 1.016 0 0
At STD N 00E0FFFF
Ne 0 ""
Po 0 0
$EndPAD
$PAD
Sh "2" C 3.048 3.048 0 0 0
Dr 1.524 0 0
At STD N 00E0FFFF
Ne 0 ""
Po -2.54 -2.54
$EndPAD
$PAD
Sh "2" C 3.048 3.048 0 0 0
Dr 1.524 0 0
At STD N 00E0FFFF
Ne 0 ""
Po 2.54 -2.54
$EndPAD
$PAD
Sh "2" C 3.048 3.048 0 0 0
Dr 1.524 0 0
At STD N 00E0FFFF
Ne 0 ""
Po 2.54 2.54
$EndPAD
$PAD
Sh "2" C 3.048 3.048 0 0 0
Dr 1.524 0 0
At STD N 00E0FFFF
Ne 0 ""
Po -2.54 2.54
$EndPAD
$SHAPE3D
Na "connectors/subclick_horiz.wrl"
Sc 1 1 1
Of 0 0 0
Ro 0 0 0
$EndSHAPE3D
$EndMODULE SUBCLICK
$MODULE SUPER_CAP
Po 0 0 0 15 4512B411 00000000 ~~
Li SUPER_CAP
Sc 0
AR 
Op 0 0 0
T0 0.508 -3.556 1.524 1.016 0 0.2032 N V 21 N "SUPER_CAP"
T1 0 3.556 1.524 1.016 0 0.2032 N V 21 N "VAL**"
T2 4.445 -1.778 1.524 1.524 0 0.2032 N V 21 N "+"
DC 0 0 0 -5.588 0.381 21
DS -6.35 1.905 0 1.905 0.381 21
DS 0 1.905 1.27 0.635 0.381 21
DS 1.27 0.635 1.27 -0.635 0.381 21
DS 1.27 -0.635 0 -1.905 0.381 21
DS 0 -1.905 -6.35 -1.905 0.381 21
DS -6.35 -1.905 -6.35 1.905 0.381 21
DS -5.715 0 -6.35 0 0.3048 21
$PAD
Sh "2" C 1.905 1.905 0 0 0
Dr 1.1938 0 0
At STD N 00E0FFFF
Ne 5 "GND"
Po -6.35 0
$EndPAD
$PAD
Sh "1" C 1.905 1.905 0 0 0
Dr 1.1938 0 0
At STD N 00E0FFFF
Ne 43 "N-000301"
Po 3.81 0
$EndPAD
$EndMODULE SUPER_CAP
$MODULE SWDIP4
Po 66.04 261.62 0 15 00200000 00000000 ~~
Li SWDIP4
Cd Switch Dil 4 elements
Kw SWITCH DEV
Sc 0
AR 
Op 0 0 0
T0 0 6.35 1.27 1.524 0 0.3048 N V 21 N "SWDIP4"
T1 0 -6.35 1.27 1.524 0 0.3048 N V 21 N "SW**"
DS 5.08 -1.27 5.08 1.27 0.381 21
DS 5.08 1.27 -5.08 1.27 0.381 21
DS -5.08 1.27 -5.08 -1.27 0.381 21
DS -5.08 -1.27 5.08 -1.27 0.381 21
DS -6.35 5.08 -6.35 -5.08 0.381 21
DS -6.35 -5.08 6.35 -5.08 0.381 21
DS 6.35 -5.08 6.35 5.08 0.381 21
DS 6.35 5.08 -6.35 5.08 0.381 21
$PAD
Sh "1" R 1.524 1.524 0 0 0
Dr 0.8128 0 0
At STD N 00E0FFFF
Ne 0 ""
Po -3.81 3.81
$EndPAD
$PAD
Sh "2" C 1.524 1.524 0 0 0
Dr 0.8128 0 0
At STD N 00E0FFFF
Ne 0 ""
Po -1.27 3.81
$EndPAD
$PAD
Sh "3" C 1.524 1.524 0 0 0
Dr 0.8128 0 0
At STD N 00E0FFFF
Ne 0 ""
Po 1.27 3.81
$EndPAD
$PAD
Sh "4" C 1.524 1.524 0 0 0
Dr 0.8128 0 0
At STD N 00E0FFFF
Ne 0 ""
Po 3.81 3.81
$EndPAD
$PAD
Sh "5" C 1.524 1.524 0 0 0
Dr 0.8128 0 0
At STD N 00E0FFFF
Ne 0 ""
Po 3.81 -3.81
$EndPAD
$PAD
Sh "6" C 1.524 1.524 0 0 0
Dr 0.8128 0 0
At STD N 00E0FFFF
Ne 0 ""
Po 1.27 -3.81
$EndPAD
$PAD
Sh "7" C 1.524 1.524 0 0 0
Dr 0.8128 0 0
At STD N 00E0FFFF
Ne 0 ""
Po -1.27 -3.81
$EndPAD
$PAD
Sh "8" C 1.524 1.524 0 0 0
Dr 0.8128 0 0
At STD N 00E0FFFF
Ne 0 ""
Po -3.81 -3.81
$EndPAD
$EndMODULE SWDIP4
$MODULE SWDIP8
Po 93.98 261.62 0 15 00200000 00000000 ~~
Li SWDIP8
Cd Switch Dil 8 elements
Kw SWITCH DEV
Sc 0
AR 
Op 0 0 0
T0 0 0 1.27 1.524 0 0.3048 N V 21 N "SWDIP8"
T1 0 -6.35 1.27 1.524 0 0.3048 N V 21 N "SW**"
DS -11.43 5.08 11.43 5.08 0.381 21
DS 11.43 5.08 11.43 -5.08 0.381 21
DS 11.43 -5.08 -11.43 -5.08 0.381 21
DS -11.43 -5.08 -11.43 5.08 0.381 21
DS -10.16 -1.27 10.16 -1.27 0.381 21
DS 10.16 -1.27 10.16 1.27 0.381 21
DS 10.16 1.27 -10.16 1.27 0.381 21
DS -10.16 1.27 -10.16 -1.27 0.381 21
$PAD
Sh "1" R 1.524 1.524 0 0 0
Dr 0.8128 0 0
At STD N 00E0FFFF
Ne 0 ""
Po -8.89 3.81
$EndPAD
$PAD
Sh "2" C 1.524 1.524 0 0 0
Dr 0.8128 0 0
At STD N 00E0FFFF
Ne 0 ""
Po -6.35 3.81
$EndPAD
$PAD
Sh "3" C 1.524 1.524 0 0 0
Dr 0.8128 0 0
At STD N 00E0FFFF
Ne 0 ""
Po -3.81 3.81
$EndPAD
$PAD
Sh "4" C 1.524 1.524 0 0 0
Dr 0.8128 0 0
At STD N 00E0FFFF
Ne 0 ""
Po -1.27 3.81
$EndPAD
$PAD
Sh "5" C 1.524 1.524 0 0 0
Dr 0.8128 0 0
At STD N 00E0FFFF
Ne 0 ""
Po 1.27 3.81
$EndPAD
$PAD
Sh "6" C 1.524 1.524 0 0 0
Dr 0.8128 0 0
At STD N 00E0FFFF
Ne 0 ""
Po 3.81 3.81
$EndPAD
$PAD
Sh "7" C 1.524 1.524 0 0 0
Dr 0.8128 0 0
At STD N 00E0FFFF
Ne 0 ""
Po 6.35 3.81
$EndPAD
$PAD
Sh "8" C 1.524 1.524 0 0 0
Dr 0.8128 0 0
At STD N 00E0FFFF
Ne 0 ""
Po 8.89 3.81
$EndPAD
$PAD
Sh "9" C 1.524 1.524 0 0 0
Dr 0.8128 0 0
At STD N 00E0FFFF
Ne 0 ""
Po 8.89 -3.81
$EndPAD
$PAD
Sh "10" C 1.524 1.524 0 0 0
Dr 0.8128 0 0
At STD N 00E0FFFF
Ne 0 ""
Po 6.35 -3.81
$EndPAD
$PAD
Sh "11" C 1.524 1.524 0 0 0
Dr 0.8128 0 0
At STD N 00E0FFFF
Ne 0 ""
Po 3.81 -3.81
$EndPAD
$PAD
Sh "12" C 1.524 1.524 0 0 0
Dr 0.8128 0 0
At STD N 00E0FFFF
Ne 0 ""
Po 1.27 -3.81
$EndPAD
$PAD
Sh "13" C 1.524 1.524 0 0 0
Dr 0.8128 0 0
At STD N 00E0FFFF
Ne 0 ""
Po -1.27 -3.81
$EndPAD
$PAD
Sh "14" C 1.524 1.524 0 0 0
Dr 0.8128 0 0
At STD N 00E0FFFF
Ne 0 ""
Po -3.81 -3.81
$EndPAD
$PAD
Sh "15" C 1.524 1.524 0 0 0
Dr 0.8128 0 0
At STD N 00E0FFFF
Ne 0 ""
Po -6.35 -3.81
$EndPAD
$PAD
Sh "16" C 1.524 1.524 0 0 0
Dr 0.8128 0 0
At STD N 00E0FFFF
Ne 0 ""
Po -8.89 -3.81
$EndPAD
$EndMODULE SWDIP8
$MODULE SW_PUSH
Po 0 0 0 15 3F9504DA 00000000 ~~
Li SW_PUSH
Cd Bouton poussoir
Kw SWITCH DEV
Sc 0
AR 
Op 0 A 0
T0 1.27 -5.08 1.27 1.27 0 0.254 N V 21 N "BP***"
T1 0 0 1.27 1.27 0 0.254 N V 21 N "SW_PUSH"
DS 6.35 -5.715 6.35 5.715 0.2032 21
DS 6.35 5.715 5.715 6.35 0.2032 21
DS 5.715 6.35 -5.715 6.35 0.2032 21
DS -5.715 6.35 -6.35 5.715 0.2032 21
DS -6.35 5.715 -6.35 -5.715 0.2032 21
DS -5.715 -6.35 5.715 -6.35 0.2032 21
DS 5.715 -6.35 6.35 -5.715 0.2032 21
DS -6.35 -5.715 -5.715 -6.35 0.2032 21
$PAD
Sh "1" C 2.54 2.54 0 0 0
Dr 1.143 0 0
At STD N 00E0FFFF
Ne 0 ""
Po -5.08 -2.54
$EndPAD
$PAD
Sh "2" C 2.54 2.54 0 0 0
Dr 1.143 0 0
At STD N 00E0FFFF
Ne 0 ""
Po 5.08 2.54
$EndPAD
$SHAPE3D
Na "device/switch_push.wrl"
Sc 1 1 1
Of 0 0 0
Ro 0 0 0
$EndSHAPE3D
$EndMODULE SW_PUSH
$MODULE SW_PUSH-12mm
Po 0 0 0 15 4C612761 00000000 ~~
Li SW_PUSH-12mm
Sc 0
AR 
Op 0 0 0
T0 0 -0.762 1.016 1.016 0 0.2032 N V 21 N "SW_PUSH-12mm"
T1 0 1.016 1.016 1.016 0 0.2032 N V 21 N "Val**"
DC 0 0 3.81 2.54 0.254 21
DS -6.35 -6.35 6.35 -6.35 0.254 21
DS 6.35 -6.35 6.35 6.35 0.254 21
DS 6.35 6.35 -6.35 6.35 0.254 21
DS -6.35 6.35 -6.35 -6.35 0.254 21
$PAD
Sh "1" O 3.048 1.7272 0 0 0
Dr 0.8128 0 0
At STD N 00E0FFFF
Ne 0 ""
Po 6.35 -2.54
$EndPAD
$PAD
Sh "2" O 3.048 1.7272 0 0 0
Dr 0.8128 0 0
At STD N 00E0FFFF
Ne 0 ""
Po 6.35 2.54
$EndPAD
$PAD
Sh "1" O 3.048 1.7272 0 0 0
Dr 0.8128 0 0
At STD N 00E0FFFF
Ne 0 ""
Po -6.35 -2.54
$EndPAD
$PAD
Sh "2" O 3.048 1.7272 0 0 0
Dr 0.8128 0 0
At STD N 00E0FFFF
Ne 0 ""
Po -6.35 2.54
$EndPAD
$EndMODULE SW_PUSH-12mm
$MODULE SW_PUSH_SMALL
Po 0 0 0 15 46544DB3 00000000 ~~
Li SW_PUSH_SMALL
Sc 0
AR 
Op 0 0 0
T0 0 -0.762 1.016 1.016 0 0.2032 N V 21 N "SW_PUSH_SMALL"
T1 0 1.016 1.016 1.016 0 0.2032 N V 21 N "Val**"
DC 0 0 0 -2.54 0.127 21
DS -3.81 -3.81 3.81 -3.81 0.127 21
DS 3.81 -3.81 3.81 3.81 0.127 21
DS 3.81 3.81 -3.81 3.81 0.127 21
DS -3.81 -3.81 -3.81 3.81 0.127 21
$PAD
Sh "1" C 1.397 1.397 0 0 0
Dr 0.8128 0 0
At STD N 00E0FFFF
Ne 0 ""
Po 3.81 -2.54
$EndPAD
$PAD
Sh "2" C 1.397 1.397 0 0 0
Dr 0.8128 0 0
At STD N 00E0FFFF
Ne 0 ""
Po 3.81 2.54
$EndPAD
$PAD
Sh "1" C 1.397 1.397 0 0 0
Dr 0.8128 0 0
At STD N 00E0FFFF
Ne 0 ""
Po -3.81 -2.54
$EndPAD
$PAD
Sh "2" C 1.397 1.397 0 0 0
Dr 0.8128 0 0
At STD N 00E0FFFF
Ne 0 ""
Po -3.81 2.54
$EndPAD
$EndMODULE SW_PUSH_SMALL
$MODULE SW_SPDT
Po 0 0 0 15 4480057B 00000000 ~~
Li SW_SPDT
Cd Switch inverseur
Kw SWITCH DEV
Sc 0
AR 
Op 0 0 0
T0 9.017 2.413 1.016 1.016 1800 0.2032 N V 21 N "SW_SPDT"
T1 8.89 -2.286 1.016 1.016 1800 0.2032 N V 21 N "SW*"
DS -1.27 -5.715 -1.27 -5.08 0.3048 21
DS -1.27 -5.08 -1.27 -4.445 0.3048 21
DS -1.27 -4.445 2.54 -4.445 0.3048 21
DS -1.27 -5.715 2.54 -5.715 0.3048 21
DS 2.54 -0.635 -1.27 -0.635 0.3048 21
DS -1.27 -0.635 -1.27 0.635 0.3048 21
DS -1.27 0.635 2.54 0.635 0.3048 21
DS 2.54 4.445 -1.27 4.445 0.3048 21
DS -1.27 4.445 -1.27 5.715 0.3048 21
DS -1.27 5.715 2.54 5.715 0.3048 21
DS 2.54 -6.35 2.54 6.35 0.3048 21
DS 2.54 6.35 15.24 6.35 0.3048 21
DS 15.24 6.35 15.24 -6.35 0.3048 21
DS 15.24 -6.35 2.54 -6.35 0.3048 21
DS 15.24 -3.175 22.86 -3.175 0.3048 21
DS 22.86 -3.175 22.86 3.175 0.3048 21
DS 22.86 3.175 15.24 3.175 0.3048 21
DS 22.86 -1.27 33.02 -3.175 0.3048 21
DS 33.02 -3.175 33.655 -3.175 0.3048 21
DS 33.655 -3.175 34.29 -2.54 0.3048 21
DS 34.29 -2.54 34.29 -1.905 0.3048 21
DS 34.29 -1.905 34.29 -1.27 0.3048 21
DS 34.29 -1.27 33.655 -0.635 0.3048 21
DS 33.655 -0.635 22.86 1.27 0.3048 21
$PAD
Sh "2" R 3.81 2.54 0 0 0
Dr 1.27 0 0
At STD N 00E0FFFF
Ne 0 ""
Po 0 0
$EndPAD
$PAD
Sh "1" R 3.81 2.54 0 0 0
Dr 1.27 0 0
At STD N 00E0FFFF
Ne 0 ""
Po 0 -5.08
$EndPAD
$PAD
Sh "3" R 3.81 2.54 0 0 0
Dr 1.27 0 0
At STD N 00E0FFFF
Ne 0 ""
Po 0 5.08
$EndPAD
$PAD
Sh "H1" C 2.54 2.54 0 0 0
Dr 1.27 0 0
At STD N 00E0FFFF
Ne 0 ""
Po 19.05 -3.81
$EndPAD
$PAD
Sh "H2" C 2.54 2.54 0 0 0
Dr 1.27 0 0
At STD N 00E0FFFF
Ne 0 ""
Po 19.05 3.81
$EndPAD
$EndMODULE SW_SPDT
$MODULE TEST_POINT_2PADS
Po 0 0 0 15 4D78F0EB 00000000 ~~
Li TEST_POINT_2PADS
Cd Connecteurs 2 pins
Kw CONN DEV
Sc 0
AR /47BD3A9D/4D6E599A
Op 0 0 0
T0 0.03048 -1.92024 0.762 0.762 0 0.1524 N V 21 N "TEST_POINT_2PADS"
T1 -0.07112 2.2098 1.016 1.016 0 0.1524 N V 21 N "VAL**"
DS 1.27 1.016 -1.27 1.016 0.127 21
DS 1.27 -1.016 -1.27 -1.016 0.127 21
DA 1.27 0 2.286 0 900 0.127 21
DA 1.27 0 1.27 -1.016 900 0.127 21
DA -1.27 0 -1.27 1.016 900 0.127 21
DA -1.27 0 -2.286 0 900 0.127 21
$PAD
Sh "1" C 1.397 1.397 0 0 0
Dr 0.8128 0 0
At STD N 00E0FFFF
Ne 0 ""
Po -1.27 0
$EndPAD
$PAD
Sh "2" C 1.397 1.397 0 0 0
Dr 0.8128 0 0
At STD N 00E0FFFF
Ne 0 ""
Po 1.27 0
$EndPAD
$SHAPE3D
Na "connectors\\testpoint_2pads.wrl"
Sc 1 1 1
Of 0 0 0
Ro 0 0 0
$EndSHAPE3D
$EndMODULE TEST_POINT_2PADS
$MODULE TO18CBE
Po 0 0 0 15 00200000 00000000 ~~
Li TO18CBE
Cd Transistor TO18
Kw TO18
Sc 0
AR 
Op 0 0 0
T0 0 -3.81 1.016 0.889 0 0.2032 N V 21 N "TO18CBE"
T1 0 -3.81 1.016 0.889 0 0.2032 N I 21 N "Val**"
DC 0 0 -3.048 0 0.2032 21
DS -2.667 -1.524 -3.429 -2.032 0.3048 21
DS -3.429 -2.032 -3.048 -2.54 0.3048 21
DS -3.048 -2.54 -2.286 -2.032 0.3048 21
$PAD
Sh "2" C 1.524 1.524 0 0 0
Dr 0.7874 0 0
At STD N 00E0FFFF
Ne 0 ""
Po 0 1.27
$EndPAD
$PAD
Sh "1" C 1.524 1.524 0 0 0
Dr 0.7874 0 0
At STD N 00E0FFFF
Ne 0 ""
Po 1.27 0
$EndPAD
$PAD
Sh "3" C 1.524 1.524 0 0 0
Dr 0.7874 0 0
At STD N 00E0FFFF
Ne 0 ""
Po -1.27 0
$EndPAD
$SHAPE3D
Na "discret/to18.wrl"
Sc 1 1 1
Of 0 0 0
Ro 0 0 0
$EndSHAPE3D
$EndMODULE TO18CBE
$MODULE TO18EBC
Po 0 0 0 15 00200000 00000000 ~~
Li TO18EBC
Cd Transistor TO18
Kw TO18
Sc 0
AR 
Op 0 0 0
T0 0 -3.81 1.016 0.889 0 0.2032 N V 21 N "TO18EBC"
T1 0 -3.81 1.016 0.889 0 0.2032 N I 21 N "Val**"
DC 0 0 -3.048 0 0.2032 21
DS -2.667 -1.524 -3.429 -2.032 0.3048 21
DS -3.429 -2.032 -3.048 -2.54 0.3048 21
DS -3.048 -2.54 -2.286 -2.032 0.3048 21
$PAD
Sh "2" C 1.524 1.524 0 0 0
Dr 0.7874 0 0
At STD N 00E0FFFF
Ne 0 ""
Po 0 1.27
$EndPAD
$PAD
Sh "3" C 1.524 1.524 0 0 0
Dr 0.7874 0 0
At STD N 00E0FFFF
Ne 0 ""
Po 1.27 0
$EndPAD
$PAD
Sh "1" C 1.524 1.524 0 0 0
Dr 0.7874 0 0
At STD N 00E0FFFF
Ne 0 ""
Po -1.27 0
$EndPAD
$SHAPE3D
Na "discret/to18.wrl"
Sc 1 1 1
Of 0 0 0
Ro 0 0 0
$EndSHAPE3D
$EndMODULE TO18EBC
$MODULE TO18GSD
Po 0 0 0 15 3DFDE268 00000000 ~~
Li TO18GSD
Cd Transistor TO18
Kw TO18
Sc 0
AR 
Op 0 0 0
T0 0 -3.937 1.016 0.889 0 0.2032 N V 21 N "TO18GSD"
T1 0 3.81 1.016 0.889 0 0.2032 N V 21 N "Val**"
DC 0 0 -3.048 0 0.2032 21
DS -2.667 -1.524 -3.429 -2.032 0.3048 21
DS -3.429 -2.032 -3.048 -2.54 0.3048 21
DS -3.048 -2.54 -2.286 -2.032 0.3048 21
$PAD
Sh "D" C 1.524 1.524 0 0 0
Dr 0.7874 0 0
At STD N 00E0FFFF
Ne 0 ""
Po 0 1.27
$EndPAD
$PAD
Sh "G" C 1.524 1.524 0 0 0
Dr 0.7874 0 0
At STD N 00E0FFFF
Ne 0 ""
Po 1.27 0
$EndPAD
$PAD
Sh "S" C 1.524 1.524 0 0 0
Dr 0.7874 0 0
At STD N 00E0FFFF
Ne 0 ""
Po -1.27 0
$EndPAD
$SHAPE3D
Na "discret/to18.wrl"
Sc 1 1 1
Of 0 0 0
Ro 0 0 0
$EndSHAPE3D
$EndMODULE TO18GSD
$MODULE TO220
Po 0 0 0 15 00200000 00000000 ~~
Li TO220
Cd Transistor TO 220
Kw TR TO220 DEV
Sc 0
AR 
Op 0 0 0
T0 6.985 0 1.016 1.016 900 0.2032 N V 21 N "TO220"
T1 10.795 0 1.016 1.016 900 0.2032 N V 21 N "VAL*"
DS 0 -2.54 5.08 -2.54 0.3048 21
DS 0 0 5.08 0 0.3048 21
DS 0 2.54 5.08 2.54 0.3048 21
DS 5.08 5.08 20.32 5.08 0.3048 21
DS 20.32 5.08 20.32 -5.08 0.3048 21
DS 20.32 -5.08 5.08 -5.08 0.3048 21
DS 5.08 -5.08 5.08 5.08 0.3048 21
DS 12.7 3.81 12.7 -5.08 0.3048 21
DS 12.7 3.81 12.7 5.08 0.3048 21
$PAD
Sh "1" R 1.778 1.778 0 0 0
Dr 1.143 0 0
At STD N 00E0FFFF
Ne 0 ""
Po 0 2.54
$EndPAD
$PAD
Sh "2" C 1.778 1.778 0 0 0
Dr 1.143 0 0
At STD N 00E0FFFF
Ne 0 ""
Po 0 -2.54
$EndPAD
$PAD
Sh "3" C 1.778 1.778 0 0 0
Dr 1.143 0 0
At STD N 00E0FFFF
Ne 0 ""
Po 0 0
$EndPAD
$PAD
Sh "4" R 8.89 8.89 0 0 0
Dr 3.048 0 0
At STD N 00F0FFFF
Ne 0 ""
Po 16.51 0
$EndPAD
$SHAPE3D
Na "discret/to220_horiz.wrl"
Sc 1 1 1
Of 0 0 0
Ro 0 0 0
$EndSHAPE3D
$EndMODULE TO220
$MODULE TO220GDS
Po 0 0 0 15 4469D051 00000000 ~~
Li TO220GDS
Cd Transistor VMOS Irf530, TO220
Kw TR TO220 DEV
Sc 0
AR 
Op 0 0 0
T0 6.985 0 1.524 1.016 900 0.2032 N V 21 N "TO220GDS"
T1 10.795 0 1.524 1.016 900 0.2032 N V 21 N "VAL*"
DS 0 -2.54 5.08 -2.54 0.3048 21
DS 0 0 5.08 0 0.3048 21
DS 0 2.54 5.08 2.54 0.3048 21
DS 5.08 -5.08 20.32 -5.08 0.3048 21
DS 20.32 -5.08 20.32 5.08 0.3048 21
DS 20.32 5.08 5.08 5.08 0.3048 21
DS 5.08 5.08 5.08 -5.08 0.3048 21
DS 12.7 5.08 12.7 -5.08 0.3048 21
$PAD
Sh "4" R 8.89 8.89 0 0 0
Dr 3.048 0 0
At STD N 00F0FFFF
Ne 0 ""
Po 16.51 0
$EndPAD
$PAD
Sh "G" C 1.778 1.778 0 0 0
Dr 1.143 0 0
At STD N 00E0FFFF
Ne 0 ""
Po 0 -2.54
$EndPAD
$PAD
Sh "D" C 1.778 1.778 0 0 0
Dr 1.143 0 0
At STD N 00E0FFFF
Ne 0 ""
Po 0 0
$EndPAD
$PAD
Sh "S" R 1.778 1.778 0 0 0
Dr 1.143 0 0
At STD N 00E0FFFF
Ne 0 ""
Po 0 2.54
$EndPAD
$SHAPE3D
Na "discret/to220_horiz.wrl"
Sc 1 1 1
Of 0 0 0
Ro 0 0 0
$EndSHAPE3D
$EndMODULE TO220GDS
$MODULE TO220_VERT
Po 0 0 0 15 43A66C96 00000000 ~~
Li TO220_VERT
Cd Regulateur TO220 serie LM78xx
Kw TR TO220
Sc 0
AR 
Op 0 0 0
T0 -3.175 0 1.524 1.016 900 0.2032 N V 21 N "TO220_VERT"
T1 0.635 -6.35 1.524 1.016 0 0.2032 N V 21 N "VAL**"
DS 1.905 -5.08 2.54 -5.08 0.381 21
DS 2.54 -5.08 2.54 5.08 0.381 21
DS 2.54 5.08 1.905 5.08 0.381 21
DS -1.905 -5.08 1.905 -5.08 0.381 21
DS 1.905 -5.08 1.905 5.08 0.381 21
DS 1.905 5.08 -1.905 5.08 0.381 21
DS -1.905 5.08 -1.905 -5.08 0.381 21
$PAD
Sh "2" C 1.778 1.778 0 0 0
Dr 1.016 0 0
At STD N 00E0FFFF
Ne 0 ""
Po 0 -2.54
$EndPAD
$PAD
Sh "3" C 1.778 1.778 0 0 0
Dr 1.016 0 0
At STD N 00E0FFFF
Ne 0 ""
Po 0 0
$EndPAD
$PAD
Sh "1" R 1.778 1.778 0 0 0
Dr 1.016 0 0
At STD N 00E0FFFF
Ne 0 ""
Po 0 2.54
$EndPAD
$EndMODULE TO220_VERT
$MODULE TO3
Po 0 0 0 15 00200000 00000000 ~~
Li TO3
Cd Transistor TO3
Kw TR TO3
Sc 0
AR 
Op 0 0 0
T0 -13.716 -11.176 1.016 1.016 0 0.2032 N V 21 N "TO3"
T1 -14.351 -9.144 1.016 1.016 0 0.2032 N V 21 N "U***"
DS -20.32 -2.54 -21.336 0 0.3048 21
DS -21.336 0 -20.32 2.54 0.3048 21
DS 20.32 -2.54 21.844 0 0.3048 21
DS 21.844 0 20.32 2.54 0.3048 21
DS -4.572 -12.192 0 -13.208 0.3048 21
DS 0 -13.208 4.572 -12.192 0.3048 21
DS -4.572 -12.192 -20.32 -2.54 0.3048 21
DS 4.572 -12.192 20.32 -2.54 0.3048 21
DS 4.572 12.192 20.32 2.54 0.3048 21
DS -4.572 12.192 -20.32 2.54 0.3048 21
DS 4.572 12.192 -0.508 13.208 0.3048 21
DS -0.508 13.208 -4.572 12.192 0.3048 21
DC 0 0 10.16 0.635 0.3048 21
$PAD
Sh "1" C 6.35 6.35 0 0 0
Dr 3.937 0 0
At STD N 00E0FFFF
Ne 0 ""
Po -15.24 0
$EndPAD
$PAD
Sh "1" C 6.35 6.35 0 0 0
Dr 3.937 0 0
At STD N 00E0FFFF
Ne 0 ""
Po 15.24 0
$EndPAD
$PAD
Sh "2" C 2.54 2.54 0 0 0
Dr 1.3208 0 0
At STD N 00E0FFFF
Ne 0 ""
Po -2.54 -5.08
$EndPAD
$PAD
Sh "3" C 2.54 2.54 0 0 0
Dr 1.3208 0 0
At STD N 00E0FFFF
Ne 0 ""
Po -2.54 5.08
$EndPAD
$SHAPE3D
Na "discret/to3.wrl"
Sc 1 1 1
Of 0 0 0
Ro 0 0 0
$EndSHAPE3D
$EndMODULE TO3
$MODULE TO39EBC
Po 0 0 0 15 4469D53B 00000000 ~~
Li TO39EBC
Cd Transistor TO38
Kw TO38
Sc 0
AR 
Op 0 0 0
T0 -0.254 5.588 1.143 1.016 0 0.2032 N V 21 N "TO39EBC"
T1 0 -1.778 1.143 1.016 0 0.2032 N V 21 N "Val**"
DC 0 0 3.175 3.429 0.3048 21
DS -3.81 -2.667 -5.08 -3.937 0.3048 21
DS -2.667 -3.81 -3.937 -5.08 0.3048 21
DS -3.937 -5.08 -5.08 -3.937 0.3048 21
$PAD
Sh "3" C 1.651 1.651 0 0 0
Dr 0.7874 0 0
At STD N 00E0FFFF
Ne 0 ""
Po 2.54 0
$EndPAD
$PAD
Sh "2" C 1.651 1.651 0 0 0
Dr 0.7874 0 0
At STD N 00E0FFFF
Ne 0 ""
Po 0 2.54
$EndPAD
$PAD
Sh "1" R 1.651 1.651 0 0 0
Dr 0.7874 0 0
At STD N 00E0FFFF
Ne 0 ""
Po -2.54 0
$EndPAD
$SHAPE3D
Na "discret/to5.wrl"
Sc 1 1 1
Of 0 0 0
Ro 0 0 0
$EndSHAPE3D
$EndMODULE TO39EBC
$MODULE TO92
Po 0 0 0 15 443CFFD1 00000000 ~~
Li TO92
Cd Transistor TO92 brochage type BC237
Kw TR TO92
Sc 0
AR 
Op 0 0 0
T0 -1.27 3.81 1.016 1.016 0 0.2032 N V 21 N "TO92"
T1 -1.27 -5.08 1.016 1.016 0 0.2032 N V 21 N "VAL**"
DS -1.27 2.54 2.54 -1.27 0.3048 21
DS 2.54 -1.27 2.54 -2.54 0.3048 21
DS 2.54 -2.54 1.27 -3.81 0.3048 21
DS 1.27 -3.81 -1.27 -3.81 0.3048 21
DS -1.27 -3.81 -3.81 -1.27 0.3048 21
DS -3.81 -1.27 -3.81 1.27 0.3048 21
DS -3.81 1.27 -2.54 2.54 0.3048 21
DS -2.54 2.54 -1.27 2.54 0.3048 21
$PAD
Sh "1" R 1.397 1.397 0 0 0
Dr 0.8128 0 0
At STD N 00E0FFFF
Ne 0 ""
Po 1.27 -1.27
$EndPAD
$PAD
Sh "2" C 1.397 1.397 0 0 0
Dr 0.8128 0 0
At STD N 00E0FFFF
Ne 0 ""
Po -1.27 -1.27
$EndPAD
$PAD
Sh "3" C 1.397 1.397 0 0 0
Dr 0.8128 0 0
At STD N 00E0FFFF
Ne 0 ""
Po -1.27 1.27
$EndPAD
$SHAPE3D
Na "discret/to98.wrl"
Sc 1 1 1
Of 0 0 0
Ro 0 0 0
$EndSHAPE3D
$EndMODULE TO92
$MODULE TO92-123
Po 0 0 0 15 4C5F51CE 00000000 ~~
Li TO92-123
Cd Transistor TO92 brochage type BC237
Kw TR TO92
Sc 0
AR 
Op 0 0 0
T0 -1.27 3.81 1.016 1.016 0 0.2032 N V 21 N "TO92"
T1 -1.27 -5.08 1.016 1.016 0 0.2032 N V 21 N "VAL**"
DS -1.27 2.54 2.54 -1.27 0.3048 21
DS 2.54 -1.27 2.54 -2.54 0.3048 21
DS 2.54 -2.54 1.27 -3.81 0.3048 21
DS 1.27 -3.81 -1.27 -3.81 0.3048 21
DS -1.27 -3.81 -3.81 -1.27 0.3048 21
DS -3.81 -1.27 -3.81 1.27 0.3048 21
DS -3.81 1.27 -2.54 2.54 0.3048 21
DS -2.54 2.54 -1.27 2.54 0.3048 21
$PAD
Sh "3" R 1.397 1.397 0 0 0
Dr 0.8128 0 0
At STD N 00E0FFFF
Ne 0 ""
Po 1.27 -1.27
$EndPAD
$PAD
Sh "2" C 1.397 1.397 0 0 0
Dr 0.8128 0 0
At STD N 00E0FFFF
Ne 0 ""
Po -1.27 -1.27
$EndPAD
$PAD
Sh "1" C 1.397 1.397 0 0 0
Dr 0.8128 0 0
At STD N 00E0FFFF
Ne 0 ""
Po -1.27 1.27
$EndPAD
$SHAPE3D
Na "discret/to98.wrl"
Sc 1 1 1
Of 0 0 0
Ro 0 0 0
$EndSHAPE3D
$EndMODULE TO92-123
$MODULE TO92-CBE
Po 0 0 0 15 4718C200 00000000 ~~
Li TO92-CBE
Cd Transistor TO92 brochage type BC237
Kw TR TO92
Sc 0
AR 
Op 0 0 0
T0 0.762 0.635 1.016 1.016 0 0.2032 N V 21 N "TO92-CBE"
T1 0.254 -3.048 1.016 1.016 0 0.2032 N V 21 N "VAL**"
DS -1.27 2.54 2.54 -1.27 0.3048 21
DS 2.54 -1.27 2.54 -2.54 0.3048 21
DS 2.54 -2.54 1.27 -3.81 0.3048 21
DS 1.27 -3.81 -1.27 -3.81 0.3048 21
DS -1.27 -3.81 -3.81 -1.27 0.3048 21
DS -3.81 -1.27 -3.81 1.27 0.3048 21
DS -3.81 1.27 -2.54 2.54 0.3048 21
DS -2.54 2.54 -1.27 2.54 0.3048 21
$PAD
Sh "E" R 1.397 1.397 0 0 0
Dr 0.8128 0 0
At STD N 00E0FFFF
Ne 0 ""
Po -1.27 1.27
$EndPAD
$PAD
Sh "B" C 1.397 1.397 0 0 0
Dr 0.8128 0 0
At STD N 00E0FFFF
Ne 0 ""
Po -1.27 -1.27
$EndPAD
$PAD
Sh "C" C 1.397 1.397 0 0 0
Dr 0.8128 0 0
At STD N 00E0FFFF
Ne 0 ""
Po 1.27 -1.27
$EndPAD
$SHAPE3D
Na "discret/to98.wrl"
Sc 1 1 1
Of 0 0 0
Ro 0 0 0
$EndSHAPE3D
$EndMODULE TO92-CBE
$MODULE TO92-EBC
Po 0 0 0 15 4718C1A9 00000000 ~~
Li TO92-EBC
Cd Transistor TO92 brochage type BC237
Kw TR TO92
Sc 0
AR 
Op 0 0 0
T0 2.159 1.397 1.016 1.016 0 0.2032 N V 21 N "TO92-EBC"
T1 -0.508 -3.175 1.016 1.016 0 0.2032 N V 21 N "VAL**"
DS -1.27 2.54 2.54 -1.27 0.3048 21
DS 2.54 -1.27 2.54 -2.54 0.3048 21
DS 2.54 -2.54 1.27 -3.81 0.3048 21
DS 1.27 -3.81 -1.27 -3.81 0.3048 21
DS -1.27 -3.81 -3.81 -1.27 0.3048 21
DS -3.81 -1.27 -3.81 1.27 0.3048 21
DS -3.81 1.27 -2.54 2.54 0.3048 21
DS -2.54 2.54 -1.27 2.54 0.3048 21
$PAD
Sh "E" R 1.397 1.397 0 0 0
Dr 0.8128 0 0
At STD N 00E0FFFF
Ne 0 ""
Po 1.27 -1.27
$EndPAD
$PAD
Sh "B" C 1.397 1.397 0 0 0
Dr 0.8128 0 0
At STD N 00E0FFFF
Ne 0 ""
Po -1.27 -1.27
$EndPAD
$PAD
Sh "C" C 1.397 1.397 0 0 0
Dr 0.8128 0 0
At STD N 00E0FFFF
Ne 0 ""
Po -1.27 1.27
$EndPAD
$SHAPE3D
Na "discret/to98.wrl"
Sc 1 1 1
Of 0 0 0
Ro 0 0 0
$EndSHAPE3D
$EndMODULE TO92-EBC
$MODULE TO92-INVERT
Po 0 0 0 15 443CFFF4 00000000 ~~
Li TO92-INVERT
Cd Transistor TO92 brochage type BC237
Kw TR TO92
Sc 0
AR 
Op 0 0 0
T0 -1.27 3.81 1.016 1.016 0 0.2032 N V 21 N "TO92-INVERT"
T1 -1.27 -5.08 1.016 1.016 0 0.2032 N V 21 N "VAL**"
DS -1.27 2.54 2.54 -1.27 0.3048 21
DS 2.54 -1.27 2.54 -2.54 0.3048 21
DS 2.54 -2.54 1.27 -3.81 0.3048 21
DS 1.27 -3.81 -1.27 -3.81 0.3048 21
DS -1.27 -3.81 -3.81 -1.27 0.3048 21
DS -3.81 -1.27 -3.81 1.27 0.3048 21
DS -3.81 1.27 -2.54 2.54 0.3048 21
DS -2.54 2.54 -1.27 2.54 0.3048 21
$PAD
Sh "1" R 1.397 1.397 0 0 0
Dr 0.8128 0 0
At STD N 00E0FFFF
Ne 0 ""
Po -1.27 1.27
$EndPAD
$PAD
Sh "2" C 1.397 1.397 0 0 0
Dr 0.8128 0 0
At STD N 00E0FFFF
Ne 0 ""
Po -1.27 -1.27
$EndPAD
$PAD
Sh "3" C 1.397 1.397 0 0 0
Dr 0.8128 0 0
At STD N 00E0FFFF
Ne 0 ""
Po 1.27 -1.27
$EndPAD
$SHAPE3D
Na "discret/to98.wrl"
Sc 1 1 1
Of 0 0 0
Ro 0 0 0
$EndSHAPE3D
$EndMODULE TO92-INVERT
$MODULE TO92DGS
Po 0 0 0 15 4469CFF0 00000000 ~~
Li TO92DGS
Cd Transistor TO92 brochage type BC237
Kw TR TO92
Sc 0
AR 
Op 0 0 0
T0 -1.27 3.81 1.016 1.016 0 0.2032 N V 21 N "TO92DGS"
T1 -1.27 -5.08 1.016 1.016 0 0.2032 N V 21 N "VAL**"
DS -1.27 2.54 2.54 -1.27 0.3048 21
DS 2.54 -1.27 2.54 -2.54 0.3048 21
DS 2.54 -2.54 1.27 -3.81 0.3048 21
DS 1.27 -3.81 -1.27 -3.81 0.3048 21
DS -1.27 -3.81 -3.81 -1.27 0.3048 21
DS -3.81 -1.27 -3.81 1.27 0.3048 21
DS -3.81 1.27 -2.54 2.54 0.3048 21
DS -2.54 2.54 -1.27 2.54 0.3048 21
$PAD
Sh "D" R 1.397 1.397 0 0 0
Dr 0.8128 0 0
At STD N 00E0FFFF
Ne 0 ""
Po 1.27 -1.27
$EndPAD
$PAD
Sh "G" C 1.397 1.397 0 0 0
Dr 0.8128 0 0
At STD N 00E0FFFF
Ne 0 ""
Po -1.27 -1.27
$EndPAD
$PAD
Sh "S" C 1.397 1.397 0 0 0
Dr 0.8128 0 0
At STD N 00E0FFFF
Ne 0 ""
Po -1.27 1.27
$EndPAD
$SHAPE3D
Na "discret/to98.wrl"
Sc 1 1 1
Of 0 0 0
Ro 0 0 0
$EndSHAPE3D
$EndMODULE TO92DGS
$MODULE TO92GSD
Po 0 0 0 15 4469CFB5 00000000 ~~
Li TO92GSD
Cd Transistor TO92 brochage type BC237
Kw TR TO92
Sc 0
AR 
Op 0 0 0
T0 -1.27 3.81 1.016 1.016 0 0.2032 N V 21 N "TO92GSD"
T1 -1.27 -5.08 1.016 1.016 0 0.2032 N V 21 N "VAL**"
DS -1.27 2.54 2.54 -1.27 0.3048 21
DS 2.54 -1.27 2.54 -2.54 0.3048 21
DS 2.54 -2.54 1.27 -3.81 0.3048 21
DS 1.27 -3.81 -1.27 -3.81 0.3048 21
DS -1.27 -3.81 -3.81 -1.27 0.3048 21
DS -3.81 -1.27 -3.81 1.27 0.3048 21
DS -3.81 1.27 -2.54 2.54 0.3048 21
DS -2.54 2.54 -1.27 2.54 0.3048 21
$PAD
Sh "G" C 1.397 1.397 0 0 0
Dr 0.8128 0 0
At STD N 00E0FFFF
Ne 0 ""
Po 1.27 -1.27
$EndPAD
$PAD
Sh "S" R 1.397 1.397 0 0 0
Dr 0.8128 0 0
At STD N 00E0FFFF
Ne 0 ""
Po -1.27 -1.27
$EndPAD
$PAD
Sh "D" C 1.397 1.397 0 0 0
Dr 0.8128 0 0
At STD N 00E0FFFF
Ne 0 ""
Po -1.27 1.27
$EndPAD
$SHAPE3D
Na "discret/to98.wrl"
Sc 1 1 1
Of 0 0 0
Ro 0 0 0
$EndSHAPE3D
$EndMODULE TO92GSD
$MODULE TO92H
Po 0 0 0 15 45128CBD 00000000 ~~
Li TO92H
Sc 0
AR 
Op 0 0 0
T0 5.08 -1.27 1.27 0.762 0 0.1524 N V 21 N "TO92H"
T1 5.08 1.27 1.27 0.762 0 0.1524 N V 21 N "VAL***"
DS 2.54 -2.54 7.62 -2.54 0.3048 21
DS 7.62 -2.54 7.62 2.54 0.3048 21
DS 7.62 2.54 2.54 2.54 0.3048 21
DS 2.54 2.54 2.54 -2.54 0.3048 21
DS 1.27 -1.27 2.54 -1.27 0.3048 21
DS -1.27 0 2.54 0 0.3048 21
DS 1.27 1.27 2.54 1.27 0.3048 21
$PAD
Sh "2" C 1.27 1.27 0 0 0
Dr 0.8128 0 0
At STD N 00E0FFFF
Ne 0 ""
Po -1.27 0
$EndPAD
$PAD
Sh "1" C 1.27 1.27 0 0 0
Dr 0.8128 0 0
At STD N 00E0FFFF
Ne 0 ""
Po 1.27 1.27
$EndPAD
$PAD
Sh "3" C 1.27 1.27 0 0 0
Dr 0.8128 0 0
At STD N 00E0FFFF
Ne 0 ""
Po 1.27 -1.27
$EndPAD
$EndMODULE TO92H
$MODULE TO92_INVERT_H
Po 0 0 0 15 45128CE6 00000000 ~~
Li TO92_INVERT_H
Sc 0
AR 
Op 0 0 0
T0 5.08 -1.27 1.27 0.762 0 0.1524 N V 21 N "TO92_INVERT_H"
T1 5.08 1.27 1.27 0.762 0 0.1524 N V 21 N "VAL***"
DS 2.54 -2.54 7.62 -2.54 0.3048 21
DS 7.62 -2.54 7.62 2.54 0.3048 21
DS 7.62 2.54 2.54 2.54 0.3048 21
DS 2.54 2.54 2.54 -2.54 0.3048 21
DS 1.27 -1.27 2.54 -1.27 0.3048 21
DS -1.27 0 2.54 0 0.3048 21
DS 1.27 1.27 2.54 1.27 0.3048 21
$PAD
Sh "2" C 1.27 1.27 0 0 0
Dr 0.8128 0 0
At STD N 00E0FFFF
Ne 0 ""
Po -1.27 0
$EndPAD
$PAD
Sh "3" C 1.27 1.27 0 0 0
Dr 0.8128 0 0
At STD N 00E0FFFF
Ne 0 ""
Po 1.27 1.27
$EndPAD
$PAD
Sh "1" C 1.27 1.27 0 0 0
Dr 0.8128 0 0
At STD N 00E0FFFF
Ne 0 ""
Po 1.27 -1.27
$EndPAD
$EndMODULE TO92_INVERT_H
$MODULE VP0808
Po 0 0 0 15 3DFDE2B2 00000000 ~~
Li VP0808
Cd Transistor TO92 brochage type VP0808
Kw TR TO92
Sc 0
AR 
Op 0 0 0
T0 0.254 -4.699 1.016 1.016 0 0.2032 N V 21 N "VP0808"
T1 -1.27 3.429 1.016 1.016 0 0.2032 N V 21 N "VAL**"
DS -1.27 2.54 2.54 -1.27 0.3048 21
DS 2.54 -1.27 2.54 -2.54 0.3048 21
DS 2.54 -2.54 1.27 -3.81 0.3048 21
DS 1.27 -3.81 -1.27 -3.81 0.3048 21
DS -1.27 -3.81 -3.81 -1.27 0.3048 21
DS -3.81 -1.27 -3.81 1.27 0.3048 21
DS -3.81 1.27 -2.54 2.54 0.3048 21
DS -2.54 2.54 -1.27 2.54 0.3048 21
$PAD
Sh "S" C 1.397 1.397 0 0 0
Dr 0.8128 0 0
At STD N 00E0FFFF
Ne 0 ""
Po -1.27 -1.27
$EndPAD
$PAD
Sh "G" C 1.397 1.397 0 0 0
Dr 0.8128 0 0
At STD N 00E0FFFF
Ne 0 ""
Po 1.27 -1.27
$EndPAD
$PAD
Sh "D" C 1.397 1.397 0 0 0
Dr 0.8128 0 0
At STD N 00E0FFFF
Ne 0 ""
Po -1.27 1.27
$EndPAD
$SHAPE3D
Na "discret/to98.wrl"
Sc 1 1 1
Of 0 0 0
Ro 0 0 0
$EndSHAPE3D
$EndMODULE VP0808
$MODULE microswitch_Nikkai
Po 0 0 0 15 48074635 00000000 ~~
Li microswitch_Nikkai
Cd Switch Nikkai ref G12JPC
Kw SWITCH DEV
Sc 0
AR 
Op 0 0 0
T0 0 3.302 1.016 1.016 0 0.1524 N V 21 N "MICROSWITCH"
T1 0.254 -3.302 1.016 1.016 0 0.1524 N I 21 N "Val**"
DC -1.27 0 -1.778 0 0.2032 21
DS 0 0.508 -1.27 0.508 0.2032 21
DS -1.27 -0.508 0 -0.508 0.2032 21
DA 0 0 0 -0.508 900 0.2032 21
DA 0 0 0.508 0 900 0.2032 21
DC 0 0 -0.762 -1.778 0.2032 21
DS 3.81 -2.286 3.81 2.286 0.2032 21
DS -3.81 -2.286 -3.81 2.286 0.2032 21
DS -3.81 -2.286 3.81 -2.286 0.2032 21
DS 3.81 2.286 -3.81 2.286 0.2032 21
$PAD
Sh "1" R 1.524 1.524 0 0 0
Dr 0.8128 0 0
At STD N 00E0FFFF
Ne 0 ""
Po -2.54 1.27
$EndPAD
$PAD
Sh "2" C 1.524 1.524 0 0 0
Dr 0.8128 0 0
At STD N 00E0FFFF
Ne 0 ""
Po 0 1.27
$EndPAD
$PAD
Sh "3" C 1.524 1.524 0 0 0
Dr 0.8128 0 0
At STD N 00E0FFFF
Ne 0 ""
Po 2.54 1.27
$EndPAD
$PAD
Sh "4" C 1.524 1.524 0 0 0
Dr 0.8128 0 0
At STD N 00E0FFFF
Ne 0 ""
Po 2.54 -1.27
$EndPAD
$PAD
Sh "5" C 1.524 1.524 0 0 0
Dr 0.8128 0 0
At STD N 00E0FFFF
Ne 0 ""
Po 0 -1.27
$EndPAD
$PAD
Sh "6" C 1.524 1.524 0 0 0
Dr 0.8128 0 0
At STD N 00E0FFFF
Ne 0 ""
Po -2.54 -1.27
$EndPAD
$SHAPE3D
Na "device/switch_toggle_straight_terminal.wrl"
Sc 0.33 0.33 0.33
Of 0 0 0
Ro 0 0 0
$EndSHAPE3D
$EndMODULE microswitch_Nikkai
$MODULE r_pack8
Po 0 0 0 15 3F951D98 00000000 ~~
Li r_pack8
Cd 8 R pack
Kw R
Sc 0
AR 
Op 0 0 0
T0 -1.27 -2.794 1.27 1.27 0 0.2032 N V 21 N "r_pack8"
T1 0 2.032 1.016 1.016 0 0.2032 N V 21 N "Val**"
DS 11.43 -1.27 11.43 1.27 0.3048 21
DS 11.43 1.27 -11.43 1.27 0.3048 21
DS -11.43 1.27 -11.43 -1.27 0.3048 21
DS 11.43 -1.27 -11.43 -1.27 0.3048 21
DS -8.89 -1.27 -8.89 1.27 0.3048 21
$PAD
Sh "1" R 1.397 1.397 0 0 0
Dr 0.8128 0 0
At STD N 00E0FFFF
Ne 0 ""
Po -10.16 0
$EndPAD
$PAD
Sh "2" C 1.397 1.397 0 0 0
Dr 0.8128 0 0
At STD N 00E0FFFF
Ne 0 ""
Po -7.62 0
$EndPAD
$PAD
Sh "3" C 1.397 1.397 0 0 0
Dr 0.8128 0 0
At STD N 00E0FFFF
Ne 0 ""
Po -5.08 0
$EndPAD
$PAD
Sh "4" C 1.397 1.397 0 0 0
Dr 0.8128 0 0
At STD N 00E0FFFF
Ne 0 ""
Po -2.54 0
$EndPAD
$PAD
Sh "5" C 1.397 1.397 0 0 0
Dr 0.8128 0 0
At STD N 00E0FFFF
Ne 0 ""
Po 0 0
$EndPAD
$PAD
Sh "6" C 1.397 1.397 0 0 0
Dr 0.8128 0 0
At STD N 00E0FFFF
Ne 0 ""
Po 2.54 0
$EndPAD
$PAD
Sh "7" C 1.397 1.397 0 0 0
Dr 0.8128 0 0
At STD N 00E0FFFF
Ne 0 ""
Po 5.08 0
$EndPAD
$PAD
Sh "8" C 1.397 1.397 0 0 0
Dr 0.8128 0 0
At STD N 00E0FFFF
Ne 0 ""
Po 7.62 0
$EndPAD
$PAD
Sh "9" C 1.397 1.397 0 0 0
Dr 0.8128 0 0
At STD N 00E0FFFF
Ne 0 ""
Po 10.16 0
$EndPAD
$SHAPE3D
Na "discret/r_pack8.wrl"
Sc 1 1 1
Of 0 0 0
Ro 0 0 0
$EndSHAPE3D
$EndMODULE r_pack8
$MODULE r_pack9
Po 0 0 0 15 3F951ED0 00000000 ~~
Li r_pack9
Cd Connecteur 10 pins
Kw CONN DEV
Sc 0
AR 
Op 0 0 0
T0 -1.016 -2.54 1.27 1.27 0 0.2032 N V 21 N "r_pack9"
T1 -0.762 2.286 1.27 1.016 0 0.2032 N V 21 N "Val**"
DS -12.7 1.27 -12.7 -1.27 0.3048 21
DS -12.7 -1.27 12.7 -1.27 0.3048 21
DS 12.7 -1.27 12.7 1.27 0.3048 21
DS 12.7 1.27 -12.7 1.27 0.3048 21
DS -10.16 1.27 -10.16 -1.27 0.3048 21
$PAD
Sh "1" R 1.397 1.397 0 0 0
Dr 0.8128 0 0
At STD N 00E0FFFF
Ne 0 ""
Po -11.43 0
$EndPAD
$PAD
Sh "2" C 1.397 1.397 0 0 0
Dr 0.8128 0 0
At STD N 00E0FFFF
Ne 0 ""
Po -8.89 0
$EndPAD
$PAD
Sh "3" C 1.397 1.397 0 0 0
Dr 0.8128 0 0
At STD N 00E0FFFF
Ne 0 ""
Po -6.35 0
$EndPAD
$PAD
Sh "4" C 1.397 1.397 0 0 0
Dr 0.8128 0 0
At STD N 00E0FFFF
Ne 0 ""
Po -3.81 0
$EndPAD
$PAD
Sh "5" C 1.397 1.397 0 0 0
Dr 0.8128 0 0
At STD N 00E0FFFF
Ne 0 ""
Po -1.27 0
$EndPAD
$PAD
Sh "6" C 1.397 1.397 0 0 0
Dr 0.8128 0 0
At STD N 00E0FFFF
Ne 0 ""
Po 1.27 0
$EndPAD
$PAD
Sh "7" C 1.397 1.397 0 0 0
Dr 0.8128 0 0
At STD N 00E0FFFF
Ne 0 ""
Po 3.81 0
$EndPAD
$PAD
Sh "8" C 1.397 1.397 0 0 0
Dr 0.8128 0 0
At STD N 00E0FFFF
Ne 0 ""
Po 6.35 0
$EndPAD
$PAD
Sh "9" C 1.397 1.397 0 0 0
Dr 0.8128 0 0
At STD N 00E0FFFF
Ne 0 ""
Po 8.89 0
$EndPAD
$PAD
Sh "10" C 1.397 1.397 0 0 0
Dr 0.8128 0 0
At STD N 00E0FFFF
Ne 0 ""
Po 11.43 0
$EndPAD
$SHAPE3D
Na "discret/r_pack9.wrl"
Sc 1 1 1
Of 0 0 0
Ro 0 0 0
$EndSHAPE3D
$EndMODULE r_pack9
$MODULE swdip3
Po 43.18 260.35 0 15 00200000 00000000 ~~
Li swdip3
Cd Switch Dil 3 elements
Kw SWITCH DEV
Sc 0
AR 
Op 0 0 0
T0 0 6.35 1.27 1.524 0 0.3048 N V 21 N "SWDIP3"
T1 0 -6.35 1.27 1.524 0 0.3048 N I 21 N "Val**"
DS -3.81 1.27 -3.81 -1.27 0.3048 21
DS -3.81 -1.27 3.81 -1.27 0.3048 21
DS 3.81 -1.27 3.81 1.27 0.3048 21
DS 3.81 1.27 -3.81 1.27 0.3048 21
DS -5.08 -5.08 5.08 -5.08 0.3048 21
DS 5.08 -5.08 5.08 5.08 0.3048 21
DS 5.08 5.08 -5.08 5.08 0.3048 21
DS -5.08 5.08 -5.08 -5.08 0.3048 21
DS -1.27 -1.27 -1.27 1.27 0.3048 21
DS 1.27 -1.27 1.27 1.27 0.3048 21
$PAD
Sh "1" R 1.524 1.524 0 0 0
Dr 0.8128 0 0
At STD N 00E0FFFF
Ne 0 ""
Po -2.54 3.81
$EndPAD
$PAD
Sh "2" C 1.524 1.524 0 0 0
Dr 0.8128 0 0
At STD N 00E0FFFF
Ne 0 ""
Po 0 3.81
$EndPAD
$PAD
Sh "3" C 1.524 1.524 0 0 0
Dr 0.8128 0 0
At STD N 00E0FFFF
Ne 0 ""
Po 2.54 3.81
$EndPAD
$PAD
Sh "4" C 1.524 1.524 0 0 0
Dr 0.8128 0 0
At STD N 00E0FFFF
Ne 0 ""
Po 2.54 -3.81
$EndPAD
$PAD
Sh "5" C 1.524 1.524 0 0 0
Dr 0.8128 0 0
At STD N 00E0FFFF
Ne 0 ""
Po 0 -3.81
$EndPAD
$PAD
Sh "6" C 1.524 1.524 0 0 0
Dr 0.8128 0 0
At STD N 00E0FFFF
Ne 0 ""
Po -2.54 -3.81
$EndPAD
$EndMODULE swdip3
$EndLIBRARY
