PCBNEW-LibModule-V1  So 23. červen 2012, 12:37:34 CEST
# encoding utf-8
Units deci-mils
$INDEX
Dira1,5mmNTPH
Dira10mmNTPH
Dira10mmW11mm
Dira10mmW12mm
Dira10mmW13mm
Dira1mmNTPH
Dira1mmW2mm
Dira1mmW3mm
Dira2,5mmNTPH
Dira2.5mmW4mm
Dira2.5mmW5mm
Dira2mmNTPH
Dira2mmW3mm
Dira2mmW4mm
Dira2mmW5mm
Dira3,5mmNTPH
Dira3.5mmW4mm
Dira3.5mmW5mm
Dira3.5mmW6mm
Dira3.5mmW7mm
Dira3mmNTPH
Dira3mmW4mm
Dira3mmW5mm
Dira3mmW6mm
Dira4mmNTPH
Dira4mmW5mm
Dira4mmW6mm
Dira4mmW7mm
Dira5mmNTPH
Dira5mmW6mm
Dira5mmW7mm
Dira5mmW8mm
Dira6mmNTPH
Dira7mmNTPH
Dira8mmNTPH
Dira8mmW10mm
Dira8mmW11mm
Dira8mmW9mm
Dira9mmNTPH
$EndINDEX
$MODULE Dira1,5mmNTPH
Po 0 0 0 15 4FE59C52 00000000 ~~
Li Dira1,5mmNTPH
Sc 0
AR 
Op 0 0 0
T0 0 -750 392 392 0 77 N I 21 N "Dira1,5mmNTPH"
T1 0 750 392 392 0 77 N I 21 N "Val**"
$PAD
Sh "" C 590 590 0 0 0
Dr 590 0 0
At HOLE N 00E0FFFF
Ne 0 ""
Po 0 0
$EndPAD
$EndMODULE Dira1,5mmNTPH
$MODULE Dira10mmNTPH
Po 0 0 0 15 4FE59B1B 00000000 ~~
Li Dira10mmNTPH
Sc 0
AR 
Op 0 0 0
T0 0 -2500 392 392 0 77 N I 21 N "Dira10mmNTPH"
T1 0 1250 392 392 0 77 N I 21 N "Val**"
$PAD
Sh "" C 3937 3937 0 0 0
Dr 3937 0 0
At HOLE N 00E0FFFF
Ne 0 ""
Po 0 0
$EndPAD
$EndMODULE Dira10mmNTPH
$MODULE Dira10mmW11mm
Po 0 0 0 15 4FE59AA3 00000000 ~~
Li Dira10mmW11mm
Sc 0
AR 
Op 0 0 0
T0 0 -2750 392 392 0 77 N I 21 N "Dira10mmW11mm"
T1 0 1000 392 392 0 77 N I 21 N "Val**"
$PAD
Sh "1" C 4330 4330 0 0 0
Dr 3937 0 0
At STD N 00E0FFFF
Ne 0 ""
Po 0 0
$EndPAD
$EndMODULE Dira10mmW11mm
$MODULE Dira10mmW12mm
Po 0 0 0 15 4FE59AB6 00000000 ~~
Li Dira10mmW12mm
Sc 0
AR 
Op 0 0 0
T0 0 -2750 392 392 0 77 N I 21 N "Dira10mmW12mm"
T1 0 1000 392 392 0 77 N I 21 N "Val**"
$PAD
Sh "1" C 4724 4724 0 0 0
Dr 3937 0 0
At STD N 00E0FFFF
Ne 0 ""
Po 0 0
$EndPAD
$EndMODULE Dira10mmW12mm
$MODULE Dira10mmW13mm
Po 0 0 0 15 4FE59ACA 00000000 ~~
Li Dira10mmW13mm
Sc 0
AR 
Op 0 0 0
T0 0 -3000 392 392 0 77 N I 21 N "Dira10mmW13mm"
T1 0 1250 392 392 0 77 N I 21 N "Val**"
$PAD
Sh "1" C 5118 5118 0 0 0
Dr 3937 0 0
At STD N 00E0FFFF
Ne 0 ""
Po 0 0
$EndPAD
$EndMODULE Dira10mmW13mm
$MODULE Dira1mmNTPH
Po 0 0 0 15 4FE59C67 00000000 ~~
Li Dira1mmNTPH
Sc 0
AR 
Op 0 0 0
T0 0 -750 392 392 0 77 N I 21 N "Dira1mmNTPH"
T1 0 750 392 392 0 77 N I 21 N "Val**"
$PAD
Sh "" C 393 393 0 0 0
Dr 393 0 0
At HOLE N 00E0FFFF
Ne 0 ""
Po 0 0
$EndPAD
$EndMODULE Dira1mmNTPH
$MODULE Dira1mmW2mm
Po 0 0 0 15 4FE59668 00000000 ~~
Li Dira1mmW2mm
Sc 0
AR 
Op 0 0 0
T0 0 -1000 392 392 0 77 N I 21 N "Dira1mmW2mm"
T1 0 1000 392 392 0 77 N I 21 N ""
$PAD
Sh "1" C 787 787 0 0 0
Dr 393 0 0
At STD N 00E0FFFF
Ne 0 ""
Po 0 0
$EndPAD
$EndMODULE Dira1mmW2mm
$MODULE Dira1mmW3mm
Po 0 0 0 15 4FE597A6 00000000 ~~
Li Dira1mmW3mm
Sc 0
AR 
Op 0 0 0
T0 0 -1000 392 392 0 77 N I 21 N "Dira1mmW3mm"
T1 0 1000 392 392 0 77 N I 21 N ""
$PAD
Sh "1" C 1181 1181 0 0 0
Dr 392 0 0
At STD N 00E0FFFF
Ne 0 ""
Po 0 0
$EndPAD
$EndMODULE Dira1mmW3mm
$MODULE Dira2,5mmNTPH
Po 0 0 0 15 4FE59C1C 00000000 ~~
Li Dira2,5mmNTPH
Sc 0
AR 
Op 0 0 0
T0 0 -1000 392 392 0 77 N I 21 N "Dira2,5mmNTPH"
T1 0 1000 392 392 0 77 N I 21 N "Val**"
$PAD
Sh "" C 984 984 0 0 0
Dr 984 0 0
At HOLE N 00E0FFFF
Ne 0 ""
Po 0 0
$EndPAD
$EndMODULE Dira2,5mmNTPH
$MODULE Dira2.5mmW4mm
Po 0 0 0 15 4FE59862 00000000 ~~
Li Dira2.5mmW4mm
Sc 0
AR 
Op 0 0 0
T0 0 -1500 392 392 0 77 N I 21 N "Dira2.5mmW4mm"
T1 0 1500 392 392 0 77 N I 21 N "Val**"
$PAD
Sh "1" C 1574 1574 0 0 0
Dr 984 0 0
At STD N 00E0FFFF
Ne 0 ""
Po 0 0
$EndPAD
$EndMODULE Dira2.5mmW4mm
$MODULE Dira2.5mmW5mm
Po 0 0 0 15 4FE597B9 00000000 ~~
Li Dira2.5mmW5mm
Sc 0
AR 
Op 0 0 0
T0 0 -1500 392 392 0 77 N I 21 N "Dira2.5mmW5mm"
T1 0 1500 392 392 0 77 N I 21 N "Val**"
$PAD
Sh "1" C 1967 1967 0 0 0
Dr 984 0 0
At STD N 00E0FFFF
Ne 0 ""
Po 0 0
$EndPAD
$EndMODULE Dira2.5mmW5mm
$MODULE Dira2mmNTPH
Po 0 0 0 15 4FE59C36 00000000 ~~
Li Dira2mmNTPH
Sc 0
AR 
Op 0 0 0
T0 0 -750 392 392 0 77 N I 21 N "Dira2mmNTPH"
T1 0 1000 392 392 0 77 N I 21 N "Val**"
$PAD
Sh "" C 787 787 0 0 0
Dr 787 0 0
At HOLE N 00E0FFFF
Ne 0 ""
Po 0 0
$EndPAD
$EndMODULE Dira2mmNTPH
$MODULE Dira2mmW3mm
Po 0 0 0 15 4FE596E1 00000000 ~~
Li Dira2mmW3mm
Sc 0
AR 
Op 0 0 0
T0 0 -1000 392 392 0 77 N I 21 N "Dira2mmW3mm"
T1 0 1000 392 392 0 77 N I 21 N ""
$PAD
Sh "1" C 1180 1180 0 0 0
Dr 787 0 0
At STD N 00E0FFFF
Ne 0 ""
Po 0 0
$EndPAD
$EndMODULE Dira2mmW3mm
$MODULE Dira2mmW4mm
Po 0 0 0 15 4FE597D3 00000000 ~~
Li Dira2mmW4mm
Sc 0
AR 
Op 0 0 0
T0 0 -1250 392 392 0 77 N I 21 N "Dira2mmW4mm"
T1 0 1250 392 392 0 77 N I 21 N "Val**"
$PAD
Sh "1" C 1574 1574 0 0 0
Dr 787 0 0
At STD N 00E0FFFF
Ne 0 ""
Po 0 0
$EndPAD
$EndMODULE Dira2mmW4mm
$MODULE Dira2mmW5mm
Po 0 0 0 15 4FE597DE 00000000 ~~
Li Dira2mmW5mm
Sc 0
AR 
Op 0 0 0
T0 0 -1500 392 392 0 77 N I 21 N "Dira2mmW5mm"
T1 0 1500 392 392 0 77 N I 21 N "Val**"
$PAD
Sh "1" C 1968 1968 0 0 0
Dr 787 0 0
At STD N 00E0FFFF
Ne 0 ""
Po 0 0
$EndPAD
$EndMODULE Dira2mmW5mm
$MODULE Dira3,5mmNTPH
Po 0 0 0 15 4FE59BE6 00000000 ~~
Li Dira3,5mmNTPH
Sc 0
AR 
Op 0 0 0
T0 0 -1250 392 392 0 77 N I 21 N "Dira3,5mmNTPH"
T1 0 0 392 392 0 77 N I 21 N "Val**"
$PAD
Sh "" C 1377 1377 0 0 0
Dr 1377 0 0
At HOLE N 00E0FFFF
Ne 0 ""
Po 0 0
$EndPAD
$EndMODULE Dira3,5mmNTPH
$MODULE Dira3.5mmW4mm
Po 0 0 0 15 4FE5994F 00000000 ~~
Li Dira3.5mmW4mm
Sc 0
AR 
Op 0 0 0
T0 0 -1250 392 392 0 77 N I 21 N "Dira3.5mmW4mm"
T1 0 1250 392 392 0 77 N I 21 N "Val**"
$PAD
Sh "1" C 1574 1574 0 0 0
Dr 1377 0 0
At STD N 00E0FFFF
Ne 0 ""
Po 0 0
$EndPAD
$EndMODULE Dira3.5mmW4mm
$MODULE Dira3.5mmW5mm
Po 0 0 0 15 4FE59974 00000000 ~~
Li Dira3.5mmW5mm
Sc 0
AR 
Op 0 0 0
T0 0 -1500 392 392 0 77 N I 21 N "Dira3.5mmW5mm"
T1 0 1500 392 392 0 77 N I 21 N "Val**"
$PAD
Sh "1" C 1968 1968 0 0 0
Dr 1377 0 0
At STD N 00E0FFFF
Ne 0 ""
Po 0 0
$EndPAD
$EndMODULE Dira3.5mmW5mm
$MODULE Dira3.5mmW6mm
Po 0 0 0 15 4FE59989 00000000 ~~
Li Dira3.5mmW6mm
Sc 0
AR 
Op 0 0 0
T0 0 -1750 392 392 0 77 N I 21 N "Dira3.5mmW6mm"
T1 0 1750 392 392 0 77 N I 21 N "Val**"
$PAD
Sh "1" C 2362 2362 0 0 0
Dr 1377 0 0
At STD N 00E0FFFF
Ne 0 ""
Po 0 0
$EndPAD
$EndMODULE Dira3.5mmW6mm
$MODULE Dira3.5mmW7mm
Po 0 0 0 15 4FE5999E 00000000 ~~
Li Dira3.5mmW7mm
Sc 0
AR 
Op 0 0 0
T0 0 -1750 392 392 0 77 N I 21 N "Dira3.5mmW7mm"
T1 0 1750 392 392 0 77 N I 21 N "Val**"
$PAD
Sh "1" C 2755 2755 0 0 0
Dr 1377 0 0
At STD N 00E0FFFF
Ne 0 ""
Po 0 0
$EndPAD
$EndMODULE Dira3.5mmW7mm
$MODULE Dira3mmNTPH
Po 0 0 0 15 4FE59BFD 00000000 ~~
Li Dira3mmNTPH
Sc 0
AR 
Op 0 0 0
T0 0 -1000 392 392 0 77 N I 21 N "Dira3mmNTPH"
T1 0 0 392 392 0 77 N I 21 N "Val**"
$PAD
Sh "" C 1181 1181 0 0 0
Dr 1181 0 0
At HOLE N 00E0FFFF
Ne 0 ""
Po 0 0
$EndPAD
$EndMODULE Dira3mmNTPH
$MODULE Dira3mmW4mm
Po 0 0 0 15 4FE598A4 00000000 ~~
Li Dira3mmW4mm
Sc 0
AR 
Op 0 0 0
T0 0 -1250 392 392 0 77 N I 21 N "Dira3mmW4mm"
T1 0 1250 392 392 0 77 N I 21 N "Val**"
$PAD
Sh "1" C 1574 1574 0 0 0
Dr 1181 0 0
At STD N 00E0FFFF
Ne 0 ""
Po 0 0
$EndPAD
$EndMODULE Dira3mmW4mm
$MODULE Dira3mmW5mm
Po 0 0 0 15 4FE597EC 00000000 ~~
Li Dira3mmW5mm
Sc 0
AR 
Op 0 0 0
T0 0 -1500 392 392 0 77 N I 21 N "Dira3mmW5mm"
T1 0 1500 392 392 0 77 N I 21 N "Val**"
$PAD
Sh "1" C 1967 1967 0 0 0
Dr 1181 0 0
At STD N 00E0FFFF
Ne 0 ""
Po 0 0
$EndPAD
$EndMODULE Dira3mmW5mm
$MODULE Dira3mmW6mm
Po 0 0 0 15 4FE598C1 00000000 ~~
Li Dira3mmW6mm
Sc 0
AR 
Op 0 0 0
T0 0 -1750 392 392 0 77 N I 21 N "Dira3mmW6mm"
T1 0 1750 392 392 0 77 N I 21 N "Val**"
$PAD
Sh "1" C 2362 2362 0 0 0
Dr 1180 0 0
At STD N 00E0FFFF
Ne 0 ""
Po 0 0
$EndPAD
$EndMODULE Dira3mmW6mm
$MODULE Dira4mmNTPH
Po 0 0 0 15 4FE59BCE 00000000 ~~
Li Dira4mmNTPH
Sc 0
AR 
Op 0 0 0
T0 0 -1250 392 392 0 77 N I 21 N "Dira4mmNTPH"
T1 0 0 392 392 0 77 N I 21 N "Val**"
$PAD
Sh "" C 1574 1574 0 0 0
Dr 1574 0 0
At HOLE N 00E0FFFF
Ne 0 ""
Po 0 0
$EndPAD
$EndMODULE Dira4mmNTPH
$MODULE Dira4mmW5mm
Po 0 0 0 15 4FE598EC 00000000 ~~
Li Dira4mmW5mm
Sc 0
AR 
Op 0 0 0
T0 0 -1750 392 392 0 77 N I 21 N "Dira4mmW5mm"
T1 0 1750 392 392 0 77 N I 21 N "Val**"
$PAD
Sh "1" C 1968 1968 0 0 0
Dr 1574 0 0
At STD N 00E0FFFF
Ne 0 ""
Po 0 0
$EndPAD
$EndMODULE Dira4mmW5mm
$MODULE Dira4mmW6mm
Po 0 0 0 15 4FE59904 00000000 ~~
Li Dira4mmW6mm
Sc 0
AR 
Op 0 0 0
T0 0 -1750 392 392 0 77 N I 21 N "Dira4mmW6mm"
T1 0 1750 392 392 0 77 N I 21 N "Val**"
$PAD
Sh "1" C 2362 2362 0 0 0
Dr 1574 0 0
At STD N 00E0FFFF
Ne 0 ""
Po 0 0
$EndPAD
$EndMODULE Dira4mmW6mm
$MODULE Dira4mmW7mm
Po 0 0 0 15 4FE5992E 00000000 ~~
Li Dira4mmW7mm
Sc 0
AR 
Op 0 0 0
T0 0 -1750 392 392 0 77 N I 21 N "Dira4mmW7mm"
T1 0 1750 392 392 0 77 N I 21 N "Val**"
$PAD
Sh "1" C 2755 2755 0 0 0
Dr 1574 0 0
At STD N 00E0FFFF
Ne 0 ""
Po 0 0
$EndPAD
$EndMODULE Dira4mmW7mm
$MODULE Dira5mmNTPH
Po 0 0 0 15 4FE59BBA 00000000 ~~
Li Dira5mmNTPH
Sc 0
AR 
Op 0 0 0
T0 0 -1500 392 392 0 77 N I 21 N "Dira5mmNTPH"
T1 0 0 392 392 0 77 N I 21 N "Val**"
$PAD
Sh "" C 1968 1968 0 0 0
Dr 1968 0 0
At HOLE N 00E0FFFF
Ne 0 ""
Po 0 0
$EndPAD
$EndMODULE Dira5mmNTPH
$MODULE Dira5mmW6mm
Po 0 0 0 15 4FE599C4 00000000 ~~
Li Dira5mmW6mm
Sc 0
AR 
Op 0 0 0
T0 0 -1750 392 392 0 77 N I 21 N "Dira5mmW6mm"
T1 0 1750 392 392 0 77 N I 21 N "Val**"
$PAD
Sh "1" C 2362 2362 0 0 0
Dr 1968 0 0
At STD N 00E0FFFF
Ne 0 ""
Po 0 0
$EndPAD
$EndMODULE Dira5mmW6mm
$MODULE Dira5mmW7mm
Po 0 0 0 15 4FE599DD 00000000 ~~
Li Dira5mmW7mm
Sc 0
AR 
Op 0 0 0
T0 0 -1750 392 392 0 77 N I 21 N "Dira5mmW7mm"
T1 0 1750 392 392 0 77 N I 21 N "Val**"
$PAD
Sh "1" C 2755 2755 0 0 0
Dr 1967 0 0
At STD N 00E0FFFF
Ne 0 ""
Po 0 0
$EndPAD
$EndMODULE Dira5mmW7mm
$MODULE Dira5mmW8mm
Po 0 0 0 15 4FE599F7 00000000 ~~
Li Dira5mmW8mm
Sc 0
AR 
Op 0 0 0
T0 0 -2000 392 392 0 77 N I 21 N "Dira5mmW8mm"
T1 0 2000 392 392 0 77 N I 21 N "Val**"
$PAD
Sh "1" C 3149 3149 0 0 0
Dr 1967 0 0
At STD N 00E0FFFF
Ne 0 ""
Po 0 0
$EndPAD
$EndMODULE Dira5mmW8mm
$MODULE Dira6mmNTPH
Po 0 0 0 15 4FE59BA7 00000000 ~~
Li Dira6mmNTPH
Sc 0
AR 
Op 0 0 0
T0 0 -1500 392 392 0 77 N I 21 N "Dira6mmNTPH"
T1 0 0 392 392 0 77 N I 21 N "Val**"
$PAD
Sh "" C 2362 2362 0 0 0
Dr 2362 0 0
At HOLE N 00E0FFFF
Ne 0 ""
Po 0 0
$EndPAD
$EndMODULE Dira6mmNTPH
$MODULE Dira7mmNTPH
Po 0 0 0 15 4FE59B90 00000000 ~~
Li Dira7mmNTPH
Sc 0
AR 
Op 0 0 0
T0 0 -1750 392 392 0 77 N I 21 N "Dira7mmNTPH"
T1 0 0 392 392 0 77 N I 21 N "Val**"
$PAD
Sh "" C 2755 2755 0 0 0
Dr 2755 0 0
At HOLE N 00E0FFFF
Ne 0 ""
Po 0 0
$EndPAD
$EndMODULE Dira7mmNTPH
$MODULE Dira8mmNTPH
Po 0 0 0 15 4FE59B70 00000000 ~~
Li Dira8mmNTPH
Sc 0
AR 
Op 0 0 0
T0 0 -2000 392 392 0 77 N I 21 N "Dira8mmNTPH"
T1 0 0 392 392 0 77 N I 21 N "Val**"
$PAD
Sh "" C 3149 3149 0 0 0
Dr 3149 0 0
At HOLE N 00E0FFFF
Ne 0 ""
Po 0 0
$EndPAD
$EndMODULE Dira8mmNTPH
$MODULE Dira8mmW10mm
Po 0 0 0 15 4FE59A48 00000000 ~~
Li Dira8mmW10mm
Sc 0
AR 
Op 0 0 0
T0 0 -2500 392 392 0 77 N I 21 N "Dira8mmW10mm"
T1 0 1000 392 392 0 77 N I 21 N "Val**"
$PAD
Sh "1" C 3937 3937 0 0 0
Dr 3149 0 0
At STD N 00E0FFFF
Ne 0 ""
Po 0 0
$EndPAD
$EndMODULE Dira8mmW10mm
$MODULE Dira8mmW11mm
Po 0 0 0 15 4FE59A5E 00000000 ~~
Li Dira8mmW11mm
Sc 0
AR 
Op 0 0 0
T0 0 -2750 392 392 0 77 N I 21 N "Dira8mmW11mm"
T1 0 1000 392 392 0 77 N I 21 N "Val**"
$PAD
Sh "1" C 4330 4330 0 0 0
Dr 3149 0 0
At STD N 00E0FFFF
Ne 0 ""
Po 0 0
$EndPAD
$EndMODULE Dira8mmW11mm
$MODULE Dira8mmW9mm
Po 0 0 0 15 4FE59A37 00000000 ~~
Li Dira8mmW9mm
Sc 0
AR 
Op 0 0 0
T0 0 -2250 392 392 0 77 N I 21 N "Dira8mmW9mm"
T1 0 1000 392 392 0 77 N I 21 N "Val**"
$PAD
Sh "1" C 3543 3543 0 0 0
Dr 3149 0 0
At STD N 00E0FFFF
Ne 0 ""
Po 0 0
$EndPAD
$EndMODULE Dira8mmW9mm
$MODULE Dira9mmNTPH
Po 0 0 0 15 4FE59B4C 00000000 ~~
Li Dira9mmNTPH
Sc 0
AR 
Op 0 0 0
T0 0 -2250 392 392 0 77 N I 21 N "Dira9mmNTPH"
T1 0 1250 392 392 0 77 N I 21 N "Val**"
$PAD
Sh "" C 3543 3543 0 0 0
Dr 3543 0 0
At HOLE N 00E0FFFF
Ne 0 ""
Po 0 0
$EndPAD
$EndMODULE Dira9mmNTPH
$EndLIBRARY
