PCBNEW-LibModule-V1  So 23. červen 2012, 16:29:54 CEST
# encoding utf-8
Units deci-mils
$INDEX
ADPS-9300
$EndINDEX
$MODULE ADPS-9300
Po 0 0 0 15 4FE5D266 00000000 ~~
Li ADPS-9300
Sc 0
AR 
Op 0 0 0
.LocalClearance 78
T0 0 -906 393 393 0 78 N V 21 N "ADPS-9300"
T1 0 945 393 393 0 78 N I 21 N "Value"
DC -866 394 -827 394 78 21
DS -512 -433 -512 433 78 21
DS -512 433 512 433 78 21
DS 512 433 512 -433 78 21
DS 512 -433 -512 -433 78 21
$PAD
Sh "1" R 432 235 0 0 0
Dr 0 0 0
At SMD N 00888000
Ne 0 ""
Po -433 394
$EndPAD
$PAD
Sh "2" R 432 235 0 0 0
Dr 0 0 0
At SMD N 00888000
Ne 0 ""
Po 433 394
$EndPAD
$PAD
Sh "3" R 432 235 0 0 0
Dr 0 0 0
At SMD N 00888000
Ne 0 ""
Po 433 0
$EndPAD
$PAD
Sh "4" R 432 235 0 0 0
Dr 0 0 0
At SMD N 00888000
Ne 0 ""
Po 433 -394
$EndPAD
$PAD
Sh "5" R 432 235 0 0 0
Dr 0 0 0
At SMD N 00888000
Ne 0 ""
Po -433 -394
$EndPAD
$PAD
Sh "6" R 432 235 0 0 0
Dr 0 0 0
At SMD N 00888000
Ne 0 ""
Po -433 0
$EndPAD
$EndMODULE ADPS-9300
$EndLIBRARY
