PCBNEW-LibModule-V1  Čt 21. červen 2012, 21:56:08 CEST
# encoding utf-8
Units deci-mils
$INDEX
DO214-1
DO7
SOD123-1
$EndINDEX
$MODULE DO214-1
Po 0 0 0 15 4FE37C00 00000000 ~~
Li DO214-1
Sc 0
AR 
Op 0 0 0
T0 0 -1024 394 394 0 79 N V 21 N "DO214-1"
T1 0 -1614 394 394 0 79 N I 21 N "VAL**"
DS -157 0 -276 0 100 21
DS -157 -354 -157 354 100 21
DS 157 -315 157 315 100 21
DS 157 315 -118 0 100 21
DS -118 0 157 -315 100 21
DS 276 0 157 0 100 21
DS -1299 -669 -1299 669 100 21
DS -1299 669 1299 669 100 21
DS 1299 669 1299 -669 100 21
DS 1299 -669 -1299 -669 100 21
DS -1299 -669 -1299 669 100 26
DS -1299 669 1299 669 100 26
DS 1299 669 1299 -669 100 26
DS 1299 -669 -1299 -669 100 26
$PAD
Sh "2" R 787 787 0 0 0
Dr 0 0 0
At SMD N 00888000
Ne 0 ""
Po -764 0
$EndPAD
$PAD
Sh "1" R 787 787 0 0 0
Dr 0 0 0
At SMD N 00888000
Ne 0 ""
Po 764 0
$EndPAD
$EndMODULE DO214-1
$MODULE DO7
Po 0 0 0 15 4FD0EC2B 00000000 ~~
Li DO7
Sc 0
AR 
Op 0 0 0
T0 0 -1200 393 393 0 78 N V 21 N "DO7"
T1 -500 0 393 393 0 78 N I 21 N "Value"
DS 1250 750 1250 -750 150 21
DS 1000 -750 1000 750 150 21
DS 1000 750 1250 750 150 21
DS 2000 0 2750 0 150 21
DS -2000 0 -2750 0 150 21
DS -2000 -750 -2000 750 150 21
DS -2000 750 2000 750 150 21
DS 2000 750 2000 -750 150 21
DS 2000 -750 -2000 -750 150 21
$PAD
Sh "1" C 1250 1250 0 0 0
Dr 472 0 0
At STD N 00E0FFFF
Ne 0 ""
Po -3000 0
$EndPAD
$PAD
Sh "2" C 1250 1250 0 0 0
Dr 472 0 0
At STD N 00E0FFFF
Ne 0 ""
Po 3000 0
$EndPAD
$EndMODULE DO7
$MODULE SOD123-1
Po 0 0 0 15 4FE37C52 00000000 ~~
Li SOD123-1
Sc 0
AR 
Op 0 0 0
T0 0 -787 315 315 0 77 N V 21 N "SOD123-1"
T1 0 -1220 315 315 0 78 N I 21 N "VAL**"
DS 0 0 315 0 100 21
DS 0 -276 0 276 100 21
DS -354 0 -236 0 100 21
DS -236 0 -236 -236 100 21
DS -236 -236 0 0 100 21
DS 0 0 -236 197 100 21
DS -236 197 -236 0 100 21
DS -945 394 -945 512 100 21
DS -945 512 -551 512 100 21
DS -551 -512 -945 -512 100 21
DS -945 -512 -945 -394 100 21
DS 945 394 945 512 100 21
DS 945 512 551 512 100 21
DS 551 -512 945 -512 100 21
DS 945 -512 945 -394 100 21
DS -945 -512 945 -512 100 26
DS 945 -512 945 512 100 26
DS 945 512 -945 512 100 26
DS -945 512 -945 -512 100 26
DS -591 354 591 354 100 27
DS 591 354 591 -354 100 27
DS 591 -354 -591 -354 100 27
DS -591 -354 -591 354 100 27
DS 0 -276 0 236 100 27
DS -236 -236 39 0 100 27
DS 39 0 -236 197 100 27
DS 79 0 315 0 100 27
DS -236 -236 -236 197 100 27
DS -394 0 -236 0 100 27
$PAD
Sh "1" R 358 480 0 0 0
Dr 0 0 0
At SMD N 00888000
Ne 0 ""
Po 644 0
$EndPAD
$PAD
Sh "2" R 358 480 0 0 0
Dr 0 0 0
At SMD N 00888000
Ne 0 ""
Po -644 0
$EndPAD
$EndMODULE SOD123-1
$EndLIBRARY
