PCBNEW-LibModule-V1  Po 11. červen 2012, 22:30:57 CEST
# encoding utf-8
Units deci-mils
$INDEX
SW003A0A1
$EndINDEX
$MODULE SW003A0A1
Po 0 0 0 15 449AD853 00000000 ~~
Li SW003A0A1
Sc 0
AR 
Op 0 0 0
T0 120 2120 600 600 0 120 N V 21 N "SW003A0A1"
T1 0 0 600 600 0 120 N V 21 N "VAL**"
DC -4640 3940 -4460 4120 150 21
DS 5500 -4800 5500 4800 150 21
DS -5500 -4800 -5500 4800 150 21
DS -5500 4800 -5450 4800 150 21
DS -5500 -4800 5500 -4800 150 21
DS 5500 4800 -5500 4800 150 21
$PAD
Sh "3" C 1378 1378 0 0 0
Dr 472 0 0
At STD N 00E0FFFF
Ne 1 "ON/OFF"
Po -4000 -4020
$EndPAD
$PAD
Sh "2" C 1378 1378 0 0 0
Dr 472 0 0
At STD N 00E0FFFF
Ne 4 "Vin-"
Po -4000 -1020
$EndPAD
$PAD
Sh "1" C 1378 1378 0 0 0
Dr 472 0 0
At STD N 00E0FFFF
Ne 3 "Vin+"
Po -4000 980
$EndPAD
$PAD
Sh "6" C 1378 1378 0 0 0
Dr 472 0 0
At STD N 00E0FFFF
Ne 6 "Vout-"
Po 4000 -4020
$EndPAD
$PAD
Sh "5" C 1378 1378 0 0 0
Dr 472 0 0
At STD N 00E0FFFF
Ne 2 "TRIM"
Po 4000 -20
$EndPAD
$PAD
Sh "4" C 1378 1378 0 0 0
Dr 472 0 0
At STD N 00E0FFFF
Ne 5 "Vout+"
Po 4000 3940
$EndPAD
$EndMODULE SW003A0A1
$EndLIBRARY
