PCBNEW-LibModule-V1  Ne 24. červen 2012, 09:06:57 CEST
# encoding utf-8
Units deci-mils
$INDEX

SSD1303-TAB
UG-2828GFEGF01
$EndINDEX
$MODULE 
Po 0 0 0 15 4FE62A33 00000000 ~~
Li 
Sc 0
AR 
Op 0 0 0
T0 0 -945 393 393 0 78 N V 21 N "UG-2828GFEGF01"
T1 0 4331 393 393 0 78 N I 21 N "Value"
T2 0 12992 393 393 0 78 N I 21 N "Active area"
DS 4520 1970 6100 2170 70 26
DS 6100 2170 6100 6110 70 26
DS 6100 6110 6390 6110 70 26
DS 6390 6110 6390 19300 70 26
DS 6390 19300 -6010 19300 70 26
DS -6010 19300 -6010 6110 70 26
DS -6010 6110 -5710 6110 70 26
DS -5710 6110 -5710 2170 70 26
DS -5710 2170 -4340 1970 70 26
DS -4530 17330 4920 17330 70 25
DS 4920 17330 4920 8270 70 25
DS 4920 8270 -4530 8270 70 25
DS -4530 8270 -4530 17330 70 25
DS 4520 1970 6100 2170 70 21
DS 6100 2170 6100 6110 70 21
DS 6100 6110 6390 6110 70 21
DS 6390 6110 6390 19300 70 21
DS 6390 19300 -6010 19300 70 21
DS -6010 19300 -6010 6110 70 21
DS -6010 6110 -5710 6110 70 21
DS -5710 6110 -5710 2170 70 21
DS -5710 2170 -4340 1970 70 21
DS 3930 1340 3930 1970 70 26
DS 3930 1970 4330 1970 70 26
DS 4330 1970 4330 2520 70 26
DS 4330 2520 -4180 2520 70 26
DS -4180 2520 -4180 1970 70 26
DS -4180 1970 -3710 1970 70 26
DS -3710 1970 -3710 1340 70 26
DS -3080 400 3300 400 70 26
DS -3710 1970 3930 1970 70 26
DS -3710 1970 3930 1970 70 21
DS -3710 1340 -3710 1970 70 21
DS -3710 1970 -4180 1970 70 21
DS -4180 1970 -4180 2520 70 21
DS -4180 2520 4330 2520 70 21
DS 4330 2520 4330 1970 70 21
DS 4330 1970 3930 1970 70 21
DS 3930 1970 3930 1340 70 21
DS -3080 400 3300 400 70 21
DS 4400 140 3420 140 10 23
DS 3420 140 3420 1230 10 23
DS 3420 1230 3890 1230 10 23
DS 3890 1230 3890 890 10 23
DS 3890 890 4400 890 10 23
DS 4400 890 4400 140 10 23
DS 3440 160 3440 1210 10 24
DS 3440 1210 3870 1210 10 24
DS 3870 1210 3870 870 10 24
DS 3870 870 4380 870 10 24
DS 4380 870 4380 160 10 24
DS 4380 160 3440 160 10 24
DS -4220 140 -3230 140 10 23
DS -3230 140 -3230 1230 10 23
DS -3230 1230 -3710 1230 10 23
DS -3710 1230 -3710 890 10 23
DS -3710 890 -4220 890 10 23
DS -4220 890 -4220 140 10 23
DS -3250 160 -3250 1210 10 24
DS -3250 1210 -3690 1210 10 24
DS -3690 1210 -3690 870 10 24
DS -3690 870 -4200 870 10 24
DS -4200 870 -4200 160 10 24
DS -4200 160 -3250 160 10 24
$PAD
Sh "1" O 100 380 0 0 0
Dr 0 0 0
At STD N 04808000
Ne 0 ""
Po -2760 0
$EndPAD
$PAD
Sh "2" O 100 380 0 0 0
Dr 0 0 0
At STD N 04808000
Ne 0 ""
Po -2560 0
$EndPAD
$PAD
Sh "3" O 100 380 0 0 0
Dr 0 0 0
At STD N 04808000
Ne 0 ""
Po -2370 0
$EndPAD
$PAD
Sh "4" O 100 380 0 0 0
Dr 0 0 0
At STD N 04808000
Ne 0 ""
Po -2170 0
$EndPAD
$PAD
Sh "5" O 100 380 0 0 0
Dr 0 0 0
At STD N 04808000
Ne 0 ""
Po -1970 0
$EndPAD
$PAD
Sh "6" O 100 380 0 0 0
Dr 0 0 0
At STD N 04808000
Ne 0 ""
Po -1780 0
$EndPAD
$PAD
Sh "7" O 100 380 0 0 0
Dr 0 0 0
At STD N 04808000
Ne 0 ""
Po -1580 0
$EndPAD
$PAD
Sh "8" O 100 380 0 0 0
Dr 0 0 0
At STD N 04808000
Ne 0 ""
Po -1380 0
$EndPAD
$PAD
Sh "9" O 100 380 0 0 0
Dr 0 0 0
At STD N 04808000
Ne 0 ""
Po -1190 0
$EndPAD
$PAD
Sh "10" O 100 380 0 0 0
Dr 0 0 0
At STD N 04808000
Ne 0 ""
Po -990 0
$EndPAD
$PAD
Sh "11" O 100 380 0 0 0
Dr 0 0 0
At STD N 04808000
Ne 0 ""
Po -790 0
$EndPAD
$PAD
Sh "12" O 100 380 0 0 0
Dr 0 0 0
At STD N 04808000
Ne 0 ""
Po -600 0
$EndPAD
$PAD
Sh "13" O 100 380 0 0 0
Dr 0 0 0
At STD N 04808000
Ne 0 ""
Po -400 0
$EndPAD
$PAD
Sh "14" O 100 380 0 0 0
Dr 0 0 0
At STD N 04808000
Ne 0 ""
Po -200 0
$EndPAD
$PAD
Sh "15" O 100 380 0 0 0
Dr 0 0 0
At STD N 04808000
Ne 0 ""
Po 0 0
$EndPAD
$PAD
Sh "16" O 100 380 0 0 0
Dr 0 0 0
At STD N 04808000
Ne 0 ""
Po 190 0
$EndPAD
$PAD
Sh "17" O 100 380 0 0 0
Dr 0 0 0
At STD N 04808000
Ne 0 ""
Po 390 0
$EndPAD
$PAD
Sh "18" O 100 380 0 0 0
Dr 0 0 0
At STD N 04808000
Ne 0 ""
Po 590 0
$EndPAD
$PAD
Sh "19" O 100 380 0 0 0
Dr 0 0 0
At STD N 04808000
Ne 0 ""
Po 780 0
$EndPAD
$PAD
Sh "20" O 100 380 0 0 0
Dr 0 0 0
At STD N 04808000
Ne 0 ""
Po 980 0
$EndPAD
$PAD
Sh "21" O 100 380 0 0 0
Dr 0 0 0
At STD N 04808000
Ne 0 ""
Po 1180 0
$EndPAD
$PAD
Sh "22" O 100 380 0 0 0
Dr 0 0 0
At STD N 04808000
Ne 0 ""
Po 1370 0
$EndPAD
$PAD
Sh "23" O 100 380 0 0 0
Dr 0 0 0
At STD N 04808000
Ne 0 ""
Po 1570 0
$EndPAD
$PAD
Sh "24" O 100 380 0 0 0
Dr 0 0 0
At STD N 04808000
Ne 0 ""
Po 1770 0
$EndPAD
$PAD
Sh "25" O 100 380 0 0 0
Dr 0 0 0
At STD N 04808000
Ne 0 ""
Po 1960 0
$EndPAD
$PAD
Sh "26" O 100 380 0 0 0
Dr 0 0 0
At STD N 04808000
Ne 0 ""
Po 2160 0
$EndPAD
$PAD
Sh "27" O 100 380 0 0 0
Dr 0 0 0
At STD N 04808000
Ne 0 ""
Po 2360 0
$EndPAD
$PAD
Sh "28" O 100 380 0 0 0
Dr 0 0 0
At STD N 04808000
Ne 0 ""
Po 2550 0
$EndPAD
$PAD
Sh "29" O 100 380 0 0 0
Dr 0 0 0
At STD N 04808000
Ne 0 ""
Po 2750 0
$EndPAD
$PAD
Sh "30" O 100 380 0 0 0
Dr 0 0 0
At STD N 04808000
Ne 0 ""
Po 2950 0
$EndPAD
$EndMODULE 
$MODULE SSD1303-TAB
Po 0 0 0 15 4FE6BC21 00000000 ~~
Li SSD1303-TAB
Sc 0
AR 
Op 0 0 0
T0 0 6299 393 393 0 78 N V 21 N "SSD1303-TAB"
T1 0 2264 392 392 0 77 N I 21 N "Value"
T2 0 -3345 392 392 0 77 N I 21 N "Active area"
DS -5440 -4640 -5440 -2240 110 25
DS -5440 -2240 5430 -2240 110 25
DS 5430 -2240 5430 -4640 110 25
DS 5430 -4640 -5440 -4640 110 25
DS -5520 0 5470 0 110 25
DS -5520 1110 5430 1110 110 25
DS -1890 3310 1880 3310 110 25
DS 1880 3310 1880 4020 110 25
DS 1880 4020 -1890 4020 110 25
DS -1890 4020 -1890 3310 110 25
DS -5510 0 -6620 0 110 21
DS -6620 0 -6620 -5700 110 21
DS -6620 -5700 6530 -5700 110 21
DS 6530 -5700 6530 0 110 21
DS 6530 0 5430 0 110 21
DS 5430 0 5430 5830 110 21
DS 5430 5830 -5510 5830 110 21
DS -5510 5830 -5510 0 110 21
$PAD
Sh "1" R 140 680 0 0 0
Dr 0 0 0
At SMD N 00888000
Ne 0 ""
Po -5020 5190
$EndPAD
$PAD
Sh "2" R 140 680 0 0 0
Dr 0 0 0
At SMD N 00888000
Ne 0 ""
Po -4690 5190
$EndPAD
$PAD
Sh "3" R 140 680 0 0 0
Dr 0 0 0
At SMD N 00888000
Ne 0 ""
Po -4360 5190
$EndPAD
$PAD
Sh "4" R 140 680 0 0 0
Dr 0 0 0
At SMD N 00888000
Ne 0 ""
Po -4020 5190
$EndPAD
$PAD
Sh "5" R 140 680 0 0 0
Dr 0 0 0
At SMD N 00888000
Ne 0 ""
Po -3690 5190
$EndPAD
$PAD
Sh "6" R 140 680 0 0 0
Dr 0 0 0
At SMD N 00888000
Ne 0 ""
Po -3350 5190
$EndPAD
$PAD
Sh "7" R 140 680 0 0 0
Dr 0 0 0
At SMD N 00888000
Ne 0 ""
Po -3020 5190
$EndPAD
$PAD
Sh "8" R 140 680 0 0 0
Dr 0 0 0
At SMD N 00888000
Ne 0 ""
Po -2680 5190
$EndPAD
$PAD
Sh "9" R 140 680 0 0 0
Dr 0 0 0
At SMD N 00888000
Ne 0 ""
Po -2350 5190
$EndPAD
$PAD
Sh "10" R 140 680 0 0 0
Dr 0 0 0
At SMD N 00888000
Ne 0 ""
Po -2010 5190
$EndPAD
$PAD
Sh "11" R 140 680 0 0 0
Dr 0 0 0
At SMD N 00888000
Ne 0 ""
Po -1680 5190
$EndPAD
$PAD
Sh "12" R 140 680 0 0 0
Dr 0 0 0
At SMD N 00888000
Ne 0 ""
Po -1340 5190
$EndPAD
$PAD
Sh "13" R 140 680 0 0 0
Dr 0 0 0
At SMD N 00888000
Ne 0 ""
Po -1010 5190
$EndPAD
$PAD
Sh "14" R 140 680 0 0 0
Dr 0 0 0
At SMD N 00888000
Ne 0 ""
Po -670 5190
$EndPAD
$PAD
Sh "15" R 140 680 0 0 0
Dr 0 0 0
At SMD N 00888000
Ne 0 ""
Po -340 5190
$EndPAD
$PAD
Sh "16" R 140 680 0 0 0
Dr 0 0 0
At SMD N 00888000
Ne 0 ""
Po 0 5190
$EndPAD
$PAD
Sh "17" R 140 680 0 0 0
Dr 0 0 0
At SMD N 00888000
Ne 0 ""
Po 330 5190
$EndPAD
$PAD
Sh "18" R 140 680 0 0 0
Dr 0 0 0
At SMD N 00888000
Ne 0 ""
Po 660 5190
$EndPAD
$PAD
Sh "19" R 140 680 0 0 0
Dr 0 0 0
At SMD N 00888000
Ne 0 ""
Po 1000 5190
$EndPAD
$PAD
Sh "20" R 140 680 0 0 0
Dr 0 0 0
At SMD N 00888000
Ne 0 ""
Po 1330 5190
$EndPAD
$PAD
Sh "21" R 140 680 0 0 0
Dr 0 0 0
At SMD N 00888000
Ne 0 ""
Po 1670 5190
$EndPAD
$PAD
Sh "22" R 140 680 0 0 0
Dr 0 0 0
At SMD N 00888000
Ne 0 ""
Po 2000 5190
$EndPAD
$PAD
Sh "23" R 140 680 0 0 0
Dr 0 0 0
At SMD N 00888000
Ne 0 ""
Po 2340 5190
$EndPAD
$PAD
Sh "24" R 140 680 0 0 0
Dr 0 0 0
At SMD N 00888000
Ne 0 ""
Po 2670 5190
$EndPAD
$PAD
Sh "25" R 140 680 0 0 0
Dr 0 0 0
At SMD N 00888000
Ne 0 ""
Po 3010 5190
$EndPAD
$PAD
Sh "26" R 140 680 0 0 0
Dr 0 0 0
At SMD N 00888000
Ne 0 ""
Po 3340 5190
$EndPAD
$PAD
Sh "27" R 140 680 0 0 0
Dr 0 0 0
At SMD N 00888000
Ne 0 ""
Po 3680 5190
$EndPAD
$PAD
Sh "28" R 140 680 0 0 0
Dr 0 0 0
At SMD N 00888000
Ne 0 ""
Po 4010 5190
$EndPAD
$PAD
Sh "29" R 140 680 0 0 0
Dr 0 0 0
At SMD N 00888000
Ne 0 ""
Po 4350 5190
$EndPAD
$PAD
Sh "30" R 140 680 0 0 0
Dr 0 0 0
At SMD N 00888000
Ne 0 ""
Po 4680 5190
$EndPAD
$PAD
Sh "31" R 140 680 0 0 0
Dr 0 0 0
At SMD N 00888000
Ne 0 ""
Po 5010 5190
$EndPAD
$PAD
Sh "" C 354 354 0 0 0
Dr 354 0 0
At HOLE N 00E0FFFF
Ne 0 ""
Po -4340 4260
$EndPAD
$PAD
Sh "" C 354 354 0 0 0
Dr 354 0 0
At HOLE N 00E0FFFF
Ne 0 ""
Po 4330 4260
$EndPAD
$EndMODULE SSD1303-TAB
$MODULE UG-2828GFEGF01
Po 0 0 0 15 4FE6BC84 00000000 ~~
Li UG-2828GFEGF01
Sc 0
AR 
Op 0 0 0
.LocalClearance 78
T0 0 -945 393 393 0 78 N V 21 N "UG-2828GFEGF01"
T1 0 4331 393 393 0 78 N I 21 N "Value"
T2 0 12992 393 393 0 78 N I 21 N "Active area"
DS -4530 17330 4920 17330 70 25
DS 4920 17330 4920 8270 70 25
DS 4920 8270 -4530 8270 70 25
DS -4530 8270 -4530 17330 70 25
DS 4520 1970 6100 2170 70 21
DS 6100 2170 6100 6110 70 21
DS 6100 6110 6390 6110 70 21
DS 6390 6110 6390 19300 70 21
DS 6390 19300 -6010 19300 70 21
DS -6010 19300 -6010 6110 70 21
DS -6010 6110 -5710 6110 70 21
DS -5710 6110 -5710 2170 70 21
DS -5710 2170 -4340 1970 70 21
DS -3710 1970 3930 1970 70 21
DS -3710 1340 -3710 1970 70 21
DS -3710 1970 -4180 1970 70 21
DS -4180 1970 -4180 2520 70 21
DS -4180 2520 4330 2520 70 21
DS 4330 2520 4330 1970 70 21
DS 4330 1970 3930 1970 70 21
DS 3930 1970 3930 1340 70 21
DS -3080 400 3300 400 70 21
DS -3230 1230 -3710 1230 10 23
$PAD
Sh "1" O 100 380 0 0 0
Dr 0 0 0
At SMD N 00888000
Ne 0 ""
Po -2760 0
$EndPAD
$PAD
Sh "2" O 100 380 0 0 0
Dr 0 0 0
At SMD N 00888000
Ne 0 ""
Po -2560 0
$EndPAD
$PAD
Sh "3" O 100 380 0 0 0
Dr 0 0 0
At SMD N 00888000
Ne 0 ""
Po -2370 0
$EndPAD
$PAD
Sh "4" O 100 380 0 0 0
Dr 0 0 0
At SMD N 00888000
Ne 0 ""
Po -2170 0
$EndPAD
$PAD
Sh "5" O 100 380 0 0 0
Dr 0 0 0
At SMD N 00888000
Ne 0 ""
Po -1970 0
$EndPAD
$PAD
Sh "6" O 100 380 0 0 0
Dr 0 0 0
At SMD N 00888000
Ne 0 ""
Po -1780 0
$EndPAD
$PAD
Sh "7" O 100 380 0 0 0
Dr 0 0 0
At SMD N 00888000
Ne 0 ""
Po -1580 0
$EndPAD
$PAD
Sh "8" O 100 380 0 0 0
Dr 0 0 0
At SMD N 00888000
Ne 0 ""
Po -1380 0
$EndPAD
$PAD
Sh "9" O 100 380 0 0 0
Dr 0 0 0
At SMD N 00888000
Ne 0 ""
Po -1190 0
$EndPAD
$PAD
Sh "10" O 100 380 0 0 0
Dr 0 0 0
At SMD N 00888000
Ne 0 ""
Po -990 0
$EndPAD
$PAD
Sh "11" O 100 380 0 0 0
Dr 0 0 0
At SMD N 00888000
Ne 0 ""
Po -790 0
$EndPAD
$PAD
Sh "12" O 100 380 0 0 0
Dr 0 0 0
At SMD N 00888000
Ne 0 ""
Po -600 0
$EndPAD
$PAD
Sh "13" O 100 380 0 0 0
Dr 0 0 0
At SMD N 00888000
Ne 0 ""
Po -400 0
$EndPAD
$PAD
Sh "14" O 100 380 0 0 0
Dr 0 0 0
At SMD N 00888000
Ne 0 ""
Po -200 0
$EndPAD
$PAD
Sh "15" O 100 380 0 0 0
Dr 0 0 0
At SMD N 00888000
Ne 0 ""
Po 0 0
$EndPAD
$PAD
Sh "16" O 100 380 0 0 0
Dr 0 0 0
At SMD N 00888000
Ne 0 ""
Po 190 0
$EndPAD
$PAD
Sh "17" O 100 380 0 0 0
Dr 0 0 0
At SMD N 00888000
Ne 0 ""
Po 390 0
$EndPAD
$PAD
Sh "18" O 100 380 0 0 0
Dr 0 0 0
At SMD N 00888000
Ne 0 ""
Po 590 0
$EndPAD
$PAD
Sh "19" O 100 380 0 0 0
Dr 0 0 0
At SMD N 00888000
Ne 0 ""
Po 780 0
$EndPAD
$PAD
Sh "20" O 100 380 0 0 0
Dr 0 0 0
At SMD N 00888000
Ne 0 ""
Po 980 0
$EndPAD
$PAD
Sh "21" O 100 380 0 0 0
Dr 0 0 0
At SMD N 00888000
Ne 0 ""
Po 1180 0
$EndPAD
$PAD
Sh "22" O 100 380 0 0 0
Dr 0 0 0
At SMD N 00888000
Ne 0 ""
Po 1370 0
$EndPAD
$PAD
Sh "23" O 100 380 0 0 0
Dr 0 0 0
At SMD N 00888000
Ne 0 ""
Po 1570 0
$EndPAD
$PAD
Sh "24" O 100 380 0 0 0
Dr 0 0 0
At SMD N 00888000
Ne 0 ""
Po 1770 0
$EndPAD
$PAD
Sh "25" O 100 380 0 0 0
Dr 0 0 0
At SMD N 00888000
Ne 0 ""
Po 1960 0
$EndPAD
$PAD
Sh "26" O 100 380 0 0 0
Dr 0 0 0
At SMD N 00888000
Ne 0 ""
Po 2160 0
$EndPAD
$PAD
Sh "27" O 100 380 0 0 0
Dr 0 0 0
At SMD N 00888000
Ne 0 ""
Po 2360 0
$EndPAD
$PAD
Sh "28" O 100 380 0 0 0
Dr 0 0 0
At SMD N 00888000
Ne 0 ""
Po 2550 0
$EndPAD
$PAD
Sh "29" O 100 380 0 0 0
Dr 0 0 0
At SMD N 00888000
Ne 0 ""
Po 2750 0
$EndPAD
$PAD
Sh "30" O 100 380 0 0 0
Dr 0 0 0
At SMD N 00888000
Ne 0 ""
Po 2950 0
$EndPAD
$PAD
Sh "SH1" R 984 747 0 0 0
Dr 0 0 0
At SMD N 00888000
Ne 0 ""
Po -3724 515
$EndPAD
$PAD
Sh "SH1" R 476 354 0 0 0
Dr 0 0 0
At SMD N 00888000
Ne 0 ""
Po -3470 1060
$EndPAD
$PAD
Sh "SH2" R 475 354 0 0 0
Dr 0 0 0
At SMD N 00888000
Ne 0 ""
Po 3689 1060
$EndPAD
$PAD
Sh "SH2" R 984 747 0 0 0
Dr 0 0 0
At SMD N 00888000
Ne 0 ""
Po 3944 515
$EndPAD
$EndMODULE UG-2828GFEGF01
$EndLIBRARY
