PCBNEW-LibModule-V1  gio 18 ago 2011 19:50:18 CEST
$INDEX
sod87
sod80c
micromelf
melf
DO214AC
DO219AB
SOD323
SOD523
MBS
SDIP04A
$EndINDEX
$MODULE melf
Po 0 0 0 15 488CBC8E 00000000 ~~
Li melf
Cd Melf
Sc 00000000
AR
Op 0 0 0
T0 0 -1000 600 600 0 120 N V 21 "Melf"
T1 0 1000 600 600 0 120 N I 21 "D***"
DS 540 -510 540 510 50 21
DS 445 510 445 -510 50 21
DS 495 -510 495 510 50 21
DS 395 -510 395 510 50 21
DS -1025 -510 -1025 510 50 21
DS -1025 510 1025 510 50 21
DS 1025 510 1025 -510 50 21
DS 1025 -510 -1025 -510 50 21
$PAD
Sh "1" R 492 1181 0 0 0
Dr 0 0 0
At SMD N 00888000
Ne 0 ""
Po -1033 0
$EndPAD
$PAD
Sh "2" R 492 1181 0 0 0
Dr 0 0 0
At SMD N 00888000
Ne 0 ""
Po 1033 0
$EndPAD
$SHAPE3D
Na "walter\smd_diode\melf.wrl"
Sc 1.000000 1.000000 1.000000
Of 0.000000 0.000000 0.000000
Ro 0.000000 0.000000 0.000000
$EndSHAPE3D
$EndMODULE  melf
$MODULE micromelf
Po 0 0 0 15 49047482 00000000 ~~
Li micromelf
Cd Micromelf
Sc 00000000
AR
Op 0 0 0
T0 0 -420 197 197 0 47 N V 21 "Micromelf"
T1 0 420 197 197 0 47 N I 21 "D***"
DS 205 -235 205 235 50 21
DS 155 235 155 -235 50 21
DS 105 -235 105 235 50 21
DS -395 -235 -395 235 50 21
DS -395 235 395 235 50 21
DS 395 235 395 -235 50 21
DS 395 -235 -395 -235 50 21
$PAD
Sh "1" R 315 512 0 0 0
Dr 0 0 0
At SMD N 00888000
Ne 0 ""
Po -394 0
$EndPAD
$PAD
Sh "2" R 315 512 0 0 0
Dr 0 0 0
At SMD N 00888000
Ne 0 ""
Po 394 0
$EndPAD
$SHAPE3D
Na "walter\smd_diode\micromelf.wrl"
Sc 1.000000 1.000000 1.000000
Of 0.000000 0.000000 0.000000
Ro 0.000000 0.000000 0.000000
$EndSHAPE3D
$EndMODULE  micromelf
$MODULE sod80c
Po 0 0 0 15 4904752C 00000000 ~~
Li sod80c
Cd SOD80C
Sc 00000000
AR
Op 0 0 0
T0 0 -560 276 276 0 59 N V 21 "SOD80C"
T1 10 550 276 276 0 59 N I 21 "D***"
DS 415 -315 415 315 50 21
DS 365 315 365 -315 50 21
DS 315 -315 315 315 50 21
DS 730 -315 -730 -315 50 21
DS -730 -315 -730 315 50 21
DS -730 315 730 315 50 21
DS 730 315 730 -315 50 21
$PAD
Sh "1" R 394 787 0 0 0
Dr 0 0 0
At SMD N 00888000
Ne 0 ""
Po -728 0
$EndPAD
$PAD
Sh "2" R 394 787 0 0 0
Dr 0 0 0
At SMD N 00888000
Ne 0 ""
Po 728 0
$EndPAD
$SHAPE3D
Na "walter\smd_diode\sod80c.wrl"
Sc 1.000000 1.000000 1.000000
Of 0.000000 0.000000 0.000000
Ro 0.000000 0.000000 0.000000
$EndSHAPE3D
$EndMODULE  sod80c
$MODULE sod87
Po 0 0 0 15 4904754D 00000000 ~~
Li sod87
Cd SOD87
Sc 00000000
AR
Op 0 0 0
T0 10 -730 394 394 0 79 N V 21 "SOD87"
T1 0 710 394 394 0 79 N I 21 "D***"
DS 415 395 415 -395 50 21
DS 365 -395 365 395 50 21
DS 315 -395 315 395 50 21
DS -730 395 -730 -395 50 21
DS -730 -395 730 -395 50 21
DS 730 -395 730 395 50 21
DS 730 395 -730 395 50 21
$PAD
Sh "1" R 394 906 0 0 0
Dr 0 0 0
At SMD N 00888000
Ne 0 ""
Po -728 0
$EndPAD
$PAD
Sh "2" R 394 906 0 0 0
Dr 0 0 0
At SMD N 00888000
Ne 0 ""
Po 728 0
$EndPAD
$SHAPE3D
Na "walter\smd_diode\sod87.wrl"
Sc 1.000000 1.000000 1.000000
Of 0.000000 0.000000 0.000000
Ro 0.000000 0.000000 0.000000
$EndSHAPE3D
$EndMODULE  sod87
$MODULE DO214AC
Po 0 0 0 15 4A7E9C34 00000000 ~~
Li do214ac
Cd DO214AC
Sc 00000000
AR
Op 0 0 0
T0 0 -775 197 197 0 47 N V 21 N"DO214AC"
T1 0 775 197 197 0 47 N I 21 N"D***"
DS 669 -551 669 551 50 21
DS 866 -551 -866 -551 50 21
DS -866 -551 -866 551 50 21
DS -866 551 866 551 50 21
DS 866 551 866 -551 50 21
$PAD
Sh "2" R 827 669 0 0 0
Dr 0 0 0
At SMD N 00888000
Ne 0 ""
Po 681 0
$EndPAD
$PAD
Sh "1" R 827 669 0 0 0
Dr 0 0 0
At SMD N 00888000
Ne 0 ""
Po -681 0
$EndPAD
$SHAPE3D
Na "walter\smd_diode\do214ac.wrl"
Sc 1.000000 1.000000 1.000000
Of 0.000000 0.000000 0.000000
Ro 0.000000 0.000000 0.000000
$EndSHAPE3D
$EndMODULE  DO214AC
$MODULE DO219AB
Po 0 0 0 15 4A7EA629 00000000 ~~
Li do219ab
Cd DO219AB
Sc 00000000
AR
Op 0 0 0
T0 0 -551 157 157 0 39 N V 21 N"DO219AB"
T1 0 591 157 157 0 39 N I 21 N"D***"
DS 394 -394 394 394 50 21
DS 591 -394 -591 -394 50 21
DS -591 -394 -591 394 50 21
DS -591 394 591 394 50 21
DS 591 394 591 -394 50 21
$PAD
Sh "2" R 512 551 0 0 0
Dr 0 0 0
At SMD N 00888000
Ne 0 ""
Po 571 0
$EndPAD
$PAD
Sh "1" R 512 551 0 0 0
Dr 0 0 0
At SMD N 00888000
Ne 0 ""
Po -571 0
$EndPAD
$SHAPE3D
Na "walter\smd_diode\do219ab.wrl"
Sc 1.000000 1.000000 1.000000
Of 0.000000 0.000000 0.000000
Ro 0.000000 0.000000 0.000000
$EndSHAPE3D
$EndMODULE  DO219AB
$MODULE SOD323
Po 0 0 0 15 4A7EAE1A 00000000 ~~
Li sod323
Cd SOD323
Sc 00000000
AR
Op 0 0 0
T0 0 -433 157 157 0 39 N V 21 N"SOD323"
T1 0 472 157 157 0 39 N I 21 N"D***"
DS 197 -276 197 276 50 21
DS 354 -276 -354 -276 50 21
DS -354 -276 -354 276 50 21
DS -354 276 354 276 50 21
DS 354 276 354 -276 50 21
$PAD
Sh "2" R 394 236 0 0 0
Dr 0 0 0
At SMD N 00888000
Ne 0 ""
Po 433 0
$EndPAD
$PAD
Sh "1" R 394 236 0 0 0
Dr 0 0 0
At SMD N 00888000
Ne 0 ""
Po -433 0
$EndPAD
$SHAPE3D
Na "walter\smd_diode\sod323.wrl"
Sc 1.000000 1.000000 1.000000
Of 0.000000 0.000000 0.000000
Ro 0.000000 0.000000 0.000000
$EndSHAPE3D
$EndMODULE  SOD323
$MODULE SOD523
Po 0 0 0 15 4A7EAFB1 00000000 ~~
Li sod523
Cd SOD523
Sc 00000000
AR
Op 0 0 0
T0 0 -276 118 118 0 28 N V 21 N"SOD523"
T1 0 276 118 118 0 28 N I 21 N"D***"
DS 118 -157 118 157 50 21
DS 236 -157 -236 -157 50 21
DS -236 -157 -236 157 50 21
DS -236 157 236 157 50 21
DS 236 157 236 -157 50 21
$PAD
Sh "2" R 236 315 0 0 0
Dr 0 0 0
At SMD N 00888000
Ne 0 ""
Po 335 0
$EndPAD
$PAD
Sh "1" R 236 315 0 0 0
Dr 0 0 0
At SMD N 00888000
Ne 0 ""
Po -335 0
$EndPAD
$SHAPE3D
Na "walter\smd_diode\sod523.wrl"
Sc 1.000000 1.000000 1.000000
Of 0.000000 0.000000 0.000000
Ro 0.000000 0.000000 0.000000
$EndSHAPE3D
$EndMODULE  SOD523
$MODULE SDIP04A
Po 0 0 0 15 4E4D460A 00000000 ~~
Li SDIP04A
Sc 00000000
AR
Op 0 0 0
T0 0 -1969 315 315 0 59 N V 21 N"DB***"
T1 0 2008 315 315 0 59 N V 21 N"SDIP04A"
DS 1772 984 1280 984 150 21
DS 1772 -984 1280 -984 150 21
DS -1772 -984 -1280 -984 150 21
DS -1772 984 -1280 984 150 21
DS -1280 1673 1280 1673 150 21
DS 1280 1673 1280 -1673 150 21
DS 1280 -1673 -1280 -1673 150 21
DS -1280 -1673 -1280 1673 150 21
DS 984 -984 669 -984 100 21
DS 984 983 669 983 100 21
DS 827 826 827 1141 100 21
DA -827 1024 -670 1024 900 100 21
DA -826 1024 -826 1181 900 100 21
DA -512 1024 -670 1024 900 100 21
DA -512 1024 -512 866 900 100 21
DA -512 -945 -512 -1103 900 100 21
DA -512 -945 -670 -945 900 100 21
DA -827 -945 -827 -788 900 100 21
DA -827 -945 -670 -945 900 100 21
$PAD
Sh "2" R 591 512 0 0 0
Dr 0 0 0
At SMD N 00888000
Ne 0 ""
Po -1752 -1004
$EndPAD
$PAD
Sh "4" R 591 512 0 0 0
Dr 0 0 0
At SMD N 00888000
Ne 0 ""
Po -1752 1004
$EndPAD
$PAD
Sh "1" R 591 512 0 0 0
Dr 0 0 0
At SMD N 00888000
Ne 0 ""
Po 1752 1004
$EndPAD
$PAD
Sh "3" R 591 512 0 0 0
Dr 0 0 0
At SMD N 00888000
Ne 0 ""
Po 1752 -1004
$EndPAD
$SHAPE3D
Na "walter\smd_diode\sdip04a.wrl"
Sc 1.000000 1.000000 1.000000
Of 0.000000 0.000000 0.000000
Ro 0.000000 0.000000 0.000000
$EndSHAPE3D
$EndMODULE  SDIP04A
$MODULE MBS
Po 0 0 0 15 4E4D50C4 00000000 ~~
Li MBS
Sc 00000000
AR 
Op 0 0 0
T0 0 -1260 315 315 0 59 N V 21 N"DB***"
T1 0 1339 315 315 0 59 N V 21 N"MBS"
DS 827 -512 1181 -512 150 21
DS 827 512 1181 512 150 21
DS -827 512 -1181 512 150 21
DS -827 -512 -1181 -512 150 21
DS 630 -512 315 -512 50 21
DS 630 511 315 511 50 21
DS 472 354 472 669 50 21
DA -551 512 -394 512 900 50 21
DA -551 512 -551 669 900 50 21
DA -236 512 -394 512 900 50 21
DA -236 512 -236 354 900 50 21
DA -236 -512 -236 -670 900 50 21
DA -236 -512 -394 -512 900 50 21
DA -551 -512 -551 -355 900 50 21
DA -551 -512 -394 -512 900 50 21
DS -827 -965 -827 965 150 21
DS -827 965 827 965 150 21
DS 827 965 827 -965 150 21
DS 827 -965 -827 -965 150 21
$PAD
Sh "2" R 472 315 0 0 0
Dr 0 0 0
At SMD N 00888000
Ne 0 ""
Po -1161 -500
$EndPAD
$PAD
Sh "4" R 472 315 0 0 0
Dr 0 0 0
At SMD N 00888000
Ne 0 ""
Po -1161 500
$EndPAD
$PAD
Sh "1" R 472 315 0 0 0
Dr 0 0 0
At SMD N 00888000
Ne 0 ""
Po 1161 500
$EndPAD
$PAD
Sh "3" R 472 315 0 0 0
Dr 0 0 0
At SMD N 00888000
Ne 0 ""
Po 1161 -500
$EndPAD
$SHAPE3D
Na "walter\smd_diode\mbs.wrl"
Sc 1.000000 1.000000 1.000000
Of 0.000000 0.000000 0.000000
Ro 0.000000 0.000000 0.000000
$EndSHAPE3D
$EndMODULE  MBS
$EndLIBRARY
