PCBNEW-LibModule-V1  5.4.2012 21:36:02
# encoding utf-8
$INDEX
R0204
R0207
RRW1
RRW1-19mm
RRW2
RRW2-19mm
RRW2-19mm_BP
RRW5
RRW5_BP
ŐŚďtĆÇřţ˙˙˙Úító-
$EndINDEX
$MODULE
Po 0 0 0 15 4F7DF0AF 4F7DF081 ~~
Li
Sc 4F7DF081
AR
Op 0 0 0
T0 0 -750 394 394 0 59 N V 21 N "R0204"
T1 0 750 394 394 0 59 N I 21 N "Value"
DS -990 0 -680 0 110 26
DS -680 -350 700 -350 110 26
DS 700 -350 700 360 110 26
DS 700 360 -680 360 110 26
DS -680 360 -680 -350 110 26
DS 700 0 970 0 110 26
DS 700 0 970 0 110 21
DS -990 0 -680 0 110 21
DS -680 -350 700 -350 110 21
DS 700 -350 700 360 110 21
DS 700 360 -680 360 110 21
DS -680 360 -680 -350 110 21
$PAD
Sh "1" C 700 700 0 0 0
Dr 300 0 0
At STD N 00E0FFFF
Ne 0 ""
Po -1500 0
$EndPAD
$PAD
Sh "2" C 700 700 0 0 0
Dr 300 0 0
At STD N 00E0FFFF
Ne 0 ""
Po 1500 0
$EndPAD
$EndMODULE
$MODULE RRW1
Po 0 0 0 15 4F7DF184 00000000 ~~
Li RRW1
Sc 00000000
AR
Op 0 0 0
T0 0 -1000 394 394 0 59 N V 21 N "RRW1"
T1 0 1000 394 394 0 59 N I 21 N "Value"
DS 0 -620 -1970 -620 110 26
DS 2200 0 1970 0 110 21
DS -2240 0 -1970 0 110 21
DS 0 -620 -1970 -620 110 21
DS -1970 -620 -1970 630 110 21
DS -1970 630 1970 630 110 21
DS 1970 630 1970 -620 110 21
DS 1970 -620 -40 -620 110 21
$PAD
Sh "1" C 700 700 0 0 0
Dr 300 0 0
At STD N 00E0FFFF
Ne 0 ""
Po -2750 0
$EndPAD
$PAD
Sh "2" C 700 700 0 0 0
Dr 300 0 0
At STD N 00E0FFFF
Ne 0 ""
Po 2750 0
$EndPAD
$EndMODULE  RRW1
$MODULE R0204
Po 0 0 0 15 4F7DF1A1 00000000 ~~
Li R0204
Sc 00000000
AR
Op 0 0 0
T0 0 -750 394 394 0 59 N V 21 N "R0204"
T1 0 750 394 394 0 59 N I 21 N "Value"
DS 700 0 970 0 110 21
DS -990 0 -680 0 110 21
DS -680 -350 700 -350 110 21
DS 700 -350 700 360 110 21
DS 700 360 -680 360 110 21
DS -680 360 -680 -350 110 21
$PAD
Sh "1" C 700 700 0 0 0
Dr 300 0 0
At STD N 00E0FFFF
Ne 0 ""
Po -1500 0
$EndPAD
$PAD
Sh "2" C 700 700 0 0 0
Dr 300 0 0
At STD N 00E0FFFF
Ne 0 ""
Po 1500 0
$EndPAD
$EndMODULE  R0204
$MODULE R0207
Po 0 0 0 15 4F7DF1B8 00000000 ~~
Li R0207
Sc 00000000
AR
Op 0 0 0
T0 0 -1000 394 394 0 59 N V 21 N "R0207"
T1 0 1000 394 394 0 59 N I 21 N "Value"
DS 1180 0 1500 0 110 21
DS -1220 0 -1490 0 110 21
DS -1180 -470 -1180 480 110 21
DS -1180 480 1180 480 110 21
DS 1180 480 1180 -470 110 21
DS 1180 -470 -1180 -470 110 21
$PAD
Sh "1" C 700 700 0 0 0
Dr 300 0 0
At STD N 00E0FFFF
Ne 0 ""
Po -2000 0
$EndPAD
$PAD
Sh "2" C 700 700 0 0 0
Dr 300 0 0
At STD N 00E0FFFF
Ne 0 ""
Po 2000 0
$EndPAD
$EndMODULE  R0207
$MODULE RRW1-19mm
Po 0 0 0 15 4F7DF20A 00000000 ~~
Li RRW1-19mm
Sc 00000000
AR
Op 0 0 0
T0 0 -1000 394 394 0 59 N V 21 N "RRW1-19mm"
T1 0 0 394 394 0 59 N I 21 N "Value"
DS 1970 -620 -40 -620 110 26
DS 3250 0 1970 0 110 21
DS -3240 0 -2000 0 110 21
DS 0 -620 -1970 -620 110 21
DS -1970 -620 -1970 630 110 21
DS -1970 630 1970 630 110 21
DS 1970 630 1970 -620 110 21
DS 1970 -620 -40 -620 110 21
$PAD
Sh "1" C 700 700 0 0 0
Dr 300 0 0
At STD N 00E0FFFF
Ne 0 ""
Po -3750 0
$EndPAD
$PAD
Sh "2" C 700 700 0 0 0
Dr 300 0 0
At STD N 00E0FFFF
Ne 0 ""
Po 3750 0
$EndPAD
$EndMODULE  RRW1-19mm
$MODULE RRW2
Po 0 0 0 15 4F7DF243 00000000 ~~
Li RRW2
Sc 00000000
AR
Op 0 0 0
T0 0 -1250 394 394 0 59 N V 21 N "RRW2"
T1 0 0 394 394 0 59 N I 21 N "Value"
DS -2490 0 -2180 0 110 21
DS -20 -820 -2180 -820 110 21
DS -2180 -820 -2180 830 110 21
DS -2180 830 2190 830 110 21
DS 2190 830 2190 -820 110 21
DS 2190 -820 -20 -820 110 21
DS 2190 -820 -20 -820 110 26
DS 2190 0 2460 0 110 21
$PAD
Sh "1" C 780 780 0 0 0
Dr 380 0 0
At STD N 00E0FFFF
Ne 0 ""
Po -3000 0
$EndPAD
$PAD
Sh "2" C 780 780 0 0 0
Dr 380 0 0
At STD N 00E0FFFF
Ne 0 ""
Po 3000 0
$EndPAD
$EndMODULE  RRW2
$MODULE RRW2-19mm
Po 0 0 0 15 4F7DF28D 00000000 ~~
Li RRW2-19mm
Sc 00000000
AR
Op 0 0 0
T0 0 -1250 394 394 0 59 N V 21 N "RRW2-19mm"
T1 0 0 394 394 0 59 N I 21 N "Value"
DS -2180 0 -3240 0 110 21
DS -20 -820 -2180 -820 110 21
DS -2180 -820 -2180 830 110 21
DS -2180 830 2190 830 110 21
DS 2190 830 2190 -820 110 21
DS 2190 -820 -20 -820 110 21
DS 2190 -820 -20 -820 110 26
DS 2180 0 3210 0 110 21
$PAD
Sh "1" C 780 780 0 0 0
Dr 380 0 0
At STD N 00E0FFFF
Ne 0 ""
Po -3750 0
$EndPAD
$PAD
Sh "2" C 780 780 0 0 0
Dr 380 0 0
At STD N 00E0FFFF
Ne 0 ""
Po 3750 0
$EndPAD
$EndMODULE  RRW2-19mm
$MODULE RRW5
Po 0 0 0 15 4F7DF32F 00000000 ~~
Li RRW5
Sc 00000000
AR
Op 0 0 0
T0 0 -2250 394 394 0 59 N V 21 N "RRW5"
T1 0 0 394 394 0 59 N I 21 N "Value"
DS -10 -1770 4310 -1770 110 26
DS 5920 0 4310 0 110 21
DS -5990 0 -4340 0 110 21
DS -10 -1770 4310 -1770 110 21
DS 4310 -1770 4310 1770 110 21
DS 4310 1770 -4340 1770 110 21
DS -4340 1770 -4340 -1770 110 21
DS -4340 -1770 -10 -1770 110 21
$PAD
Sh "1" C 780 780 0 0 0
Dr 380 0 0
At STD N 00E0FFFF
Ne 0 ""
Po -6500 0
$EndPAD
$PAD
Sh "2" C 780 780 0 0 0
Dr 380 0 0
At STD N 00E0FFFF
Ne 0 ""
Po 6500 0
$EndPAD
$EndMODULE  RRW5
$MODULE RRW5_BP
Po 0 0 0 15 4F7DF3D4 00000000 ~~
Li RRW5_BP
Sc 00000000
AR RRW5
Op 0 0 0
T0 0 -2250 394 394 0 59 N V 21 N "RRW5_BP"
T1 0 0 394 394 0 59 N I 21 N "Value"
DS 4350 0 5300 0 118 21
DS -4350 0 -5300 0 118 21
DS -10 -1770 4310 -1770 110 26
DS -10 -1770 4310 -1770 110 21
DS 4310 -1770 4310 1770 110 21
DS 4310 1770 -4340 1770 110 21
DS -4340 1770 -4340 -1770 110 21
DS -4340 -1770 -10 -1770 110 21
$PAD
Sh "1" C 1969 1969 0 0 0
Dr 380 0 0
At STD N 00E0FFFF
Ne 0 ""
Po -6500 0
$EndPAD
$PAD
Sh "2" C 1969 1969 0 0 0
Dr 380 0 0
At STD N 00E0FFFF
Ne 0 ""
Po 6500 0
$EndPAD
$EndMODULE  RRW5_BP
$MODULE RRW2-19mm_BP
Po 0 0 0 15 4F7DF419 00000000 ~~
Li RRW2-19mm_BP
Sc 00000000
AR RRW2-19mm
Op 0 0 0
T0 0 -1250 394 394 0 59 N V 21 N "RRW2-19mm_BP"
T1 0 0 394 394 0 59 N I 21 N "Value"
DS 2200 0 2800 0 118 21
DS -2200 0 -2800 0 118 21
DS -20 -820 -2180 -820 110 21
DS -2180 -820 -2180 830 110 21
DS -2180 830 2190 830 110 21
DS 2190 830 2190 -820 110 21
DS 2190 -820 -20 -820 110 21
DS 2190 -820 -20 -820 110 26
$PAD
Sh "1" C 1575 1575 0 0 0
Dr 380 0 0
At STD N 00E0FFFF
Ne 0 ""
Po -3750 0
$EndPAD
$PAD
Sh "2" C 1575 1575 0 0 0
Dr 380 0 0
At STD N 00E0FFFF
Ne 0 ""
Po 3750 0
$EndPAD
$EndMODULE  RRW2-19mm_BP
$EndLIBRARY
