PCBNEW-LibModule-V1  sab 10 set 2011 16:15:02 CEST
# encoding utf-8
$INDEX
panelmate_smd_2
panelmate_smd_3
panelmate_smd_4
panelmate_smd_5
panelmate_smd_6
panelmate_smd_7
panelmate_smd_8
panelmate_smd_9
panelmate_smd_10
panelmate_smd_12
panelmate_smd_14
panelmate_smd_15
panelmate_smd_18
panelmate_smd_20
panelmate_smd_30
$EndINDEX
$MODULE panelmate_smd_2
Po 0 0 0 15 4E6B24E3 00000000 ~~
Li panelmate_smd_2
Cd PanelMate connector 2-way, Molex P/N 53780-0270
Sc 00000000
AR
Op 0 0 0
T0 0 1654 394 394 0 79 N V 21 N "panelmate_smd_2"
T1 0 -2126 394 394 0 79 N V 21 N "VAL**"
DS 1535 39 1220 39 120 21
DS 1220 39 1220 1063 120 21
DS -1535 39 -1220 39 120 21
DS -1220 39 -1220 1063 120 21
DS 827 630 1024 1063 120 21
DS -1024 1063 -827 630 120 21
DS 237 -1102 237 -1417 120 21
DS 237 -1417 276 -1417 120 21
DS 275 -1417 275 -1102 120 21
DS -276 -1102 -276 -1417 120 21
DS -276 -1417 -236 -1417 120 21
DS -236 -1417 -236 -1102 120 21
DS -1024 1063 -1535 1063 120 21
DS -827 630 827 630 120 21
DS 1024 1063 1535 1063 120 21
DS -1535 -1102 1535 -1102 120 21
DS 1535 -1102 1535 1063 120 21
DS -1535 1063 -1535 -1102 120 21
$PAD
Sh "1" R 315 748 0 0 0
Dr 0 0 0
At SMD N 00888000
Ne 0 ""
Po -246 -1378
$EndPAD
$PAD
Sh "2" R 315 748 0 0 0
Dr 0 0 0
At SMD N 00888000
Ne 0 ""
Po 246 -1378
$EndPAD
$PAD
Sh "3" R 512 1319 0 0 0
Dr 0 0 0
At SMD N 00888000
Ne 0 ""
Po -1368 541
$EndPAD
$PAD
Sh "3" R 512 1319 0 0 0
Dr 0 0 0
At SMD N 00888000
Ne 0 ""
Po 1368 541
$EndPAD
$SHAPE3D
Na "walter\conn_panelmate\panelmate_smd_2.wrl"
Sc 1.000000 1.000000 1.000000
Of 0.000000 0.000000 0.000000
Ro 0.000000 0.000000 0.000000
$EndSHAPE3D
$EndMODULE  panelmate_smd_2
$MODULE panelmate_smd_3
Po 0 0 0 15 4E6B619A 00000000 ~~
Li panelmate_smd_3
Cd PanelMate connector 3-way, Molex P/N 53780-0370
Sc 00000000
AR panelmate_smd_2
Op 0 0 0
T0 0 1654 394 394 0 79 N V 21 N "panelmate_smd_3"
T1 0 -2126 394 394 0 79 N V 21 N "VAL**"
DS -39 -1102 -39 -1417 120 21
DS -39 -1417 39 -1417 120 21
DS 39 -1417 39 -1102 120 21
DS -1772 -1102 1772 -1102 120 21
DS -1063 630 1063 630 120 21
DS 1772 39 1457 39 120 21
DS 1457 39 1457 1063 120 21
DS -1771 39 -1456 39 120 21
DS -1457 39 -1457 1063 120 21
DS 1063 630 1260 1063 120 21
DS -1260 1063 -1063 630 120 21
DS 473 -1102 473 -1417 120 21
DS 473 -1417 512 -1417 120 21
DS 511 -1417 511 -1102 120 21
DS -512 -1102 -512 -1417 120 21
DS -512 -1417 -472 -1417 120 21
DS -472 -1417 -472 -1102 120 21
DS -1260 1063 -1771 1063 120 21
DS 1260 1063 1771 1063 120 21
DS 1772 -1102 1772 1063 120 21
DS -1772 1063 -1772 -1102 120 21
$PAD
Sh "1" R 315 748 0 0 0
Dr 0 0 0
At SMD N 00888000
Ne 0 ""
Po -492 -1378
$EndPAD
$PAD
Sh "2" R 315 748 0 0 0
Dr 0 0 0
At SMD N 00888000
Ne 0 ""
Po 0 -1378
$EndPAD
$PAD
Sh "4" R 512 1319 0 0 0
Dr 0 0 0
At SMD N 00888000
Ne 0 ""
Po -1614 541
$EndPAD
$PAD
Sh "4" R 512 1319 0 0 0
Dr 0 0 0
At SMD N 00888000
Ne 0 ""
Po 1614 541
$EndPAD
$PAD
Sh "3" R 315 748 0 0 0
Dr 0 0 0
At SMD N 00888000
Ne 0 ""
Po 492 -1378
$EndPAD
$SHAPE3D
Na "walter\conn_panelmate\panelmate_smd_3.wrl"
Sc 1.000000 1.000000 1.000000
Of 0.000000 0.000000 0.000000
Ro 0.000000 0.000000 0.000000
$EndSHAPE3D
$EndMODULE  panelmate_smd_3
$MODULE panelmate_smd_6
Po 0 0 0 15 4E6B64BF 00000000 ~~
Li panelmate_smd_6
Cd PanelMate connector 6-way, Molex P/N 53780-0670
Sc 00000000
AR panelmate_smd_2
Op 0 0 0
T0 0 1654 394 394 0 79 N V 21 N "panelmate_smd_6"
T1 0 -2126 394 394 0 79 N V 21 N "VAL**"
DS -236 -1417 -276 -1417 120 21
DS 237 -1102 237 -1417 120 21
DS 237 -1417 276 -1417 120 21
DS 275 -1417 275 -1102 120 21
DS 2480 -1102 -2480 -1102 120 21
DS -1772 630 1772 630 120 21
DS -1260 -1102 -1260 -1417 120 21
DS -1260 -1417 -1220 -1417 120 21
DS -1220 -1417 -1220 -1102 120 21
DS -2480 -1102 -2480 1063 120 21
DS 2480 -1102 2480 1063 120 21
DS 748 -1102 748 -1417 120 21
DS 749 -1417 709 -1417 120 21
DS 709 -1417 709 -1102 120 21
DS -276 -1417 -276 -1102 120 21
DS -236 -1417 -236 -1102 120 21
DS 2480 39 2165 39 120 21
DS 2166 39 2166 1063 120 21
DS -2480 39 -2165 39 120 21
DS -2165 39 -2165 1063 120 21
DS 1771 630 1968 1063 120 21
DS -1969 1063 -1772 630 120 21
DS 1259 -1102 1259 -1417 120 21
DS 1221 -1417 1260 -1417 120 21
DS 1219 -1417 1219 -1102 120 21
DS -747 -1102 -747 -1417 120 21
DS -749 -1417 -709 -1417 120 21
DS -709 -1417 -709 -1102 120 21
DS -1968 1063 -2479 1063 120 21
DS 1969 1063 2480 1063 120 21
$PAD
Sh "1" R 315 748 0 0 0
Dr 0 0 0
At SMD N 00888000
Ne 0 ""
Po -1230 -1378
$EndPAD
$PAD
Sh "2" R 315 748 0 0 0
Dr 0 0 0
At SMD N 00888000
Ne 0 ""
Po -738 -1378
$EndPAD
$PAD
Sh "7" R 512 1319 0 0 0
Dr 0 0 0
At SMD N 00888000
Ne 0 ""
Po -2352 541
$EndPAD
$PAD
Sh "7" R 512 1319 0 0 0
Dr 0 0 0
At SMD N 00888000
Ne 0 ""
Po 2352 541
$EndPAD
$PAD
Sh "3" R 315 748 0 0 0
Dr 0 0 0
At SMD N 00888000
Ne 0 ""
Po -250 -1378
$EndPAD
$PAD
Sh "4" R 315 748 0 0 0
Dr 0 0 0
At SMD N 00888000
Ne 0 ""
Po 250 -1378
$EndPAD
$PAD
Sh "5" R 315 748 0 0 0
Dr 0 0 0
At SMD N 00888000
Ne 0 ""
Po 738 -1378
$EndPAD
$PAD
Sh "6" R 315 748 0 0 0
Dr 0 0 0
At SMD N 00888000
Ne 0 ""
Po 1230 -1378
$EndPAD
$SHAPE3D
Na "walter\conn_panelmate\panelmate_smd_6.wrl"
Sc 1.000000 1.000000 1.000000
Of 0.000000 0.000000 0.000000
Ro 0.000000 0.000000 0.000000
$EndSHAPE3D
$EndMODULE  panelmate_smd_6
$MODULE panelmate_smd_4
Po 0 0 0 15 4E6B6501 00000000 ~~
Li panelmate_smd_4
Cd PanelMate connector 4-way, Molex P/N 53780-0470
Sc 00000000
AR panelmate_smd_2
Op 0 0 0
T0 0 1654 394 394 0 79 N V 21 N "panelmate_smd_4"
T1 0 -2126 394 394 0 79 N V 21 N "VAL**"
DS -1260 630 1260 630 120 21
DS 1969 -1102 -1969 -1102 120 21
DS 1969 1063 1969 -1102 120 21
DS -1969 -1102 -1969 1063 120 21
DS 276 -1102 276 -1417 120 21
DS 276 -1417 236 -1417 120 21
DS 236 -1417 236 -1102 120 21
DS -236 -1417 -276 -1417 120 21
DS -276 -1417 -276 -1102 120 21
DS -236 -1417 -236 -1102 120 21
DS 1969 39 1654 39 120 21
DS 1654 39 1654 1063 120 21
DS -1968 39 -1653 39 120 21
DS -1654 39 -1654 1063 120 21
DS 1260 630 1457 1063 120 21
DS -1457 1063 -1260 630 120 21
DS 709 -1102 709 -1417 120 21
DS 710 -1417 749 -1417 120 21
DS 747 -1417 747 -1102 120 21
DS -748 -1102 -748 -1417 120 21
DS -749 -1417 -709 -1417 120 21
DS -709 -1417 -709 -1102 120 21
DS -1457 1063 -1968 1063 120 21
DS 1457 1063 1968 1063 120 21
$PAD
Sh "1" R 315 748 0 0 0
Dr 0 0 0
At SMD N 00888000
Ne 0 ""
Po -738 -1378
$EndPAD
$PAD
Sh "2" R 315 748 0 0 0
Dr 0 0 0
At SMD N 00888000
Ne 0 ""
Po -246 -1378
$EndPAD
$PAD
Sh "5" R 512 1319 0 0 0
Dr 0 0 0
At SMD N 00888000
Ne 0 ""
Po -1860 541
$EndPAD
$PAD
Sh "5" R 512 1319 0 0 0
Dr 0 0 0
At SMD N 00888000
Ne 0 ""
Po 1860 541
$EndPAD
$PAD
Sh "3" R 315 748 0 0 0
Dr 0 0 0
At SMD N 00888000
Ne 0 ""
Po 246 -1378
$EndPAD
$PAD
Sh "4" R 315 748 0 0 0
Dr 0 0 0
At SMD N 00888000
Ne 0 ""
Po 738 -1378
$EndPAD
$SHAPE3D
Na "walter\conn_panelmate\panelmate_smd_4.wrl"
Sc 1.000000 1.000000 1.000000
Of 0.000000 0.000000 0.000000
Ro 0.000000 0.000000 0.000000
$EndSHAPE3D
$EndMODULE  panelmate_smd_4
$MODULE panelmate_smd_5
Po 0 0 0 15 4E6B650D 00000000 ~~
Li panelmate_smd_5
Cd PanelMate connector 5-way, Molex P/N 53780-0570
Sc 00000000
AR panelmate_smd_2
Op 0 0 0
T0 0 1654 394 394 0 79 N V 21 N "panelmate_smd_5"
T1 0 -2126 394 394 0 79 N V 21 N "VAL**"
DS -39 -1417 39 -1417 120 21
DS -1024 -1102 -1024 -1417 120 21
DS -1024 -1417 -984 -1417 120 21
DS -984 -1417 -984 -1102 120 21
DS 1535 630 -1535 630 120 21
DS -2244 -1102 -2244 1063 120 21
DS -2244 -1102 2244 -1102 120 21
DS 2244 -1102 2244 1063 120 21
DS 512 -1102 512 -1417 120 21
DS 512 -1417 472 -1417 120 21
DS 472 -1417 472 -1102 120 21
DS -39 -1417 -39 -1102 120 21
DS 39 -1417 39 -1102 120 21
DS 2244 39 1929 39 120 21
DS 1930 39 1930 1063 120 21
DS -2244 39 -1929 39 120 21
DS -1929 39 -1929 1063 120 21
DS 1535 630 1732 1063 120 21
DS -1733 1063 -1536 630 120 21
DS 984 -1102 984 -1417 120 21
DS 985 -1417 1024 -1417 120 21
DS 1023 -1417 1023 -1102 120 21
DS -511 -1102 -511 -1417 120 21
DS -512 -1417 -472 -1417 120 21
DS -472 -1417 -472 -1102 120 21
DS -1732 1063 -2243 1063 120 21
DS 1733 1063 2244 1063 120 21
$PAD
Sh "1" R 315 748 0 0 0
Dr 0 0 0
At SMD N 00888000
Ne 0 ""
Po -984 -1378
$EndPAD
$PAD
Sh "2" R 315 748 0 0 0
Dr 0 0 0
At SMD N 00888000
Ne 0 ""
Po -492 -1378
$EndPAD
$PAD
Sh "6" R 512 1319 0 0 0
Dr 0 0 0
At SMD N 00888000
Ne 0 ""
Po -2106 541
$EndPAD
$PAD
Sh "6" R 512 1319 0 0 0
Dr 0 0 0
At SMD N 00888000
Ne 0 ""
Po 2106 541
$EndPAD
$PAD
Sh "3" R 315 748 0 0 0
Dr 0 0 0
At SMD N 00888000
Ne 0 ""
Po 0 -1378
$EndPAD
$PAD
Sh "4" R 315 748 0 0 0
Dr 0 0 0
At SMD N 00888000
Ne 0 ""
Po 492 -1378
$EndPAD
$PAD
Sh "5" R 315 748 0 0 0
Dr 0 0 0
At SMD N 00888000
Ne 0 ""
Po 984 -1378
$EndPAD
$SHAPE3D
Na "walter\conn_panelmate\panelmate_smd_5.wrl"
Sc 1.000000 1.000000 1.000000
Of 0.000000 0.000000 0.000000
Ro 0.000000 0.000000 0.000000
$EndSHAPE3D
$EndMODULE  panelmate_smd_5
$MODULE panelmate_smd_7
Po 0 0 0 15 4E6B669D 00000000 ~~
Li panelmate_smd_7
Cd PanelMate connector 7-way, Molex P/N 53780-0770
Sc 00000000
AR panelmate_smd_2
Op 0 0 0
T0 0 1654 394 394 0 79 N V 21 N "panelmate_smd_7"
T1 0 -2126 394 394 0 79 N V 21 N "VAL**"
DS -39 -1102 -39 -1417 120 21
DS -39 -1417 39 -1417 120 21
DS 39 -1417 39 -1102 120 21
DS -2047 630 2047 630 120 21
DS -2756 -1102 2756 -1102 120 21
DS -472 -1417 -512 -1417 120 21
DS 473 -1102 473 -1417 120 21
DS 473 -1417 512 -1417 120 21
DS 511 -1417 511 -1102 120 21
DS -1496 -1102 -1496 -1417 120 21
DS -1497 -1417 -1457 -1417 120 21
DS -1457 -1417 -1457 -1102 120 21
DS -2756 -1102 -2756 1063 120 21
DS 2756 -1102 2756 1063 120 21
DS 985 -1102 985 -1417 120 21
DS 985 -1417 945 -1417 120 21
DS 945 -1417 945 -1102 120 21
DS -512 -1417 -512 -1102 120 21
DS -472 -1417 -472 -1102 120 21
DS 2756 39 2441 39 120 21
DS 2441 39 2441 1063 120 21
DS -2756 39 -2441 39 120 21
DS -2441 39 -2441 1063 120 21
DS 2046 630 2243 1063 120 21
DS -2244 1063 -2047 630 120 21
DS 1495 -1102 1495 -1417 120 21
DS 1457 -1417 1496 -1417 120 21
DS 1456 -1417 1456 -1102 120 21
DS -983 -1102 -983 -1417 120 21
DS -985 -1417 -945 -1417 120 21
DS -945 -1417 -945 -1102 120 21
DS -2244 1063 -2755 1063 120 21
DS 2245 1063 2756 1063 120 21
$PAD
Sh "1" R 315 748 0 0 0
Dr 0 0 0
At SMD N 00888000
Ne 0 ""
Po -1476 -1378
$EndPAD
$PAD
Sh "2" R 315 748 0 0 0
Dr 0 0 0
At SMD N 00888000
Ne 0 ""
Po -984 -1378
$EndPAD
$PAD
Sh "8" R 512 1319 0 0 0
Dr 0 0 0
At SMD N 00888000
Ne 0 ""
Po -2598 541
$EndPAD
$PAD
Sh "8" R 512 1319 0 0 0
Dr 0 0 0
At SMD N 00888000
Ne 0 ""
Po 2598 541
$EndPAD
$PAD
Sh "3" R 315 748 0 0 0
Dr 0 0 0
At SMD N 00888000
Ne 0 ""
Po -492 -1378
$EndPAD
$PAD
Sh "4" R 315 748 0 0 0
Dr 0 0 0
At SMD N 00888000
Ne 0 ""
Po 0 -1378
$EndPAD
$PAD
Sh "5" R 315 748 0 0 0
Dr 0 0 0
At SMD N 00888000
Ne 0 ""
Po 492 -1378
$EndPAD
$PAD
Sh "6" R 315 748 0 0 0
Dr 0 0 0
At SMD N 00888000
Ne 0 ""
Po 984 -1378
$EndPAD
$PAD
Sh "7" R 315 748 0 0 0
Dr 0 0 0
At SMD N 00888000
Ne 0 ""
Po 1476 -1378
$EndPAD
$SHAPE3D
Na "walter\conn_panelmate\panelmate_smd_7.wrl"
Sc 1.000000 1.000000 1.000000
Of 0.000000 0.000000 0.000000
Ro 0.000000 0.000000 0.000000
$EndSHAPE3D
$EndMODULE  panelmate_smd_7
$MODULE panelmate_smd_8
Po 0 0 0 15 4E6B67D3 00000000 ~~
Li panelmate_smd_8
Cd PanelMate connector 8-way, Molex P/N 53780-0870
Sc 00000000
AR panelmate_smd_2
Op 0 0 0
T0 0 1654 394 394 0 79 N V 21 N "panelmate_smd_8"
T1 0 -2126 394 394 0 79 N V 21 N "VAL**"
DS 276 -1417 236 -1417 120 21
DS 236 -1417 236 -1102 120 21
DS -276 -1417 -236 -1417 120 21
DS -236 -1417 -236 -1102 120 21
DS -2283 630 2283 630 120 21
DS -2992 -1102 2992 -1102 120 21
DS -276 -1102 -276 -1417 120 21
DS 276 -1417 276 -1102 120 21
DS -709 -1417 -749 -1417 120 21
DS 748 -1102 748 -1417 120 21
DS 710 -1417 749 -1417 120 21
DS 708 -1417 708 -1102 120 21
DS -1732 -1102 -1732 -1417 120 21
DS -1733 -1417 -1693 -1417 120 21
DS -1693 -1417 -1693 -1102 120 21
DS -2992 -1102 -2992 1063 120 21
DS 2992 -1102 2992 1063 120 21
DS 1260 -1102 1260 -1417 120 21
DS 1261 -1417 1221 -1417 120 21
DS 1220 -1417 1220 -1102 120 21
DS -748 -1417 -748 -1102 120 21
DS -709 -1417 -709 -1102 120 21
DS 2992 39 2677 39 120 21
DS 2677 39 2677 1063 120 21
DS -2992 39 -2677 39 120 21
DS -2677 39 -2677 1063 120 21
DS 2282 630 2479 1063 120 21
DS -2480 1063 -2283 630 120 21
DS 1732 -1102 1732 -1417 120 21
DS 1693 -1417 1732 -1417 120 21
DS 1692 -1417 1692 -1102 120 21
DS -1258 -1102 -1258 -1417 120 21
DS -1260 -1417 -1220 -1417 120 21
DS -1220 -1417 -1220 -1102 120 21
DS -2480 1063 -2991 1063 120 21
DS 2481 1063 2992 1063 120 21
$PAD
Sh "1" R 315 748 0 0 0
Dr 0 0 0
At SMD N 00888000
Ne 0 ""
Po -1722 -1378
$EndPAD
$PAD
Sh "2" R 315 748 0 0 0
Dr 0 0 0
At SMD N 00888000
Ne 0 ""
Po -1230 -1378
$EndPAD
$PAD
Sh "9" R 512 1319 0 0 0
Dr 0 0 0
At SMD N 00888000
Ne 0 ""
Po -2844 541
$EndPAD
$PAD
Sh "9" R 512 1319 0 0 0
Dr 0 0 0
At SMD N 00888000
Ne 0 ""
Po 2844 541
$EndPAD
$PAD
Sh "3" R 315 748 0 0 0
Dr 0 0 0
At SMD N 00888000
Ne 0 ""
Po -738 -1378
$EndPAD
$PAD
Sh "4" R 315 748 0 0 0
Dr 0 0 0
At SMD N 00888000
Ne 0 ""
Po -246 -1378
$EndPAD
$PAD
Sh "5" R 315 748 0 0 0
Dr 0 0 0
At SMD N 00888000
Ne 0 ""
Po 246 -1378
$EndPAD
$PAD
Sh "6" R 315 748 0 0 0
Dr 0 0 0
At SMD N 00888000
Ne 0 ""
Po 738 -1378
$EndPAD
$PAD
Sh "7" R 315 748 0 0 0
Dr 0 0 0
At SMD N 00888000
Ne 0 ""
Po 1230 -1378
$EndPAD
$PAD
Sh "8" R 315 748 0 0 0
Dr 0 0 0
At SMD N 00888000
Ne 0 ""
Po 1722 -1378
$EndPAD
$SHAPE3D
Na "walter\conn_panelmate\panelmate_smd_8.wrl"
Sc 1.000000 1.000000 1.000000
Of 0.000000 0.000000 0.000000
Ro 0.000000 0.000000 0.000000
$EndSHAPE3D
$EndMODULE  panelmate_smd_8
$MODULE panelmate_smd_9
Po 0 0 0 15 4E6B692C 00000000 ~~
Li panelmate_smd_9
Cd PanelMate connector 9-way, Molex P/N 53780-0970
Sc 00000000
AR panelmate_smd_2
Op 0 0 0
T0 0 1654 394 394 0 79 N V 21 N "panelmate_smd_9"
T1 0 -2126 394 394 0 79 N V 21 N "VAL**"
DS -39 -1102 -39 -1417 120 21
DS -39 -1417 39 -1417 120 21
DS 39 -1417 39 -1102 120 21
DS 3228 -1102 -3228 -1102 120 21
DS -2520 630 2520 630 120 21
DS 512 -1417 472 -1417 120 21
DS 511 -1417 511 -1102 120 21
DS -512 -1417 -472 -1417 120 21
DS -472 -1417 -472 -1102 120 21
DS -512 -1102 -512 -1417 120 21
DS 473 -1417 473 -1102 120 21
DS -984 -1417 -1024 -1417 120 21
DS 1024 -1102 1024 -1417 120 21
DS 986 -1417 1025 -1417 120 21
DS 984 -1417 984 -1102 120 21
DS -2007 -1102 -2007 -1417 120 21
DS -2009 -1417 -1969 -1417 120 21
DS -1969 -1417 -1969 -1102 120 21
DS -3228 -1102 -3228 1063 120 21
DS 3228 -1102 3228 1063 120 21
DS 1496 -1102 1496 -1417 120 21
DS 1498 -1417 1458 -1417 120 21
DS 1457 -1417 1457 -1102 120 21
DS -1024 -1417 -1024 -1102 120 21
DS -984 -1417 -984 -1102 120 21
DS 3228 39 2913 39 120 21
DS 2913 39 2913 1063 120 21
DS -3228 39 -2913 39 120 21
DS -2913 39 -2913 1063 120 21
DS 2518 630 2715 1063 120 21
DS -2716 1063 -2519 630 120 21
DS 2007 -1102 2007 -1417 120 21
DS 1969 -1417 2008 -1417 120 21
DS 1968 -1417 1968 -1102 120 21
DS -1494 -1102 -1494 -1417 120 21
DS -1497 -1417 -1457 -1417 120 21
DS -1457 -1417 -1457 -1102 120 21
DS -2716 1063 -3227 1063 120 21
DS 2717 1063 3228 1063 120 21
$PAD
Sh "1" R 315 748 0 0 0
Dr 0 0 0
At SMD N 00888000
Ne 0 ""
Po -1969 -1378
$EndPAD
$PAD
Sh "2" R 315 748 0 0 0
Dr 0 0 0
At SMD N 00888000
Ne 0 ""
Po -1476 -1378
$EndPAD
$PAD
Sh "10" R 512 1319 0 0 0
Dr 0 0 0
At SMD N 00888000
Ne 0 ""
Po -3091 541
$EndPAD
$PAD
Sh "10" R 512 1319 0 0 0
Dr 0 0 0
At SMD N 00888000
Ne 0 ""
Po 3091 541
$EndPAD
$PAD
Sh "3" R 315 748 0 0 0
Dr 0 0 0
At SMD N 00888000
Ne 0 ""
Po -984 -1378
$EndPAD
$PAD
Sh "4" R 315 748 0 0 0
Dr 0 0 0
At SMD N 00888000
Ne 0 ""
Po -492 -1378
$EndPAD
$PAD
Sh "5" R 315 748 0 0 0
Dr 0 0 0
At SMD N 00888000
Ne 0 ""
Po 0 -1378
$EndPAD
$PAD
Sh "6" R 315 748 0 0 0
Dr 0 0 0
At SMD N 00888000
Ne 0 ""
Po 492 -1378
$EndPAD
$PAD
Sh "7" R 315 748 0 0 0
Dr 0 0 0
At SMD N 00888000
Ne 0 ""
Po 984 -1378
$EndPAD
$PAD
Sh "8" R 315 748 0 0 0
Dr 0 0 0
At SMD N 00888000
Ne 0 ""
Po 1476 -1378
$EndPAD
$PAD
Sh "9" R 315 748 0 0 0
Dr 0 0 0
At SMD N 00888000
Ne 0 ""
Po 1969 -1378
$EndPAD
$SHAPE3D
Na "walter\conn_panelmate\panelmate_smd_9.wrl"
Sc 1.000000 1.000000 1.000000
Of 0.000000 0.000000 0.000000
Ro 0.000000 0.000000 0.000000
$EndSHAPE3D
$EndMODULE  panelmate_smd_9
$MODULE panelmate_smd_10
Po 0 0 0 15 4E6B6A82 00000000 ~~
Li panelmate_smd_10
Cd PanelMate connector 10-way, Molex P/N 53780-1070
Sc 00000000
AR panelmate_smd_2
Op 0 0 0
T0 0 1654 394 394 0 79 N V 21 N "panelmate_smd_10"
T1 0 -2126 394 394 0 79 N V 21 N "VAL**"
DS 276 -1102 276 -1417 120 21
DS 276 -1417 236 -1417 120 21
DS 236 -1417 236 -1102 120 21
DS -276 -1102 -276 -1417 120 21
DS -276 -1417 -236 -1417 120 21
DS -236 -1417 -236 -1102 120 21
DS -3465 -1102 3465 -1102 120 21
DS 2756 630 -2756 630 120 21
DS 748 -1417 708 -1417 120 21
DS 747 -1417 747 -1102 120 21
DS -748 -1417 -708 -1417 120 21
DS -708 -1417 -708 -1102 120 21
DS -748 -1102 -748 -1417 120 21
DS 710 -1417 710 -1102 120 21
DS -1219 -1417 -1259 -1417 120 21
DS 1260 -1102 1260 -1417 120 21
DS 1222 -1417 1261 -1417 120 21
DS 1220 -1417 1220 -1102 120 21
DS -2243 -1102 -2243 -1417 120 21
DS -2245 -1417 -2205 -1417 120 21
DS -2205 -1417 -2205 -1102 120 21
DS -3465 -1102 -3465 1063 120 21
DS 3465 -1102 3465 1063 120 21
DS 1733 -1102 1733 -1417 120 21
DS 1734 -1417 1694 -1417 120 21
DS 1693 -1417 1693 -1102 120 21
DS -1260 -1417 -1260 -1102 120 21
DS -1220 -1417 -1220 -1102 120 21
DS 3464 39 3149 39 120 21
DS 3149 39 3149 1063 120 21
DS -3464 39 -3149 39 120 21
DS -3149 39 -3149 1063 120 21
DS 2754 630 2951 1063 120 21
DS -2953 1063 -2756 630 120 21
DS 2243 -1102 2243 -1417 120 21
DS 2205 -1417 2244 -1417 120 21
DS 2204 -1417 2204 -1102 120 21
DS -1731 -1102 -1731 -1417 120 21
DS -1733 -1417 -1693 -1417 120 21
DS -1693 -1417 -1693 -1102 120 21
DS -2952 1063 -3463 1063 120 21
DS 2953 1063 3464 1063 120 21
$PAD
Sh "1" R 315 748 0 0 0
Dr 0 0 0
At SMD N 00888000
Ne 0 ""
Po -2215 -1378
$EndPAD
$PAD
Sh "2" R 315 748 0 0 0
Dr 0 0 0
At SMD N 00888000
Ne 0 ""
Po -1722 -1378
$EndPAD
$PAD
Sh "11" R 512 1319 0 0 0
Dr 0 0 0
At SMD N 00888000
Ne 0 ""
Po -3337 541
$EndPAD
$PAD
Sh "11" R 512 1319 0 0 0
Dr 0 0 0
At SMD N 00888000
Ne 0 ""
Po 3337 541
$EndPAD
$PAD
Sh "3" R 315 748 0 0 0
Dr 0 0 0
At SMD N 00888000
Ne 0 ""
Po -1230 -1378
$EndPAD
$PAD
Sh "4" R 315 748 0 0 0
Dr 0 0 0
At SMD N 00888000
Ne 0 ""
Po -738 -1378
$EndPAD
$PAD
Sh "5" R 315 748 0 0 0
Dr 0 0 0
At SMD N 00888000
Ne 0 ""
Po -246 -1378
$EndPAD
$PAD
Sh "6" R 315 748 0 0 0
Dr 0 0 0
At SMD N 00888000
Ne 0 ""
Po 246 -1378
$EndPAD
$PAD
Sh "7" R 315 748 0 0 0
Dr 0 0 0
At SMD N 00888000
Ne 0 ""
Po 738 -1378
$EndPAD
$PAD
Sh "8" R 315 748 0 0 0
Dr 0 0 0
At SMD N 00888000
Ne 0 ""
Po 1230 -1378
$EndPAD
$PAD
Sh "9" R 315 748 0 0 0
Dr 0 0 0
At SMD N 00888000
Ne 0 ""
Po 1722 -1378
$EndPAD
$PAD
Sh "10" R 315 748 0 0 0
Dr 0 0 0
At SMD N 00888000
Ne 0 ""
Po 2215 -1378
$EndPAD
$SHAPE3D
Na "walter\conn_panelmate\panelmate_smd_10.wrl"
Sc 1.000000 1.000000 1.000000
Of 0.000000 0.000000 0.000000
Ro 0.000000 0.000000 0.000000
$EndSHAPE3D
$EndMODULE  panelmate_smd_10
$MODULE panelmate_smd_12
Po 0 0 0 15 4E6B6B79 00000000 ~~
Li panelmate_smd_12
Cd PanelMate connector 12-way, Molex P/N 53780-1270
Sc 00000000
AR panelmate_smd_2
Op 0 0 0
T0 0 1654 394 394 0 79 N V 21 N "panelmate_smd_12"
T1 0 -2126 394 394 0 79 N V 21 N "VAL**"
DS 2677 -1102 2677 -1417 120 21
DS 2677 -1417 2717 -1417 120 21
DS 2717 -1417 2717 -1102 120 21
DS -2677 -1102 -2677 -1417 120 21
DS -2677 -1417 -2717 -1417 120 21
DS -2717 -1417 -2717 -1102 120 21
DS 3268 630 -3268 630 120 21
DS -3976 -1102 3976 -1102 120 21
DS 276 -1102 276 -1417 120 21
DS 276 -1417 236 -1417 120 21
DS 236 -1417 236 -1102 120 21
DS -276 -1102 -276 -1417 120 21
DS -276 -1417 -236 -1417 120 21
DS -236 -1417 -236 -1102 120 21
DS 748 -1417 708 -1417 120 21
DS 747 -1417 747 -1102 120 21
DS -748 -1417 -708 -1417 120 21
DS -708 -1417 -708 -1102 120 21
DS -748 -1102 -748 -1417 120 21
DS 710 -1417 710 -1102 120 21
DS -1219 -1417 -1259 -1417 120 21
DS 1260 -1102 1260 -1417 120 21
DS 1222 -1417 1261 -1417 120 21
DS 1220 -1417 1220 -1102 120 21
DS -2243 -1102 -2243 -1417 120 21
DS -2245 -1417 -2205 -1417 120 21
DS -2205 -1417 -2205 -1102 120 21
DS -3976 -1102 -3976 1063 120 21
DS 3976 -1102 3976 1063 120 21
DS 1733 -1102 1733 -1417 120 21
DS 1734 -1417 1694 -1417 120 21
DS 1693 -1417 1693 -1102 120 21
DS -1260 -1417 -1260 -1102 120 21
DS -1220 -1417 -1220 -1102 120 21
DS 3976 39 3661 39 120 21
DS 3660 38 3660 1062 120 21
DS -3976 39 -3661 39 120 21
DS -3660 39 -3660 1063 120 21
DS 3266 630 3463 1063 120 21
DS -3465 1063 -3268 630 120 21
DS 2243 -1102 2243 -1417 120 21
DS 2205 -1417 2244 -1417 120 21
DS 2204 -1417 2204 -1102 120 21
DS -1731 -1102 -1731 -1417 120 21
DS -1733 -1417 -1693 -1417 120 21
DS -1693 -1417 -1693 -1102 120 21
DS -3464 1063 -3975 1063 120 21
DS 3465 1063 3976 1063 120 21
$PAD
Sh "1" R 315 748 0 0 0
Dr 0 0 0
At SMD N 00888000
Ne 0 ""
Po -2707 -1378
$EndPAD
$PAD
Sh "3" R 315 748 0 0 0
Dr 0 0 0
At SMD N 00888000
Ne 0 ""
Po -1722 -1378
$EndPAD
$PAD
Sh "13" R 512 1319 0 0 0
Dr 0 0 0
At SMD N 00888000
Ne 0 ""
Po -3829 541
$EndPAD
$PAD
Sh "13" R 512 1319 0 0 0
Dr 0 0 0
At SMD N 00888000
Ne 0 ""
Po 3829 541
$EndPAD
$PAD
Sh "4" R 315 748 0 0 0
Dr 0 0 0
At SMD N 00888000
Ne 0 ""
Po -1230 -1378
$EndPAD
$PAD
Sh "5" R 315 748 0 0 0
Dr 0 0 0
At SMD N 00888000
Ne 0 ""
Po -738 -1378
$EndPAD
$PAD
Sh "6" R 315 748 0 0 0
Dr 0 0 0
At SMD N 00888000
Ne 0 ""
Po -246 -1378
$EndPAD
$PAD
Sh "7" R 315 748 0 0 0
Dr 0 0 0
At SMD N 00888000
Ne 0 ""
Po 246 -1378
$EndPAD
$PAD
Sh "8" R 315 748 0 0 0
Dr 0 0 0
At SMD N 00888000
Ne 0 ""
Po 738 -1378
$EndPAD
$PAD
Sh "9" R 315 748 0 0 0
Dr 0 0 0
At SMD N 00888000
Ne 0 ""
Po 1230 -1378
$EndPAD
$PAD
Sh "10" R 315 748 0 0 0
Dr 0 0 0
At SMD N 00888000
Ne 0 ""
Po 1722 -1378
$EndPAD
$PAD
Sh "11" R 315 748 0 0 0
Dr 0 0 0
At SMD N 00888000
Ne 0 ""
Po 2215 -1378
$EndPAD
$PAD
Sh "2" R 315 748 0 0 0
Dr 0 0 0
At SMD N 00888000
Ne 0 ""
Po -2215 -1378
$EndPAD
$PAD
Sh "12" R 315 748 0 0 0
Dr 0 0 0
At SMD N 00888000
Ne 0 ""
Po 2707 -1378
$EndPAD
$SHAPE3D
Na "walter\conn_panelmate\panelmate_smd_12.wrl"
Sc 1.000000 1.000000 1.000000
Of 0.000000 0.000000 0.000000
Ro 0.000000 0.000000 0.000000
$EndSHAPE3D
$EndMODULE  panelmate_smd_12
$MODULE panelmate_smd_14
Po 0 0 0 15 4E6B6C47 00000000 ~~
Li panelmate_smd_14
Cd PanelMate connector 14-way, Molex P/N 53780-1470
Sc 00000000
AR panelmate_smd_2
Op 0 0 0
T0 0 1654 394 394 0 79 N V 21 N "panelmate_smd_14"
T1 0 -2126 394 394 0 79 N V 21 N "VAL**"
DS 3740 630 -3740 630 120 21
DS -4449 -1102 4449 -1102 120 21
DS 3228 -1102 3228 -1417 120 21
DS 3228 -1417 3189 -1417 120 21
DS 3189 -1417 3189 -1102 120 21
DS -3228 -1102 -3228 -1417 120 21
DS -3228 -1417 -3189 -1417 120 21
DS -3189 -1417 -3189 -1102 120 21
DS 2677 -1102 2677 -1417 120 21
DS 2677 -1417 2717 -1417 120 21
DS 2717 -1417 2717 -1102 120 21
DS -2677 -1102 -2677 -1417 120 21
DS -2677 -1417 -2717 -1417 120 21
DS -2717 -1417 -2717 -1102 120 21
DS 276 -1102 276 -1417 120 21
DS 276 -1417 236 -1417 120 21
DS 236 -1417 236 -1102 120 21
DS -276 -1102 -276 -1417 120 21
DS -276 -1417 -236 -1417 120 21
DS -236 -1417 -236 -1102 120 21
DS 748 -1417 708 -1417 120 21
DS 747 -1417 747 -1102 120 21
DS -748 -1417 -708 -1417 120 21
DS -708 -1417 -708 -1102 120 21
DS -748 -1102 -748 -1417 120 21
DS 710 -1417 710 -1102 120 21
DS -1219 -1417 -1259 -1417 120 21
DS 1260 -1102 1260 -1417 120 21
DS 1222 -1417 1261 -1417 120 21
DS 1220 -1417 1220 -1102 120 21
DS -2243 -1102 -2243 -1417 120 21
DS -2245 -1417 -2205 -1417 120 21
DS -2205 -1417 -2205 -1102 120 21
DS -4449 -1102 -4449 1063 120 21
DS 4449 -1102 4449 1063 120 21
DS 1733 -1102 1733 -1417 120 21
DS 1734 -1417 1694 -1417 120 21
DS 1693 -1417 1693 -1102 120 21
DS -1260 -1417 -1260 -1102 120 21
DS -1220 -1417 -1220 -1102 120 21
DS 4449 39 4134 39 120 21
DS 4132 38 4132 1062 120 21
DS -4448 39 -4133 39 120 21
DS -4132 39 -4132 1063 120 21
DS 3739 630 3936 1063 120 21
DS -3937 1063 -3740 630 120 21
DS 2243 -1102 2243 -1417 120 21
DS 2205 -1417 2244 -1417 120 21
DS 2204 -1417 2204 -1102 120 21
DS -1731 -1102 -1731 -1417 120 21
DS -1733 -1417 -1693 -1417 120 21
DS -1693 -1417 -1693 -1102 120 21
DS -3936 1063 -4447 1063 120 21
DS 3938 1063 4449 1063 120 21
$PAD
Sh "2" R 315 748 0 0 0
Dr 0 0 0
At SMD N 00888000
Ne 0 ""
Po -2707 -1378
$EndPAD
$PAD
Sh "4" R 315 748 0 0 0
Dr 0 0 0
At SMD N 00888000
Ne 0 ""
Po -1722 -1378
$EndPAD
$PAD
Sh "15" R 512 1319 0 0 0
Dr 0 0 0
At SMD N 00888000
Ne 0 ""
Po -4321 541
$EndPAD
$PAD
Sh "15" R 512 1319 0 0 0
Dr 0 0 0
At SMD N 00888000
Ne 0 ""
Po 4321 541
$EndPAD
$PAD
Sh "5" R 315 748 0 0 0
Dr 0 0 0
At SMD N 00888000
Ne 0 ""
Po -1230 -1378
$EndPAD
$PAD
Sh "6" R 315 748 0 0 0
Dr 0 0 0
At SMD N 00888000
Ne 0 ""
Po -738 -1378
$EndPAD
$PAD
Sh "7" R 315 748 0 0 0
Dr 0 0 0
At SMD N 00888000
Ne 0 ""
Po -246 -1378
$EndPAD
$PAD
Sh "8" R 315 748 0 0 0
Dr 0 0 0
At SMD N 00888000
Ne 0 ""
Po 246 -1378
$EndPAD
$PAD
Sh "9" R 315 748 0 0 0
Dr 0 0 0
At SMD N 00888000
Ne 0 ""
Po 738 -1378
$EndPAD
$PAD
Sh "10" R 315 748 0 0 0
Dr 0 0 0
At SMD N 00888000
Ne 0 ""
Po 1230 -1378
$EndPAD
$PAD
Sh "11" R 315 748 0 0 0
Dr 0 0 0
At SMD N 00888000
Ne 0 ""
Po 1722 -1378
$EndPAD
$PAD
Sh "12" R 315 748 0 0 0
Dr 0 0 0
At SMD N 00888000
Ne 0 ""
Po 2215 -1378
$EndPAD
$PAD
Sh "3" R 315 748 0 0 0
Dr 0 0 0
At SMD N 00888000
Ne 0 ""
Po -2215 -1378
$EndPAD
$PAD
Sh "13" R 315 748 0 0 0
Dr 0 0 0
At SMD N 00888000
Ne 0 ""
Po 2707 -1378
$EndPAD
$PAD
Sh "1" R 315 748 0 0 0
Dr 0 0 0
At SMD N 00888000
Ne 0 ""
Po -3199 -1378
$EndPAD
$PAD
Sh "14" R 315 748 0 0 0
Dr 0 0 0
At SMD N 00888000
Ne 0 ""
Po 3199 -1378
$EndPAD
$SHAPE3D
Na "walter\conn_panelmate\panelmate_smd_14.wrl"
Sc 1.000000 1.000000 1.000000
Of 0.000000 0.000000 0.000000
Ro 0.000000 0.000000 0.000000
$EndSHAPE3D
$EndMODULE  panelmate_smd_14
$MODULE panelmate_smd_15
Po 0 0 0 15 4E6B6D60 00000000 ~~
Li panelmate_smd_15
Cd PanelMate connector 15-way, Molex P/N 53780-1570
Sc 00000000
AR panelmate_smd_2
Op 0 0 0
T0 0 1654 394 394 0 79 N V 21 N "panelmate_smd_15"
T1 0 -2126 394 394 0 79 N V 21 N "VAL**"
DS -39 -1102 -39 -1417 120 21
DS -39 -1417 39 -1417 120 21
DS 39 -1417 39 -1102 120 21
DS -4724 -1102 4724 -1102 120 21
DS 4016 630 -4016 630 120 21
DS 3464 -1102 3464 -1417 120 21
DS 3464 -1417 3425 -1417 120 21
DS 3425 -1417 3425 -1102 120 21
DS -3464 -1102 -3464 -1417 120 21
DS -3464 -1417 -3425 -1417 120 21
DS -3425 -1417 -3425 -1102 120 21
DS 2952 -1102 2952 -1417 120 21
DS 2952 -1417 2992 -1417 120 21
DS 2992 -1417 2992 -1102 120 21
DS -2952 -1102 -2952 -1417 120 21
DS -2952 -1417 -2992 -1417 120 21
DS -2992 -1417 -2992 -1102 120 21
DS 512 -1102 512 -1417 120 21
DS 512 -1417 472 -1417 120 21
DS 472 -1417 472 -1102 120 21
DS -512 -1102 -512 -1417 120 21
DS -512 -1417 -472 -1417 120 21
DS -472 -1417 -472 -1102 120 21
DS 1024 -1417 984 -1417 120 21
DS 1023 -1417 1023 -1102 120 21
DS -1024 -1417 -984 -1417 120 21
DS -984 -1417 -984 -1102 120 21
DS -1024 -1102 -1024 -1417 120 21
DS 986 -1417 986 -1102 120 21
DS -1455 -1417 -1495 -1417 120 21
DS 1496 -1102 1496 -1417 120 21
DS 1458 -1417 1497 -1417 120 21
DS 1456 -1417 1456 -1102 120 21
DS -2480 -1102 -2480 -1417 120 21
DS -2482 -1417 -2442 -1417 120 21
DS -2442 -1417 -2442 -1102 120 21
DS -4724 -1102 -4724 1063 120 21
DS 4724 -1102 4724 1063 120 21
DS 2008 -1102 2008 -1417 120 21
DS 2009 -1417 1969 -1417 120 21
DS 1968 -1417 1968 -1102 120 21
DS -1496 -1417 -1496 -1102 120 21
DS -1456 -1417 -1456 -1102 120 21
DS 4725 39 4410 39 120 21
DS 4408 38 4408 1062 120 21
DS -4724 39 -4409 39 120 21
DS -4408 39 -4408 1063 120 21
DS 4015 630 4212 1063 120 21
DS -4213 1063 -4016 630 120 21
DS 2480 -1102 2480 -1417 120 21
DS 2442 -1417 2481 -1417 120 21
DS 2441 -1417 2441 -1102 120 21
DS -2006 -1102 -2006 -1417 120 21
DS -2008 -1417 -1968 -1417 120 21
DS -1968 -1417 -1968 -1102 120 21
DS -4212 1063 -4723 1063 120 21
DS 4214 1063 4725 1063 120 21
$PAD
Sh "2" R 315 748 0 0 0
Dr 0 0 0
At SMD N 00888000
Ne 0 ""
Po -2953 -1378
$EndPAD
$PAD
Sh "4" R 315 748 0 0 0
Dr 0 0 0
At SMD N 00888000
Ne 0 ""
Po -1969 -1378
$EndPAD
$PAD
Sh "16" R 512 1319 0 0 0
Dr 0 0 0
At SMD N 00888000
Ne 0 ""
Po -4567 541
$EndPAD
$PAD
Sh "16" R 512 1319 0 0 0
Dr 0 0 0
At SMD N 00888000
Ne 0 ""
Po 4567 541
$EndPAD
$PAD
Sh "5" R 315 748 0 0 0
Dr 0 0 0
At SMD N 00888000
Ne 0 ""
Po -1476 -1378
$EndPAD
$PAD
Sh "6" R 315 748 0 0 0
Dr 0 0 0
At SMD N 00888000
Ne 0 ""
Po -984 -1378
$EndPAD
$PAD
Sh "7" R 315 748 0 0 0
Dr 0 0 0
At SMD N 00888000
Ne 0 ""
Po -492 -1378
$EndPAD
$PAD
Sh "8" R 315 748 0 0 0
Dr 0 0 0
At SMD N 00888000
Ne 0 ""
Po 0 -1378
$EndPAD
$PAD
Sh "9" R 315 748 0 0 0
Dr 0 0 0
At SMD N 00888000
Ne 0 ""
Po 492 -1378
$EndPAD
$PAD
Sh "10" R 315 748 0 0 0
Dr 0 0 0
At SMD N 00888000
Ne 0 ""
Po 984 -1378
$EndPAD
$PAD
Sh "11" R 315 748 0 0 0
Dr 0 0 0
At SMD N 00888000
Ne 0 ""
Po 1476 -1378
$EndPAD
$PAD
Sh "12" R 315 748 0 0 0
Dr 0 0 0
At SMD N 00888000
Ne 0 ""
Po 1969 -1378
$EndPAD
$PAD
Sh "3" R 315 748 0 0 0
Dr 0 0 0
At SMD N 00888000
Ne 0 ""
Po -2461 -1378
$EndPAD
$PAD
Sh "13" R 315 748 0 0 0
Dr 0 0 0
At SMD N 00888000
Ne 0 ""
Po 2461 -1378
$EndPAD
$PAD
Sh "1" R 315 748 0 0 0
Dr 0 0 0
At SMD N 00888000
Ne 0 ""
Po -3445 -1378
$EndPAD
$PAD
Sh "14" R 315 748 0 0 0
Dr 0 0 0
At SMD N 00888000
Ne 0 ""
Po 2953 -1378
$EndPAD
$PAD
Sh "15" R 315 748 0 0 0
Dr 0 0 0
At SMD N 00888000
Ne 0 ""
Po 3445 -1378
$EndPAD
$SHAPE3D
Na "walter\conn_panelmate\panelmate_smd_15.wrl"
Sc 1.000000 1.000000 1.000000
Of 0.000000 0.000000 0.000000
Ro 0.000000 0.000000 0.000000
$EndSHAPE3D
$EndMODULE  panelmate_smd_15
$MODULE panelmate_smd_18
Po 0 0 0 15 4E6B6E68 00000000 ~~
Li panelmate_smd_18
Cd PanelMate connector 18-way, Molex P/N 53780-1870
Sc 00000000
AR panelmate_smd_2
Op 0 0 0
T0 0 1654 394 394 0 79 N V 21 N "panelmate_smd_18"
T1 0 -2126 394 394 0 79 N V 21 N "VAL**"
DS 4173 -1102 4173 -1417 120 21
DS 4173 -1417 4213 -1417 120 21
DS 4213 -1417 4213 -1102 120 21
DS 3661 -1102 3661 -1417 120 21
DS 3661 -1417 3701 -1417 120 21
DS 3701 -1417 3701 -1102 120 21
DS -4213 -1102 -4213 -1417 120 21
DS -4213 -1417 -4173 -1417 120 21
DS -4173 -1417 -4173 -1102 120 21
DS -3661 -1102 -3661 -1417 120 21
DS -3661 -1417 -3701 -1417 120 21
DS -3701 -1417 -3701 -1102 120 21
DS -4724 630 4724 630 120 21
DS 5433 -1102 -5433 -1102 120 21
DS 3228 -1102 3228 -1417 120 21
DS 3228 -1417 3189 -1417 120 21
DS 3189 -1417 3189 -1102 120 21
DS -3228 -1102 -3228 -1417 120 21
DS -3228 -1417 -3189 -1417 120 21
DS -3189 -1417 -3189 -1102 120 21
DS 2677 -1102 2677 -1417 120 21
DS 2677 -1417 2717 -1417 120 21
DS 2717 -1417 2717 -1102 120 21
DS -2677 -1102 -2677 -1417 120 21
DS -2677 -1417 -2717 -1417 120 21
DS -2717 -1417 -2717 -1102 120 21
DS 276 -1102 276 -1417 120 21
DS 276 -1417 236 -1417 120 21
DS 236 -1417 236 -1102 120 21
DS -276 -1102 -276 -1417 120 21
DS -276 -1417 -236 -1417 120 21
DS -236 -1417 -236 -1102 120 21
DS 748 -1417 708 -1417 120 21
DS 747 -1417 747 -1102 120 21
DS -748 -1417 -708 -1417 120 21
DS -708 -1417 -708 -1102 120 21
DS -748 -1102 -748 -1417 120 21
DS 710 -1417 710 -1102 120 21
DS -1219 -1417 -1259 -1417 120 21
DS 1260 -1102 1260 -1417 120 21
DS 1222 -1417 1261 -1417 120 21
DS 1220 -1417 1220 -1102 120 21
DS -2243 -1102 -2243 -1417 120 21
DS -2245 -1417 -2205 -1417 120 21
DS -2205 -1417 -2205 -1102 120 21
DS -5433 -1102 -5433 1063 120 21
DS 5433 -1102 5433 1063 120 21
DS 1733 -1102 1733 -1417 120 21
DS 1734 -1417 1694 -1417 120 21
DS 1693 -1417 1693 -1102 120 21
DS -1260 -1417 -1260 -1102 120 21
DS -1220 -1417 -1220 -1102 120 21
DS 5434 39 5119 39 120 21
DS 5117 38 5117 1062 120 21
DS -5432 39 -5117 39 120 21
DS -5116 39 -5116 1063 120 21
DS 4724 630 4921 1063 120 21
DS -4921 1063 -4724 630 120 21
DS 2243 -1102 2243 -1417 120 21
DS 2205 -1417 2244 -1417 120 21
DS 2204 -1417 2204 -1102 120 21
DS -1731 -1102 -1731 -1417 120 21
DS -1733 -1417 -1693 -1417 120 21
DS -1693 -1417 -1693 -1102 120 21
DS -4920 1063 -5431 1063 120 21
DS 4923 1063 5434 1063 120 21
$PAD
Sh "4" R 315 748 0 0 0
Dr 0 0 0
At SMD N 00888000
Ne 0 ""
Po -2707 -1378
$EndPAD
$PAD
Sh "6" R 315 748 0 0 0
Dr 0 0 0
At SMD N 00888000
Ne 0 ""
Po -1722 -1378
$EndPAD
$PAD
Sh "19" R 512 1319 0 0 0
Dr 0 0 0
At SMD N 00888000
Ne 0 ""
Po -5305 541
$EndPAD
$PAD
Sh "19" R 512 1319 0 0 0
Dr 0 0 0
At SMD N 00888000
Ne 0 ""
Po 5305 541
$EndPAD
$PAD
Sh "7" R 315 748 0 0 0
Dr 0 0 0
At SMD N 00888000
Ne 0 ""
Po -1230 -1378
$EndPAD
$PAD
Sh "8" R 315 748 0 0 0
Dr 0 0 0
At SMD N 00888000
Ne 0 ""
Po -738 -1378
$EndPAD
$PAD
Sh "9" R 315 748 0 0 0
Dr 0 0 0
At SMD N 00888000
Ne 0 ""
Po -246 -1378
$EndPAD
$PAD
Sh "10" R 315 748 0 0 0
Dr 0 0 0
At SMD N 00888000
Ne 0 ""
Po 246 -1378
$EndPAD
$PAD
Sh "11" R 315 748 0 0 0
Dr 0 0 0
At SMD N 00888000
Ne 0 ""
Po 738 -1378
$EndPAD
$PAD
Sh "12" R 315 748 0 0 0
Dr 0 0 0
At SMD N 00888000
Ne 0 ""
Po 1230 -1378
$EndPAD
$PAD
Sh "13" R 315 748 0 0 0
Dr 0 0 0
At SMD N 00888000
Ne 0 ""
Po 1722 -1378
$EndPAD
$PAD
Sh "14" R 315 748 0 0 0
Dr 0 0 0
At SMD N 00888000
Ne 0 ""
Po 2215 -1378
$EndPAD
$PAD
Sh "5" R 315 748 0 0 0
Dr 0 0 0
At SMD N 00888000
Ne 0 ""
Po -2215 -1378
$EndPAD
$PAD
Sh "15" R 315 748 0 0 0
Dr 0 0 0
At SMD N 00888000
Ne 0 ""
Po 2707 -1378
$EndPAD
$PAD
Sh "3" R 315 748 0 0 0
Dr 0 0 0
At SMD N 00888000
Ne 0 ""
Po -3199 -1378
$EndPAD
$PAD
Sh "16" R 315 748 0 0 0
Dr 0 0 0
At SMD N 00888000
Ne 0 ""
Po 3199 -1378
$EndPAD
$PAD
Sh "2" R 315 748 0 0 0
Dr 0 0 0
At SMD N 00888000
Ne 0 ""
Po -3691 -1378
$EndPAD
$PAD
Sh "1" R 315 748 0 0 0
Dr 0 0 0
At SMD N 00888000
Ne 0 ""
Po -4183 -1378
$EndPAD
$PAD
Sh "17" R 315 748 0 0 0
Dr 0 0 0
At SMD N 00888000
Ne 0 ""
Po 3691 -1378
$EndPAD
$PAD
Sh "18" R 315 748 0 0 0
Dr 0 0 0
At SMD N 00888000
Ne 0 ""
Po 4183 -1378
$EndPAD
$SHAPE3D
Na "walter\conn_panelmate\panelmate_smd_18.wrl"
Sc 1.000000 1.000000 1.000000
Of 0.000000 0.000000 0.000000
Ro 0.000000 0.000000 0.000000
$EndSHAPE3D
$EndMODULE  panelmate_smd_18
$MODULE panelmate_smd_20
Po 0 0 0 15 4E6B6F31 00000000 ~~
Li panelmate_smd_20
Cd PanelMate connector 20-way, Molex P/N 53780-2070
Sc 00000000
AR panelmate_smd_2
Op 0 0 0
T0 0 1654 394 394 0 79 N V 21 N "panelmate_smd_20"
T1 0 -2126 394 394 0 79 N V 21 N "VAL**"
DS -4646 -1102 -4646 -1417 120 21
DS -4646 -1417 -4685 -1417 120 21
DS -4685 -1417 -4685 -1102 120 21
DS 4646 -1102 4646 -1417 120 21
DS 4646 -1417 4685 -1417 120 21
DS 4685 -1417 4685 -1102 120 21
DS -5236 630 5236 630 120 21
DS 5945 -1102 -5945 -1102 120 21
DS 4173 -1102 4173 -1417 120 21
DS 4173 -1417 4213 -1417 120 21
DS 4213 -1417 4213 -1102 120 21
DS 3661 -1102 3661 -1417 120 21
DS 3661 -1417 3701 -1417 120 21
DS 3701 -1417 3701 -1102 120 21
DS -4213 -1102 -4213 -1417 120 21
DS -4213 -1417 -4173 -1417 120 21
DS -4173 -1417 -4173 -1102 120 21
DS -3661 -1102 -3661 -1417 120 21
DS -3661 -1417 -3701 -1417 120 21
DS -3701 -1417 -3701 -1102 120 21
DS 3228 -1102 3228 -1417 120 21
DS 3228 -1417 3189 -1417 120 21
DS 3189 -1417 3189 -1102 120 21
DS -3228 -1102 -3228 -1417 120 21
DS -3228 -1417 -3189 -1417 120 21
DS -3189 -1417 -3189 -1102 120 21
DS 2677 -1102 2677 -1417 120 21
DS 2677 -1417 2717 -1417 120 21
DS 2717 -1417 2717 -1102 120 21
DS -2677 -1102 -2677 -1417 120 21
DS -2677 -1417 -2717 -1417 120 21
DS -2717 -1417 -2717 -1102 120 21
DS 276 -1102 276 -1417 120 21
DS 276 -1417 236 -1417 120 21
DS 236 -1417 236 -1102 120 21
DS -276 -1102 -276 -1417 120 21
DS -276 -1417 -236 -1417 120 21
DS -236 -1417 -236 -1102 120 21
DS 748 -1417 708 -1417 120 21
DS 747 -1417 747 -1102 120 21
DS -748 -1417 -708 -1417 120 21
DS -708 -1417 -708 -1102 120 21
DS -748 -1102 -748 -1417 120 21
DS 710 -1417 710 -1102 120 21
DS -1219 -1417 -1259 -1417 120 21
DS 1260 -1102 1260 -1417 120 21
DS 1222 -1417 1261 -1417 120 21
DS 1220 -1417 1220 -1102 120 21
DS -2243 -1102 -2243 -1417 120 21
DS -2245 -1417 -2205 -1417 120 21
DS -2205 -1417 -2205 -1102 120 21
DS -5945 -1102 -5945 1063 120 21
DS 5945 -1102 5945 1063 120 21
DS 1733 -1102 1733 -1417 120 21
DS 1734 -1417 1694 -1417 120 21
DS 1693 -1417 1693 -1102 120 21
DS -1260 -1417 -1260 -1102 120 21
DS -1220 -1417 -1220 -1102 120 21
DS 5946 39 5631 39 120 21
DS 5629 38 5629 1062 120 21
DS -5944 39 -5629 39 120 21
DS -5628 39 -5628 1063 120 21
DS 5236 630 5433 1063 120 21
DS -5433 1063 -5236 630 120 21
DS 2243 -1102 2243 -1417 120 21
DS 2205 -1417 2244 -1417 120 21
DS 2204 -1417 2204 -1102 120 21
DS -1731 -1102 -1731 -1417 120 21
DS -1733 -1417 -1693 -1417 120 21
DS -1693 -1417 -1693 -1102 120 21
DS -5432 1063 -5943 1063 120 21
DS 5435 1063 5946 1063 120 21
$PAD
Sh "5" R 315 748 0 0 0
Dr 0 0 0
At SMD N 00888000
Ne 0 ""
Po -2707 -1378
$EndPAD
$PAD
Sh "7" R 315 748 0 0 0
Dr 0 0 0
At SMD N 00888000
Ne 0 ""
Po -1722 -1378
$EndPAD
$PAD
Sh "21" R 512 1319 0 0 0
Dr 0 0 0
At SMD N 00888000
Ne 0 ""
Po -5797 541
$EndPAD
$PAD
Sh "21" R 512 1319 0 0 0
Dr 0 0 0
At SMD N 00888000
Ne 0 ""
Po 5797 541
$EndPAD
$PAD
Sh "8" R 315 748 0 0 0
Dr 0 0 0
At SMD N 00888000
Ne 0 ""
Po -1230 -1378
$EndPAD
$PAD
Sh "9" R 315 748 0 0 0
Dr 0 0 0
At SMD N 00888000
Ne 0 ""
Po -738 -1378
$EndPAD
$PAD
Sh "10" R 315 748 0 0 0
Dr 0 0 0
At SMD N 00888000
Ne 0 ""
Po -246 -1378
$EndPAD
$PAD
Sh "11" R 315 748 0 0 0
Dr 0 0 0
At SMD N 00888000
Ne 0 ""
Po 246 -1378
$EndPAD
$PAD
Sh "12" R 315 748 0 0 0
Dr 0 0 0
At SMD N 00888000
Ne 0 ""
Po 738 -1378
$EndPAD
$PAD
Sh "13" R 315 748 0 0 0
Dr 0 0 0
At SMD N 00888000
Ne 0 ""
Po 1230 -1378
$EndPAD
$PAD
Sh "14" R 315 748 0 0 0
Dr 0 0 0
At SMD N 00888000
Ne 0 ""
Po 1722 -1378
$EndPAD
$PAD
Sh "15" R 315 748 0 0 0
Dr 0 0 0
At SMD N 00888000
Ne 0 ""
Po 2215 -1378
$EndPAD
$PAD
Sh "6" R 315 748 0 0 0
Dr 0 0 0
At SMD N 00888000
Ne 0 ""
Po -2215 -1378
$EndPAD
$PAD
Sh "16" R 315 748 0 0 0
Dr 0 0 0
At SMD N 00888000
Ne 0 ""
Po 2707 -1378
$EndPAD
$PAD
Sh "4" R 315 748 0 0 0
Dr 0 0 0
At SMD N 00888000
Ne 0 ""
Po -3199 -1378
$EndPAD
$PAD
Sh "17" R 315 748 0 0 0
Dr 0 0 0
At SMD N 00888000
Ne 0 ""
Po 3199 -1378
$EndPAD
$PAD
Sh "3" R 315 748 0 0 0
Dr 0 0 0
At SMD N 00888000
Ne 0 ""
Po -3691 -1378
$EndPAD
$PAD
Sh "2" R 315 748 0 0 0
Dr 0 0 0
At SMD N 00888000
Ne 0 ""
Po -4183 -1378
$EndPAD
$PAD
Sh "18" R 315 748 0 0 0
Dr 0 0 0
At SMD N 00888000
Ne 0 ""
Po 3691 -1378
$EndPAD
$PAD
Sh "19" R 315 748 0 0 0
Dr 0 0 0
At SMD N 00888000
Ne 0 ""
Po 4183 -1378
$EndPAD
$PAD
Sh "1" R 315 748 0 0 0
Dr 0 0 0
At SMD N 00888000
Ne 0 ""
Po -4675 -1378
$EndPAD
$PAD
Sh "20" R 315 748 0 0 0
Dr 0 0 0
At SMD N 00888000
Ne 0 ""
Po 4675 -1378
$EndPAD
$SHAPE3D
Na "walter\conn_panelmate\panelmate_smd_20.wrl"
Sc 1.000000 1.000000 1.000000
Of 0.000000 0.000000 0.000000
Ro 0.000000 0.000000 0.000000
$EndSHAPE3D
$EndMODULE  panelmate_smd_20
$MODULE panelmate_smd_30
Po 0 0 0 15 4E6B70E1 00000000 ~~
Li panelmate_smd_30
Cd PanelMate connector 30-way, Molex P/N 53780-3070
Sc 00000000
AR panelmate_smd_2
Op 0 0 0
T0 0 1654 394 394 0 79 N V 21 N "panelmate_smd_30"
T1 0 -2126 394 394 0 79 N V 21 N "VAL**"
DS 7126 -1102 7126 -1417 120 21
DS 7126 -1417 7165 -1417 120 21
DS 7165 -1417 7165 -1102 120 21
DS 6614 -1102 6614 -1417 120 21
DS 6614 -1417 6654 -1417 120 21
DS 6654 -1417 6654 -1102 120 21
DS 6142 -1102 6142 -1417 120 21
DS 6142 -1417 6181 -1417 120 21
DS 6181 -1417 6181 -1102 120 21
DS 5669 -1102 5669 -1417 120 21
DS 5669 -1417 5630 -1417 120 21
DS 5630 -1417 5630 -1102 120 21
DS 5157 -1102 5157 -1417 120 21
DS 5157 -1417 5197 -1417 120 21
DS 5197 -1417 5197 -1102 120 21
DS -7165 -1102 -7165 -1417 120 21
DS -7165 -1417 -7126 -1417 120 21
DS -7126 -1417 -7126 -1102 120 21
DS -6654 -1102 -6654 -1417 120 21
DS -6654 -1417 -6614 -1417 120 21
DS -6614 -1417 -6614 -1102 120 21
DS -6181 -1102 -6181 -1417 120 21
DS -6181 -1417 -6142 -1417 120 21
DS -6142 -1417 -6142 -1102 120 21
DS -5669 -1102 -5669 -1417 120 21
DS -5669 -1417 -5630 -1417 120 21
DS -5630 -1417 -5630 -1102 120 21
DS -5197 -1102 -5197 -1417 120 21
DS -5197 -1417 -5157 -1417 120 21
DS -5157 -1417 -5157 -1102 120 21
DS -7677 630 7677 630 120 21
DS 8386 -1102 -8386 -1102 120 21
DS -4646 -1102 -4646 -1417 120 21
DS -4646 -1417 -4685 -1417 120 21
DS -4685 -1417 -4685 -1102 120 21
DS 4646 -1102 4646 -1417 120 21
DS 4646 -1417 4685 -1417 120 21
DS 4685 -1417 4685 -1102 120 21
DS 4173 -1102 4173 -1417 120 21
DS 4173 -1417 4213 -1417 120 21
DS 4213 -1417 4213 -1102 120 21
DS 3661 -1102 3661 -1417 120 21
DS 3661 -1417 3701 -1417 120 21
DS 3701 -1417 3701 -1102 120 21
DS -4213 -1102 -4213 -1417 120 21
DS -4213 -1417 -4173 -1417 120 21
DS -4173 -1417 -4173 -1102 120 21
DS -3661 -1102 -3661 -1417 120 21
DS -3661 -1417 -3701 -1417 120 21
DS -3701 -1417 -3701 -1102 120 21
DS 3228 -1102 3228 -1417 120 21
DS 3228 -1417 3189 -1417 120 21
DS 3189 -1417 3189 -1102 120 21
DS -3228 -1102 -3228 -1417 120 21
DS -3228 -1417 -3189 -1417 120 21
DS -3189 -1417 -3189 -1102 120 21
DS 2677 -1102 2677 -1417 120 21
DS 2677 -1417 2717 -1417 120 21
DS 2717 -1417 2717 -1102 120 21
DS -2677 -1102 -2677 -1417 120 21
DS -2677 -1417 -2717 -1417 120 21
DS -2717 -1417 -2717 -1102 120 21
DS 276 -1102 276 -1417 120 21
DS 276 -1417 236 -1417 120 21
DS 236 -1417 236 -1102 120 21
DS -276 -1102 -276 -1417 120 21
DS -276 -1417 -236 -1417 120 21
DS -236 -1417 -236 -1102 120 21
DS 748 -1417 708 -1417 120 21
DS 747 -1417 747 -1102 120 21
DS -748 -1417 -708 -1417 120 21
DS -708 -1417 -708 -1102 120 21
DS -748 -1102 -748 -1417 120 21
DS 710 -1417 710 -1102 120 21
DS -1219 -1417 -1259 -1417 120 21
DS 1260 -1102 1260 -1417 120 21
DS 1222 -1417 1261 -1417 120 21
DS 1220 -1417 1220 -1102 120 21
DS -2243 -1102 -2243 -1417 120 21
DS -2245 -1417 -2205 -1417 120 21
DS -2205 -1417 -2205 -1102 120 21
DS -8386 -1102 -8386 1063 120 21
DS 8386 -1102 8386 1063 120 21
DS 1733 -1102 1733 -1417 120 21
DS 1734 -1417 1694 -1417 120 21
DS 1693 -1417 1693 -1102 120 21
DS -1260 -1417 -1260 -1102 120 21
DS -1220 -1417 -1220 -1102 120 21
DS 8387 39 8072 39 120 21
DS 8070 38 8070 1062 120 21
DS -8385 39 -8070 39 120 21
DS -8069 39 -8069 1063 120 21
DS 7677 630 7874 1063 120 21
DS -7874 1063 -7677 630 120 21
DS 2243 -1102 2243 -1417 120 21
DS 2205 -1417 2244 -1417 120 21
DS 2204 -1417 2204 -1102 120 21
DS -1731 -1102 -1731 -1417 120 21
DS -1733 -1417 -1693 -1417 120 21
DS -1693 -1417 -1693 -1102 120 21
DS -7873 1063 -8384 1063 120 21
DS 7876 1063 8387 1063 120 21
$PAD
Sh "10" R 315 748 0 0 0
Dr 0 0 0
At SMD N 00888000
Ne 0 ""
Po -2707 -1378
$EndPAD
$PAD
Sh "12" R 315 748 0 0 0
Dr 0 0 0
At SMD N 00888000
Ne 0 ""
Po -1722 -1378
$EndPAD
$PAD
Sh "31" R 512 1319 0 0 0
Dr 0 0 0
At SMD N 00888000
Ne 0 ""
Po -8258 541
$EndPAD
$PAD
Sh "31" R 512 1319 0 0 0
Dr 0 0 0
At SMD N 00888000
Ne 0 ""
Po 8258 541
$EndPAD
$PAD
Sh "13" R 315 748 0 0 0
Dr 0 0 0
At SMD N 00888000
Ne 0 ""
Po -1230 -1378
$EndPAD
$PAD
Sh "14" R 315 748 0 0 0
Dr 0 0 0
At SMD N 00888000
Ne 0 ""
Po -738 -1378
$EndPAD
$PAD
Sh "15" R 315 748 0 0 0
Dr 0 0 0
At SMD N 00888000
Ne 0 ""
Po -246 -1378
$EndPAD
$PAD
Sh "16" R 315 748 0 0 0
Dr 0 0 0
At SMD N 00888000
Ne 0 ""
Po 246 -1378
$EndPAD
$PAD
Sh "17" R 315 748 0 0 0
Dr 0 0 0
At SMD N 00888000
Ne 0 ""
Po 738 -1378
$EndPAD
$PAD
Sh "18" R 315 748 0 0 0
Dr 0 0 0
At SMD N 00888000
Ne 0 ""
Po 1230 -1378
$EndPAD
$PAD
Sh "19" R 315 748 0 0 0
Dr 0 0 0
At SMD N 00888000
Ne 0 ""
Po 1722 -1378
$EndPAD
$PAD
Sh "20" R 315 748 0 0 0
Dr 0 0 0
At SMD N 00888000
Ne 0 ""
Po 2215 -1378
$EndPAD
$PAD
Sh "11" R 315 748 0 0 0
Dr 0 0 0
At SMD N 00888000
Ne 0 ""
Po -2215 -1378
$EndPAD
$PAD
Sh "21" R 315 748 0 0 0
Dr 0 0 0
At SMD N 00888000
Ne 0 ""
Po 2707 -1378
$EndPAD
$PAD
Sh "9" R 315 748 0 0 0
Dr 0 0 0
At SMD N 00888000
Ne 0 ""
Po -3199 -1378
$EndPAD
$PAD
Sh "22" R 315 748 0 0 0
Dr 0 0 0
At SMD N 00888000
Ne 0 ""
Po 3199 -1378
$EndPAD
$PAD
Sh "8" R 315 748 0 0 0
Dr 0 0 0
At SMD N 00888000
Ne 0 ""
Po -3691 -1378
$EndPAD
$PAD
Sh "7" R 315 748 0 0 0
Dr 0 0 0
At SMD N 00888000
Ne 0 ""
Po -4183 -1378
$EndPAD
$PAD
Sh "23" R 315 748 0 0 0
Dr 0 0 0
At SMD N 00888000
Ne 0 ""
Po 3691 -1378
$EndPAD
$PAD
Sh "24" R 315 748 0 0 0
Dr 0 0 0
At SMD N 00888000
Ne 0 ""
Po 4183 -1378
$EndPAD
$PAD
Sh "6" R 315 748 0 0 0
Dr 0 0 0
At SMD N 00888000
Ne 0 ""
Po -4675 -1378
$EndPAD
$PAD
Sh "25" R 315 748 0 0 0
Dr 0 0 0
At SMD N 00888000
Ne 0 ""
Po 4675 -1378
$EndPAD
$PAD
Sh "26" R 315 748 0 0 0
Dr 0 0 0
At SMD N 00888000
Ne 0 ""
Po 5167 -1378
$EndPAD
$PAD
Sh "27" R 315 748 0 0 0
Dr 0 0 0
At SMD N 00888000
Ne 0 ""
Po 5659 -1378
$EndPAD
$PAD
Sh "28" R 315 748 0 0 0
Dr 0 0 0
At SMD N 00888000
Ne 0 ""
Po 6152 -1378
$EndPAD
$PAD
Sh "29" R 315 748 0 0 0
Dr 0 0 0
At SMD N 00888000
Ne 0 ""
Po 6644 -1378
$EndPAD
$PAD
Sh "30" R 315 748 0 0 0
Dr 0 0 0
At SMD N 00888000
Ne 0 ""
Po 7136 -1378
$EndPAD
$PAD
Sh "5" R 315 748 0 0 0
Dr 0 0 0
At SMD N 00888000
Ne 0 ""
Po -5167 -1378
$EndPAD
$PAD
Sh "4" R 315 748 0 0 0
Dr 0 0 0
At SMD N 00888000
Ne 0 ""
Po -5659 -1378
$EndPAD
$PAD
Sh "3" R 315 748 0 0 0
Dr 0 0 0
At SMD N 00888000
Ne 0 ""
Po -6152 -1378
$EndPAD
$PAD
Sh "2" R 315 748 0 0 0
Dr 0 0 0
At SMD N 00888000
Ne 0 ""
Po -6644 -1378
$EndPAD
$PAD
Sh "1" R 315 748 0 0 0
Dr 0 0 0
At SMD N 00888000
Ne 0 ""
Po -7136 -1378
$EndPAD
$SHAPE3D
Na "walter\conn_panelmate\panelmate_smd_30.wrl"
Sc 1.000000 1.000000 1.000000
Of 0.000000 0.000000 0.000000
Ro 0.000000 0.000000 0.000000
$EndSHAPE3D
$EndMODULE  panelmate_smd_30
$EndLIBRARY
