PCBNEW-LibModule-V1  Ne 14. říjen 2012, 09:25:03 CEST
# encoding utf-8
Units deci-mils
$INDEX
BR3
BR8
BRIDGE1
Bridge-rond
Bridge2
Bridge3
Bridge4_MODA
DB-1
DB-1S
FB-4
KBL
KBU
KBU-8
RB-1
RB15S
RS-2
RS-5
bridge-1A
$EndINDEX
$MODULE BR3
Po 0 0 0 15 507A5E61 00000000 ~~
Li BR3
Sc 0
AR 
Op 0 0 0
T0 0 -3600 394 394 0 79 N V 21 N "BR3"
T1 0 0 394 394 0 79 N I 21 N "Value"
DS -3100 2100 -2100 3100 50 21
DS -2100 3100 3150 3100 50 21
DS 3150 3100 3150 -3150 50 21
DS 3150 -3150 -3100 -3150 50 21
DS -3100 -3150 -3100 2100 50 21
$PAD
Sh "1" R 787 787 0 0 0
Dr 472 0 0
At STD N 00E0FFFF
Ne 0 ""
Po -2100 2100
$EndPAD
$PAD
Sh "2" C 787 787 0 0 0
Dr 472 0 0
At STD N 00E0FFFF
Ne 0 ""
Po 2100 2100
$EndPAD
$PAD
Sh "3" C 787 787 0 0 0
Dr 472 0 0
At STD N 00E0FFFF
Ne 0 ""
Po 2100 -2100
$EndPAD
$PAD
Sh "4" C 787 787 0 0 0
Dr 472 0 0
At STD N 00E0FFFF
Ne 0 ""
Po -2100 -2100
$EndPAD
$EndMODULE BR3
$MODULE BR8
Po 0 0 0 15 507A5F71 00000000 ~~
Li BR8
Sc 0
AR 
Op 0 0 0
T0 0 -4200 394 394 0 79 N V 21 N "BR8"
T1 0 0 394 394 0 79 N I 21 N "Value"
DS -2500 3750 -3750 2500 50 21
DS -3750 2500 -3750 -3750 50 21
DS -3750 -3750 3750 -3750 50 21
DS 3750 -3750 3750 3750 50 21
DS 3750 3750 -2500 3750 50 21
$PAD
Sh "1" R 787 787 0 0 0
Dr 472 0 0
At STD N 00E0FFFF
Ne 0 ""
Po -2500 2500
$EndPAD
$PAD
Sh "2" C 787 787 0 0 0
Dr 472 0 0
At STD N 0CC0FFFF
Ne 0 ""
Po 2500 2500
$EndPAD
$PAD
Sh "3" C 787 787 0 0 0
Dr 472 0 0
At STD N 0CC0FFFF
Ne 0 ""
Po 2500 -2500
$EndPAD
$PAD
Sh "4" C 787 787 0 0 0
Dr 472 0 0
At STD N 0CC0FFFF
Ne 0 ""
Po -2500 -2500
$EndPAD
$EndMODULE BR8
$MODULE BRIDGE1
Po 0 0 0 15 4FDA1897 00000000 ~~
Li BRIDGE1
Sc 0
AR 
Op 0 0 0
T0 0 -2250 393 393 0 78 N V 21 N "BRIDGE1"
T1 0 2250 393 393 0 78 N I 21 N "Value"
T2 -750 750 392 392 0 77 N V 21 N "-"
T2 750 -750 393 393 0 78 N V 21 N "+"
DC 0 0 1000 1500 150 21
$PAD
Sh "4" C 787 787 0 0 0
Dr 392 0 0
At STD N 00E0FFFF
Ne 0 ""
Po -1250 -1250
$EndPAD
$PAD
Sh "1" C 787 787 0 0 0
Dr 392 0 0
At STD N 00E0FFFF
Ne 0 ""
Po -1250 1250
$EndPAD
$PAD
Sh "2" C 787 787 0 0 0
Dr 392 0 0
At STD N 00E0FFFF
Ne 0 ""
Po 1250 1250
$EndPAD
$PAD
Sh "3" C 787 787 0 0 0
Dr 392 0 0
At STD N 00E0FFFF
Ne 0 ""
Po 1250 -1250
$EndPAD
$EndMODULE BRIDGE1
$MODULE Bridge-rond
Po 0 0 0 15 4FDA1787 00000000 ~~
Li Bridge-rond
Sc 0
AR 
Op 0 0 0
T0 0 -2250 392 392 0 77 N V 21 N "Bridge-round"
T1 0 2250 393 393 0 78 N I 21 N "Value"
DC 0 0 1500 1000 150 21
T2 500 -500 393 393 0 78 N V 21 N "+"
T2 -500 500 393 393 0 78 N V 21 N "-"
$PAD
Sh "1" C 787 787 0 0 0
Dr 393 0 0
At STD N 00F0FFFF
Ne 0 ""
Po -1000 1000
$EndPAD
$PAD
Sh "2" C 787 787 0 0 0
Dr 393 0 0
At STD N 00F0FFFF
Ne 0 ""
Po 1000 1000
$EndPAD
$PAD
Sh "3" C 787 787 0 0 0
Dr 393 0 0
At STD N 00F0FFFF
Ne 0 ""
Po 1000 -1000
$EndPAD
$PAD
Sh "4" C 787 787 0 0 0
Dr 393 0 0
At STD N 00F0FFFF
Ne 0 ""
Po -1000 -1000
$EndPAD
$SHAPE3D
Na "Bridge/bridge-rond.wrl"
Sc 1 1 1
Of -0.1 0.1 0
Ro 0 0 0
$EndSHAPE3D
$EndMODULE Bridge-rond
$MODULE Bridge2
Po 0 0 0 15 4FDA167A 00000000 ~~
Li Bridge2
Sc 0
AR 
Op 0 0 0
T0 0 -2500 393 393 0 78 N V 21 N "Bridge2"
T1 0 2500 393 393 0 78 N I 21 N "Value"
DS -2000 -2000 -2000 2000 150 21
DS -2000 2000 2000 2000 150 21
DS 2000 2000 2000 -1000 150 21
DS 2000 -1000 1000 -2000 150 21
DS 1000 -2000 -2000 -2000 150 21
DS 350 -300 950 -300 150 21
DS 650 -600 650 0 150 21
DS -1100 300 -500 300 150 21
$PAD
Sh "1" R 787 787 0 0 0
Dr 392 0 0
At STD N 00E0FFFF
Ne 0 ""
Po -1000 1000
$EndPAD
$PAD
Sh "2" C 787 787 0 0 0
Dr 392 0 0
At STD N 00E0FFFF
Ne 0 ""
Po -1000 -1000
$EndPAD
$PAD
Sh "3" C 787 787 0 0 0
Dr 392 0 0
At STD N 00E0FFFF
Ne 0 ""
Po 1000 -1000
$EndPAD
$PAD
Sh "4" C 787 787 0 0 0
Dr 392 0 0
At STD N 00E0FFFF
Ne 0 ""
Po 1000 1000
$EndPAD
$SHAPE3D
Na "Bridge/bridge-carre.wrl"
Sc 1 1 1
Of -0.2 0.2 0
Ro 0 0 0
$EndSHAPE3D
$EndMODULE Bridge2
$MODULE Bridge3
Po 0 0 0 15 4FDA1912 00000000 ~~
Li Bridge3
Sc 0
AR 
Op 0 0 0
T0 0 -4000 393 393 0 78 N V 21 N "Bridge3"
T1 0 0 393 393 0 78 N I 21 N "Value"
T2 1500 -1500 392 392 0 77 N V 21 N "+"
T2 -1500 1500 392 392 0 77 N V 21 N "-"
DS 3500 3500 3500 -2500 150 21
DS 3500 -2500 2500 -3500 150 21
DS 2500 -3500 -3500 -3500 150 21
DS 3500 3500 -3500 3500 150 21
DS -3500 3500 -3500 -3500 150 21
$PAD
Sh "1" C 600 600 0 0 0
Dr 315 0 0
At STD N 00E0FFFF
Ne 0 ""
Po -2000 2000
$EndPAD
$PAD
Sh "2" C 600 600 0 0 0
Dr 315 0 0
At STD N 00E0FFFF
Ne 0 ""
Po -2000 -2000
$EndPAD
$PAD
Sh "3" C 600 600 0 0 0
Dr 315 0 0
At STD N 00E0FFFF
Ne 0 ""
Po 2000 -2000
$EndPAD
$PAD
Sh "4" C 600 600 0 0 0
Dr 315 0 0
At STD N 00E0FFFF
Ne 0 ""
Po 2000 2000
$EndPAD
$EndMODULE Bridge3
$MODULE Bridge4_MODA
Po 0 0 0 15 4FDA19C8 00000000 ~~
Li Bridge4_MODA
Sc 0
AR 
Op 0 0 0
T0 0 -1500 393 393 0 78 N V 21 N "Bridge4_MODA"
T1 0 1500 393 393 0 78 N I 21 N "Value"
T2 -3000 700 393 393 0 78 N V 21 N "-"
T2 1000 700 393 393 0 78 N V 21 N "+"
DS -2500 -1000 -2500 1000 150 21
DS -2750 1000 -3000 1000 150 21
DS -3500 1000 -3500 -1000 150 21
DS -3000 -1000 -2750 -1000 150 21
DS -3500 1000 3500 1000 150 21
DS 3500 1000 3500 -1000 150 21
DS 3500 -1000 -3500 -1000 150 21
$PAD
Sh "1" C 787 787 0 0 0
Dr 393 0 0
At STD N 00E0FFFF
Ne 0 ""
Po -3000 0
$EndPAD
$PAD
Sh "2" C 787 787 0 0 0
Dr 393 0 0
At STD N 00E0FFFF
Ne 0 ""
Po -1000 0
$EndPAD
$PAD
Sh "3" C 787 787 0 0 0
Dr 393 0 0
At STD N 00E0FFFF
Ne 0 ""
Po 1000 0
$EndPAD
$PAD
Sh "4" C 787 787 0 0 0
Dr 393 0 0
At STD N 00E0FFFF
Ne 0 ""
Po 3000 0
$EndPAD
$SHAPE3D
Na "Bridge/bridge-rect.wrl"
Sc 1 1 1
Of -0.3 0 0
Ro 0 0 0
$EndSHAPE3D
$EndMODULE Bridge4_MODA
$MODULE DB-1
Po 0 0 0 15 47B878B2 00000000 ~~
Li DB-1
Cd Module Dil 6 pins, pads ronds
Kw DIL
Sc 0
AR 
Op 0 0 0
T0 -2500 0 750 400 900 100 N V 21 N "D***"
T1 0 -50 600 350 0 88 N V 21 N "DB-1"
DS 800 600 900 500 50 21
DS 900 500 1100 700 50 21
DS 1100 700 1200 600 50 21
DS -1200 600 -1100 500 50 21
DS -1100 500 -900 700 50 21
DS -900 700 -800 600 50 21
DS -1200 -600 -800 -600 50 21
DS 1200 -600 800 -600 50 21
DS 1000 -800 1000 -400 50 21
DS -1750 -1000 1750 -1000 150 21
DS 1750 -1000 1750 1000 150 21
DS 1750 1000 -1750 1000 150 21
DS -1750 1000 -1750 -1000 150 21
$PAD
Sh "1" R 551 551 0 0 0
Dr 315 0 0
At STD N 00E0FFFF
Ne 0 ""
Po -1000 1500
$EndPAD
$PAD
Sh "2" C 551 551 0 0 0
Dr 315 0 0
At STD N 00E0FFFF
Ne 0 ""
Po 1000 1500
$EndPAD
$PAD
Sh "3" C 551 551 0 0 0
Dr 315 0 0
At STD N 00E0FFFF
Ne 0 ""
Po 1000 -1500
$EndPAD
$PAD
Sh "4" C 551 551 0 0 0
Dr 315 0 0
At STD N 00E0FFFF
Ne 0 ""
Po -1000 -1500
$EndPAD
$SHAPE3D
Na "Bridge\\DB-1.wrl"
Sc 1 1 1
Of 0 0 0
Ro 0 0 0
$EndSHAPE3D
$EndMODULE DB-1
$MODULE DB-1S
Po 0 0 0 15 47B161A7 00000000 ~~
Li DB-1S
Cd Module Dil 6 pins, pads ronds
Kw DIL
Sc 0
AR 
Op 0 0 0
T0 0 0 750 400 0 100 N V 21 N "D***"
T1 -2500 0 600 350 900 88 N V 21 N "DB-1S"
DS 800 600 900 500 50 21
DS 900 500 1100 700 50 21
DS 1100 700 1200 600 50 21
DS -1200 600 -1100 500 50 21
DS -1100 500 -900 700 50 21
DS -900 700 -800 600 50 21
DS -1200 -600 -800 -600 50 21
DS 1200 -600 800 -600 50 21
DS 1000 -800 1000 -400 50 21
DS -1750 -1000 1750 -1000 150 21
DS 1750 -1000 1750 1000 150 21
DS 1750 1000 -1750 1000 150 21
DS -1750 1000 -1750 -1000 150 21
$PAD
Sh "1" R 512 787 0 0 0
Dr 0 0 0
At SMD N 00888000
Ne 0 ""
Po -1000 1750
$EndPAD
$PAD
Sh "2" R 512 787 0 0 0
Dr 0 0 0
At SMD N 00888000
Ne 0 ""
Po 1000 1750
$EndPAD
$PAD
Sh "3" R 512 787 0 0 0
Dr 0 0 0
At SMD N 00888000
Ne 0 ""
Po 1000 -1750
$EndPAD
$PAD
Sh "4" R 512 787 0 0 0
Dr 0 0 0
At SMD N 00888000
Ne 0 ""
Po -1000 -1750
$EndPAD
$SHAPE3D
Na "Bridge/DB-1S.wrl"
Sc 1 1 1
Of 0 0 0
Ro 0 0 0
$EndSHAPE3D
$EndMODULE DB-1S
$MODULE FB-4
Po 0 0 0 15 507A6061 00000000 ~~
Li FB-4
Sc 0
AR 
Op 0 0 0
T0 0 -2200 394 394 0 79 N V 21 N "FB-4"
T1 0 -800 394 394 0 79 N I 21 N "Value"
DS -4250 -1750 -4250 1750 50 21
DS -4900 1790 4900 1790 50 21
DS 4900 1790 4900 -1750 50 21
DS 4900 -1750 -4900 -1750 50 21
DS -4900 -1750 -4900 1790 50 21
DS 4250 -1750 4250 1750 50 21
DS 3750 -1750 3750 1750 50 21
DS -3750 -1750 -3750 1750 50 21
$PAD
Sh "2" C 1181 1181 0 0 0
Dr 709 0 0
At STD N 00E0FFFF
Ne 0 ""
Po -1000 1000
$EndPAD
$PAD
Sh "1" R 1181 1181 0 0 0
Dr 709 0 0
At STD N 00E0FFFF
Ne 0 ""
Po -3000 1000
$EndPAD
$PAD
Sh "3" C 1181 1181 0 0 0
Dr 709 0 0
At STD N 00E0FFFF
Ne 0 ""
Po 1000 1000
$EndPAD
$PAD
Sh "4" C 1181 1181 0 0 0
Dr 709 0 0
At STD N 00E0FFFF
Ne 0 ""
Po 3000 1000
$EndPAD
$EndMODULE FB-4
$MODULE KBL
Po 0 0 0 15 507A613C 00000000 ~~
Li KBL
Sc 0
AR 
Op 0 0 0
T0 0 -2250 394 394 0 79 N V 21 N "KBL"
T1 0 -1250 394 394 0 79 N I 21 N "Value"
DS -4000 -1750 4000 -1750 80 21
DS 4000 -1750 4000 1000 80 21
DS 4000 1000 -4000 1000 80 21
DS -4000 1000 -4000 -1750 80 21
DS 3000 750 3000 1000 80 21
DS 3000 -1750 3000 -750 80 21
DS -3000 750 -3000 1000 80 21
DS -3000 -1750 -3000 -750 80 21
DS 3750 1000 3750 -1750 80 21
DS -3750 1000 -3750 -1750 80 21
$PAD
Sh "1" R 1181 1181 0 0 0
Dr 669 0 0
At STD N 00E0FFFF
Ne 0 ""
Po -3000 0
$EndPAD
$PAD
Sh "2" C 1181 1181 0 0 0
Dr 669 0 0
At STD N 00E0FFFF
Ne 0 ""
Po -1000 0
$EndPAD
$PAD
Sh "3" C 1181 1181 0 0 0
Dr 669 0 0
At STD N 00E0FFFF
Ne 0 ""
Po 1000 0
$EndPAD
$PAD
Sh "4" C 1181 1181 0 0 0
Dr 669 0 0
At STD N 00E0FFFF
Ne 0 ""
Po 3000 0
$EndPAD
$EndMODULE KBL
$MODULE KBU
Po 0 0 0 15 507A61D9 00000000 ~~
Li KBU
Sc 0
AR 
Op 0 0 0
T0 0 -1750 394 394 0 79 N V 21 N "KBU"
T1 0 1250 394 394 0 79 N I 21 N "Value"
DS 3000 630 3000 1750 80 21
DS 3000 -620 3000 -1250 80 21
DS 4000 -1250 4000 1750 80 21
DS -3000 630 -3000 1750 80 21
DS -3000 -620 -3000 -1250 80 21
DS -4000 -1250 -4000 1750 80 21
DS -4630 -1250 4620 -1250 80 21
DS 4620 -1250 4620 1750 80 21
DS 4620 1750 -4630 1750 80 21
DS -4630 1750 -4630 -1250 80 21
$PAD
Sh "1" R 1024 1024 0 0 0
Dr 669 0 0
At STD N 00E0FFFF
Ne 0 ""
Po -3000 0
$EndPAD
$PAD
Sh "2" C 1024 1024 0 0 0
Dr 669 0 0
At STD N 00E0FFFF
Ne 0 ""
Po -1000 0
$EndPAD
$PAD
Sh "3" C 1024 1024 0 0 0
Dr 669 0 0
At STD N 00E0FFFF
Ne 0 ""
Po 1000 0
$EndPAD
$PAD
Sh "4" C 1024 1024 0 0 0
Dr 669 0 0
At STD N 00E0FFFF
Ne 0 ""
Po 3000 0
$EndPAD
$EndMODULE KBU
$MODULE KBU-8
Po 0 0 0 15 507A6284 00000000 ~~
Li KBU-8
Sc 0
AR 
Op 0 0 0
T0 0 -1500 394 394 0 79 N V 21 N "KBU-8"
T1 0 1250 394 394 0 79 N I 21 N "Value"
DS 3500 -1000 3500 2000 80 21
DS -4000 -1000 -4000 2000 80 21
DS -3500 -1000 -3500 2000 80 21
DS -4750 2000 -4750 -1000 80 21
DS -4750 -1000 4750 -1000 80 21
DS 4750 -1000 4750 2000 80 21
DS 4750 2000 -4750 2000 80 21
DS 4000 -1000 4000 2000 80 21
$PAD
Sh "2" C 1181 1181 0 0 0
Dr 669 0 0
At STD N 00E0FFFF
Ne 0 ""
Po -1000 0
$EndPAD
$PAD
Sh "1" R 1181 1181 0 0 0
Dr 669 0 0
At STD N 00E0FFFF
Ne 0 ""
Po -3000 0
$EndPAD
$PAD
Sh "3" C 1181 1181 0 0 0
Dr 669 0 0
At STD N 00E0FFFF
Ne 0 ""
Po 1000 0
$EndPAD
$PAD
Sh "4" C 1181 1181 0 0 0
Dr 669 0 0
At STD N 00E0FFFF
Ne 0 ""
Po 3000 0
$EndPAD
$EndMODULE KBU-8
$MODULE RB-1
Po 0 0 0 15 507A651F 00000000 ~~
Li RB-1
Sc 0
AR 
Op 0 0 0
T0 0 -2250 394 394 0 79 N V 21 N "RB-1"
T1 0 0 394 394 0 79 N I 21 N "Value"
T2 500 -500 394 394 0 79 N V 21 N "-"
T2 -500 500 394 394 0 79 N V 21 N "+"
DC 0 0 1750 -250 80 21
$PAD
Sh "1" R 709 709 0 0 0
Dr 394 0 0
At STD N 00E0FFFF
Ne 0 ""
Po -1000 1000
$EndPAD
$PAD
Sh "2" C 709 709 0 0 0
Dr 394 0 0
At STD N 00E0FFFF
Ne 0 ""
Po 1000 1000
$EndPAD
$PAD
Sh "3" C 709 709 0 0 0
Dr 394 0 0
At STD N 00E0FFFF
Ne 0 ""
Po 1000 -1000
$EndPAD
$PAD
Sh "4" C 709 709 0 0 0
Dr 394 0 0
At STD N 00E0FFFF
Ne 0 ""
Po -1000 -1000
$EndPAD
$EndMODULE RB-1
$MODULE RB15S
Po 0 0 0 15 507A663B 00000000 ~~
Li RB15S
Sc 0
AR 
Op 0 0 0
T0 0 -1400 394 394 0 79 N V 21 N "RB15S"
T1 0 1000 394 394 0 79 N I 21 N "Value"
T2 3600 -600 394 394 0 79 N V 21 N "-"
T2 -400 -600 394 394 0 79 N V 21 N "+"
DS 3000 -1000 3000 -500 80 21
DS -4250 500 -4250 -1000 80 21
DS -4250 -1000 4250 -1000 80 21
DS 4250 -1000 4250 500 80 21
DS 4250 500 -4250 500 80 21
$PAD
Sh "2" C 787 787 0 0 0
Dr 394 0 0
At STD N 00E0FFFF
Ne 0 ""
Po -1000 0
$EndPAD
$PAD
Sh "1" R 787 787 0 0 0
Dr 394 0 0
At STD N 00E0FFFF
Ne 0 ""
Po -3000 0
$EndPAD
$PAD
Sh "3" C 787 787 0 0 0
Dr 394 0 0
At STD N 00E0FFFF
Ne 0 ""
Po 1000 0
$EndPAD
$PAD
Sh "4" C 787 787 0 0 0
Dr 394 0 0
At STD N 00E0FFFF
Ne 0 ""
Po 3000 0
$EndPAD
$EndMODULE RB15S
$MODULE RS-2
Po 0 0 0 15 507A670C 00000000 ~~
Li RS-2
Sc 0
AR 
Op 0 0 0
T0 0 -1600 394 394 0 79 N V 21 N "RS-2"
T1 0 800 394 394 0 79 N I 21 N "Value"
DS -3250 -1250 -3250 1250 80 21
DS -2750 -1250 -2750 1250 80 21
DS -3500 -1250 3500 -1250 80 21
DS 3500 -1250 3500 1250 80 21
DS 3500 1250 -3500 1250 80 21
DS -3500 1250 -3500 -1250 80 21
DS 3250 -1250 3250 1250 80 21
DS 2750 -1250 2750 1250 80 21
$PAD
Sh "1" R 787 787 0 0 0
Dr 472 0 0
At STD N 00E0FFFF
Ne 0 ""
Po -2250 0
$EndPAD
$PAD
Sh "2" C 787 787 0 0 0
Dr 472 0 0
At STD N 00E0FFFF
Ne 0 ""
Po -750 0
$EndPAD
$PAD
Sh "3" C 787 787 0 0 0
Dr 472 0 0
At STD N 00E0FFFF
Ne 0 ""
Po 750 0
$EndPAD
$PAD
Sh "4" C 787 787 0 0 0
Dr 472 0 0
At STD N 00E0FFFF
Ne 0 ""
Po 2250 0
$EndPAD
$EndMODULE RS-2
$MODULE RS-5
Po 0 0 0 15 507A68C7 00000000 ~~
Li RS-5
Sc 0
AR 
Op 0 0 0
T0 0 -1000 394 394 0 79 N V 21 N "RS-5"
T1 0 1200 394 394 0 79 N I 21 N "Value"
DS 6876 -700 6876 1890 80 21
DS 7106 -700 7106 1890 80 21
DS -7684 -700 -7684 1890 80 21
DS -7914 -700 -7914 1890 80 21
DS 7656 -700 -8464 -700 80 21
DS -8464 -700 -8464 1890 80 21
DS -8464 1890 7656 1890 80 21
DS 7656 1890 7656 -700 80 21
$PAD
Sh "1" R 984 984 0 0 0
Dr 551 0 0
At STD N 00E0FFFF
Ne 0 ""
Po -5394 0
$EndPAD
$PAD
Sh "2" C 984 984 0 0 0
Dr 551 0 0
At STD N 00E0FFFF
Ne 0 ""
Po -1457 0
$EndPAD
$PAD
Sh "4" C 984 984 0 0 0
Dr 551 0 0
At STD N 00E0FFFF
Ne 0 ""
Po 1456 0
$EndPAD
$PAD
Sh "5" C 984 984 0 0 0
Dr 551 0 0
At STD N 00E0FFFF
Ne 0 ""
Po 4370 0
$EndPAD
$EndMODULE RS-5
$MODULE bridge-1A
Po 0 0 0 15 4FD0E851 00000000 ~~
Li bridge-1A
Sc 0
AR 
Op 0 0 0
T0 250 2750 400 400 0 100 N V 21 N "D1"
T1 250 -2750 300 300 0 50 N V 21 N "BRIDGE-1A"
T2 700 400 600 600 0 120 N V 21 N "ac"
T2 -600 -500 600 600 0 120 N V 21 N "ac"
T2 500 -500 600 600 0 120 N V 21 N "-"
T2 -500 500 600 600 0 120 N V 21 N "+"
DC 0 0 1250 1750 250 21
$PAD
Sh "2" C 1500 1500 0 0 0
Dr 590 0 0
At STD N 00E0FFFF
Ne 1 "N-000013"
Po -1500 -1500
$EndPAD
$PAD
Sh "3" C 1500 1500 0 0 0
Dr 590 0 0
At STD N 00E0FFFF
Ne 4 "N-000073"
Po 1500 -1500
$EndPAD
$PAD
Sh "4" C 1500 1500 0 0 0
Dr 590 0 0
At STD N 00E0FFFF
Ne 2 "N-000014"
Po 1500 1500
$EndPAD
$PAD
Sh "1" R 1500 1500 0 0 0
Dr 590 0 0
At STD N 00E0FFFF
Ne 3 "N-000072"
Po -1500 1500
$EndPAD
$SHAPE3D
Na "Bridge/bridge-rond.wrl"
Sc 1.5 1.5 1.5
Of -0.16 0.16 0.1
Ro 0 0 0
$EndSHAPE3D
$EndMODULE bridge-1A
$EndLIBRARY
