PCBNEW-LibModule-V1  Út 12. červen 2012, 21:56:15 CEST
# encoding utf-8
Units deci-mils
$INDEX
pc104_16bits
pc104_8bits
$EndINDEX
$MODULE pc104_16bits
Po 0 0 0 15 4FD79EDB 00000000 ~~
Li pc104_16bits
Sc 0
AR 
Op 0 0 0
T0 0 -19500 600 600 0 120 N V 21 N "pc104_16bits"
T1 0 0 787 787 0 157 N I 21 N "Value"
DS -90 18785 -18530 18785 150 21
DS -18530 18785 -18530 -18655 150 21
DS -18530 -18655 17950 -18655 150 21
DS 17950 -18655 17950 18785 150 21
DS 17950 18785 -290 18785 150 21
$PAD
Sh "19D" C 591 591 0 0 0
Dr 315 0 0
At STD N 00E0FFFF
Ne 0 ""
Po 11675 16800
$EndPAD
$PAD
Sh "18D" C 591 591 0 0 0
Dr 315 0 0
At STD N 00E0FFFF
Ne 0 ""
Po 10675 16800
$EndPAD
$PAD
Sh "17D" C 591 591 0 0 0
Dr 315 0 0
At STD N 00E0FFFF
Ne 0 ""
Po 9675 16800
$EndPAD
$PAD
Sh "16D" C 591 591 0 0 0
Dr 315 0 0
At STD N 00E0FFFF
Ne 0 ""
Po 8675 16800
$EndPAD
$PAD
Sh "15D" C 591 591 0 0 0
Dr 315 0 0
At STD N 00E0FFFF
Ne 0 ""
Po 7675 16800
$EndPAD
$PAD
Sh "14D" C 591 591 0 0 0
Dr 315 0 0
At STD N 00E0FFFF
Ne 0 ""
Po 6675 16800
$EndPAD
$PAD
Sh "13D" C 591 591 0 0 0
Dr 315 0 0
At STD N 00E0FFFF
Ne 0 ""
Po 5675 16800
$EndPAD
$PAD
Sh "12D" C 591 591 0 0 0
Dr 315 0 0
At STD N 00E0FFFF
Ne 0 ""
Po 4675 16800
$EndPAD
$PAD
Sh "11D" C 591 591 0 0 0
Dr 315 0 0
At STD N 00E0FFFF
Ne 0 ""
Po 3675 16800
$EndPAD
$PAD
Sh "10D" C 591 591 0 0 0
Dr 315 0 0
At STD N 00E0FFFF
Ne 0 ""
Po 2675 16800
$EndPAD
$PAD
Sh "9D" C 591 591 0 0 0
Dr 315 0 0
At STD N 00E0FFFF
Ne 0 ""
Po 1675 16800
$EndPAD
$PAD
Sh "8D" C 591 591 0 0 0
Dr 315 0 0
At STD N 00E0FFFF
Ne 0 ""
Po 675 16800
$EndPAD
$PAD
Sh "19C" C 591 591 0 0 0
Dr 315 0 0
At STD N 00E0FFFF
Ne 0 ""
Po 11700 15800
$EndPAD
$PAD
Sh "18C" C 591 591 0 0 0
Dr 315 0 0
At STD N 00E0FFFF
Ne 0 ""
Po 10700 15800
$EndPAD
$PAD
Sh "17C" C 591 591 0 0 0
Dr 315 0 0
At STD N 00E0FFFF
Ne 0 ""
Po 9700 15800
$EndPAD
$PAD
Sh "16C" C 591 591 0 0 0
Dr 315 0 0
At STD N 00E0FFFF
Ne 0 ""
Po 8700 15800
$EndPAD
$PAD
Sh "15C" C 591 591 0 0 0
Dr 315 0 0
At STD N 00E0FFFF
Ne 0 ""
Po 7700 15800
$EndPAD
$PAD
Sh "14C" C 591 591 0 0 0
Dr 315 0 0
At STD N 00E0FFFF
Ne 0 ""
Po 6700 15800
$EndPAD
$PAD
Sh "13C" C 591 591 0 0 0
Dr 315 0 0
At STD N 00E0FFFF
Ne 0 ""
Po 5700 15800
$EndPAD
$PAD
Sh "12C" C 591 591 0 0 0
Dr 315 0 0
At STD N 00E0FFFF
Ne 0 ""
Po 4700 15800
$EndPAD
$PAD
Sh "11C" C 591 591 0 0 0
Dr 315 0 0
At STD N 00E0FFFF
Ne 0 ""
Po 3700 15800
$EndPAD
$PAD
Sh "10C" C 591 591 0 0 0
Dr 315 0 0
At STD N 00E0FFFF
Ne 0 ""
Po 2700 15800
$EndPAD
$PAD
Sh "9C" C 591 591 0 0 0
Dr 315 0 0
At STD N 00E0FFFF
Ne 0 ""
Po 1700 15800
$EndPAD
$PAD
Sh "8C" C 591 591 0 0 0
Dr 315 0 0
At STD N 00E0FFFF
Ne 0 ""
Po 700 15800
$EndPAD
$PAD
Sh "0D" C 591 591 0 0 0
Dr 315 0 0
At STD N 00E0FFFF
Ne 0 ""
Po -7300 16800
$EndPAD
$PAD
Sh "1D" C 591 591 0 0 0
Dr 315 0 0
At STD N 00E0FFFF
Ne 0 ""
Po -6300 16800
$EndPAD
$PAD
Sh "2D" C 591 591 0 0 0
Dr 315 0 0
At STD N 00E0FFFF
Ne 0 ""
Po -5300 16800
$EndPAD
$PAD
Sh "3D" C 591 591 0 0 0
Dr 315 0 0
At STD N 00E0FFFF
Ne 0 ""
Po -4300 16800
$EndPAD
$PAD
Sh "4D" C 591 591 0 0 0
Dr 315 0 0
At STD N 00E0FFFF
Ne 0 ""
Po -3300 16775
$EndPAD
$PAD
Sh "5D" C 591 591 0 0 0
Dr 315 0 0
At STD N 00E0FFFF
Ne 0 ""
Po -2300 16775
$EndPAD
$PAD
Sh "0C" C 591 591 0 0 0
Dr 315 0 0
At STD N 00E0FFFF
Ne 0 ""
Po -7300 15800
$EndPAD
$PAD
Sh "1C" C 591 591 0 0 0
Dr 315 0 0
At STD N 00E0FFFF
Ne 0 ""
Po -6300 15800
$EndPAD
$PAD
Sh "2C" C 591 591 0 0 0
Dr 315 0 0
At STD N 00E0FFFF
Ne 0 ""
Po -5300 15800
$EndPAD
$PAD
Sh "3C" C 591 591 0 0 0
Dr 315 0 0
At STD N 00E0FFFF
Ne 0 ""
Po -4300 15800
$EndPAD
$PAD
Sh "4C" C 591 591 0 0 0
Dr 315 0 0
At STD N 00E0FFFF
Ne 0 ""
Po -3300 15800
$EndPAD
$PAD
Sh "5C" C 591 591 0 0 0
Dr 315 0 0
At STD N 00E0FFFF
Ne 0 ""
Po -2300 15775
$EndPAD
$PAD
Sh "6D" C 591 591 0 0 0
Dr 315 0 0
At STD N 00E0FFFF
Ne 0 ""
Po -1305 16795
$EndPAD
$PAD
Sh "6C" C 591 591 0 0 0
Dr 315 0 0
At STD N 00E0FFFF
Ne 0 ""
Po -1295 15775
$EndPAD
$PAD
Sh "7D" C 591 591 0 0 0
Dr 315 0 0
At STD N 00E0FFFF
Ne 0 ""
Po -285 16785
$EndPAD
$PAD
Sh "7C" C 591 591 0 0 0
Dr 315 0 0
At STD N 00E0FFFF
Ne 0 ""
Po -285 15775
$EndPAD
$PAD
Sh "16B" C 591 591 0 0 0
Dr 315 0 0
At STD N 00E0FFFF
Ne 0 ""
Po -285 13675
$EndPAD
$PAD
Sh "16A" C 591 591 0 0 0
Dr 315 0 0
At STD N 00E0FFFF
Ne 0 ""
Po -285 14685
$EndPAD
$PAD
Sh "15B" C 591 591 0 0 0
Dr 315 0 0
At STD N 00E0FFFF
Ne 0 ""
Po -1295 13675
$EndPAD
$PAD
Sh "15A" C 591 591 0 0 0
Dr 315 0 0
At STD N 00E0FFFF
Ne 0 ""
Po -1305 14695
$EndPAD
$PAD
Sh "14B" C 591 591 0 0 0
Dr 315 0 0
At STD N 00E0FFFF
Ne 0 ""
Po -2300 13675
$EndPAD
$PAD
Sh "13B" C 591 591 0 0 0
Dr 315 0 0
At STD N 00E0FFFF
Ne 0 ""
Po -3300 13700
$EndPAD
$PAD
Sh "12B" C 591 591 0 0 0
Dr 315 0 0
At STD N 00E0FFFF
Ne 0 ""
Po -4300 13700
$EndPAD
$PAD
Sh "11B" C 591 591 0 0 0
Dr 315 0 0
At STD N 00E0FFFF
Ne 0 ""
Po -5300 13700
$EndPAD
$PAD
Sh "10B" C 591 591 0 0 0
Dr 315 0 0
At STD N 00E0FFFF
Ne 0 ""
Po -6300 13700
$EndPAD
$PAD
Sh "9B" C 591 591 0 0 0
Dr 315 0 0
At STD N 00E0FFFF
Ne 0 ""
Po -7300 13700
$EndPAD
$PAD
Sh "8B" C 591 591 0 0 0
Dr 315 0 0
At STD N 00E0FFFF
Ne 0 ""
Po -8300 13700
$EndPAD
$PAD
Sh "7B" C 591 591 0 0 0
Dr 315 0 0
At STD N 00E0FFFF
Ne 0 ""
Po -9300 13700
$EndPAD
$PAD
Sh "6B" C 591 591 0 0 0
Dr 315 0 0
At STD N 00E0FFFF
Ne 0 ""
Po -10300 13700
$EndPAD
$PAD
Sh "5B" C 591 591 0 0 0
Dr 315 0 0
At STD N 00E0FFFF
Ne 0 ""
Po -11300 13700
$EndPAD
$PAD
Sh "4B" C 591 591 0 0 0
Dr 315 0 0
At STD N 00E0FFFF
Ne 0 ""
Po -12300 13700
$EndPAD
$PAD
Sh "3B" C 591 591 0 0 0
Dr 315 0 0
At STD N 00E0FFFF
Ne 0 ""
Po -13300 13700
$EndPAD
$PAD
Sh "2B" C 591 591 0 0 0
Dr 315 0 0
At STD N 00E0FFFF
Ne 0 ""
Po -14300 13700
$EndPAD
$PAD
Sh "1B" C 591 591 0 0 0
Dr 315 0 0
At STD N 00E0FFFF
Ne 0 ""
Po -15300 13700
$EndPAD
$PAD
Sh "14A" C 591 591 0 0 0
Dr 315 0 0
At STD N 00E0FFFF
Ne 0 ""
Po -2300 14675
$EndPAD
$PAD
Sh "13A" C 591 591 0 0 0
Dr 315 0 0
At STD N 00E0FFFF
Ne 0 ""
Po -3300 14675
$EndPAD
$PAD
Sh "12A" C 591 591 0 0 0
Dr 315 0 0
At STD N 00E0FFFF
Ne 0 ""
Po -4300 14700
$EndPAD
$PAD
Sh "11A" C 591 591 0 0 0
Dr 315 0 0
At STD N 00E0FFFF
Ne 0 ""
Po -5300 14700
$EndPAD
$PAD
Sh "10A" C 591 591 0 0 0
Dr 315 0 0
At STD N 00E0FFFF
Ne 0 ""
Po -6300 14700
$EndPAD
$PAD
Sh "9A" C 591 591 0 0 0
Dr 315 0 0
At STD N 00E0FFFF
Ne 0 ""
Po -7300 14700
$EndPAD
$PAD
Sh "8A" C 591 591 0 0 0
Dr 315 0 0
At STD N 00E0FFFF
Ne 0 ""
Po -8300 14700
$EndPAD
$PAD
Sh "7A" C 591 591 0 0 0
Dr 315 0 0
At STD N 00E0FFFF
Ne 0 ""
Po -9300 14700
$EndPAD
$PAD
Sh "6A" C 591 591 0 0 0
Dr 315 0 0
At STD N 00E0FFFF
Ne 0 ""
Po -10300 14700
$EndPAD
$PAD
Sh "5A" C 591 591 0 0 0
Dr 315 0 0
At STD N 00E0FFFF
Ne 0 ""
Po -11300 14700
$EndPAD
$PAD
Sh "4A" C 591 591 0 0 0
Dr 315 0 0
At STD N 00E0FFFF
Ne 0 ""
Po -12300 14700
$EndPAD
$PAD
Sh "3A" C 591 591 0 0 0
Dr 315 0 0
At STD N 00E0FFFF
Ne 0 ""
Po -13300 14700
$EndPAD
$PAD
Sh "2A" C 591 591 0 0 0
Dr 315 0 0
At STD N 00E0FFFF
Ne 0 ""
Po -14300 14700
$EndPAD
$PAD
Sh "1A" C 591 591 0 0 0
Dr 315 0 0
At STD N 00E0FFFF
Ne 0 ""
Po -15300 14700
$EndPAD
$PAD
Sh "17B" C 591 591 0 0 0
Dr 315 0 0
At STD N 00E0FFFF
Ne 0 ""
Po 700 13700
$EndPAD
$PAD
Sh "18B" C 591 591 0 0 0
Dr 315 0 0
At STD N 00E0FFFF
Ne 0 ""
Po 1700 13700
$EndPAD
$PAD
Sh "19B" C 591 591 0 0 0
Dr 315 0 0
At STD N 00E0FFFF
Ne 0 ""
Po 2700 13700
$EndPAD
$PAD
Sh "20B" C 591 591 0 0 0
Dr 315 0 0
At STD N 00E0FFFF
Ne 0 ""
Po 3700 13700
$EndPAD
$PAD
Sh "21B" C 591 591 0 0 0
Dr 315 0 0
At STD N 00E0FFFF
Ne 0 ""
Po 4700 13700
$EndPAD
$PAD
Sh "22B" C 591 591 0 0 0
Dr 315 0 0
At STD N 00E0FFFF
Ne 0 ""
Po 5700 13700
$EndPAD
$PAD
Sh "23B" C 591 591 0 0 0
Dr 315 0 0
At STD N 00E0FFFF
Ne 0 ""
Po 6700 13700
$EndPAD
$PAD
Sh "24B" C 591 591 0 0 0
Dr 315 0 0
At STD N 00E0FFFF
Ne 0 ""
Po 7700 13700
$EndPAD
$PAD
Sh "25B" C 591 591 0 0 0
Dr 315 0 0
At STD N 00E0FFFF
Ne 0 ""
Po 8700 13700
$EndPAD
$PAD
Sh "26B" C 591 591 0 0 0
Dr 315 0 0
At STD N 00E0FFFF
Ne 0 ""
Po 9700 13700
$EndPAD
$PAD
Sh "27B" C 591 591 0 0 0
Dr 315 0 0
At STD N 00E0FFFF
Ne 0 ""
Po 10700 13700
$EndPAD
$PAD
Sh "28B" C 591 591 0 0 0
Dr 315 0 0
At STD N 00E0FFFF
Ne 0 ""
Po 11700 13700
$EndPAD
$PAD
Sh "29B" C 591 591 0 0 0
Dr 315 0 0
At STD N 00E0FFFF
Ne 0 ""
Po 12700 13700
$EndPAD
$PAD
Sh "30B" C 591 591 0 0 0
Dr 315 0 0
At STD N 00E0FFFF
Ne 0 ""
Po 13700 13700
$EndPAD
$PAD
Sh "31B" C 591 591 0 0 0
Dr 315 0 0
At STD N 00E0FFFF
Ne 0 ""
Po 14700 13700
$EndPAD
$PAD
Sh "32B" C 591 591 0 0 0
Dr 315 0 0
At STD N 00E0FFFF
Ne 0 ""
Po 15700 13700
$EndPAD
$PAD
Sh "17A" C 591 591 0 0 0
Dr 315 0 0
At STD N 00E0FFFF
Ne 0 ""
Po 675 14700
$EndPAD
$PAD
Sh "18A" C 591 591 0 0 0
Dr 315 0 0
At STD N 00E0FFFF
Ne 0 ""
Po 1675 14700
$EndPAD
$PAD
Sh "19A" C 591 591 0 0 0
Dr 315 0 0
At STD N 00E0FFFF
Ne 0 ""
Po 2675 14700
$EndPAD
$PAD
Sh "20A" C 591 591 0 0 0
Dr 315 0 0
At STD N 00E0FFFF
Ne 0 ""
Po 3675 14700
$EndPAD
$PAD
Sh "21A" C 591 591 0 0 0
Dr 315 0 0
At STD N 00E0FFFF
Ne 0 ""
Po 4675 14700
$EndPAD
$PAD
Sh "22A" C 591 591 0 0 0
Dr 315 0 0
At STD N 00E0FFFF
Ne 0 ""
Po 5675 14700
$EndPAD
$PAD
Sh "23A" C 591 591 0 0 0
Dr 315 0 0
At STD N 00E0FFFF
Ne 0 ""
Po 6675 14700
$EndPAD
$PAD
Sh "24A" C 591 591 0 0 0
Dr 315 0 0
At STD N 00E0FFFF
Ne 0 ""
Po 7675 14700
$EndPAD
$PAD
Sh "25A" C 591 591 0 0 0
Dr 315 0 0
At STD N 00E0FFFF
Ne 0 ""
Po 8675 14700
$EndPAD
$PAD
Sh "26A" C 591 591 0 0 0
Dr 315 0 0
At STD N 00E0FFFF
Ne 0 ""
Po 9675 14700
$EndPAD
$PAD
Sh "27A" C 591 591 0 0 0
Dr 315 0 0
At STD N 00E0FFFF
Ne 0 ""
Po 10675 14700
$EndPAD
$PAD
Sh "28A" C 591 591 0 0 0
Dr 315 0 0
At STD N 00E0FFFF
Ne 0 ""
Po 11675 14700
$EndPAD
$PAD
Sh "29A" C 591 591 0 0 0
Dr 315 0 0
At STD N 00E0FFFF
Ne 0 ""
Po 12675 14700
$EndPAD
$PAD
Sh "30A" C 591 591 0 0 0
Dr 315 0 0
At STD N 00E0FFFF
Ne 0 ""
Po 13675 14700
$EndPAD
$PAD
Sh "31A" C 591 591 0 0 0
Dr 315 0 0
At STD N 00E0FFFF
Ne 0 ""
Po 14675 14700
$EndPAD
$PAD
Sh "32A" C 591 591 0 0 0
Dr 315 0 0
At STD N 00E0FFFF
Ne 0 ""
Po 15675 14700
$EndPAD
$PAD
Sh "0" C 2362 2362 0 0 0
Dr 1181 0 0
At STD N 00F0FFFF
Ne 0 ""
Po -16550 16800
$EndPAD
$PAD
Sh "0" C 2362 2362 0 0 0
Dr 1181 0 0
At STD N 00F0FFFF
Ne 0 ""
Po 15950 16800
$EndPAD
$PAD
Sh "0" C 2362 2362 0 0 0
Dr 1181 0 0
At STD N 00F0FFFF
Ne 0 ""
Po -15100 -16750
$EndPAD
$PAD
Sh "0" C 2362 2362 0 0 0
Dr 1181 0 0
At STD N 00F0FFFF
Ne 0 ""
Po 14450 -16650
$EndPAD
$SHAPE3D
Na "Devices/pc104_16bits.wrl"
Sc 2 2 2
Of 0 0 0
Ro 0 0 0
$EndSHAPE3D
$EndMODULE pc104_16bits
$MODULE pc104_8bits
Po 0 0 0 15 4FD79E9C 00000000 ~~
Li pc104_8bits
Sc 0
AR 
Op 0 0 0
T0 250 -19500 600 600 0 120 N V 21 N "pc104_8bits"
T1 0 0 787 787 0 157 N I 21 N "Value"
DS -90 18785 -18530 18785 150 21
DS -18530 18785 -18530 -18655 150 21
DS -18530 -18655 17950 -18655 150 21
DS 17950 -18655 17950 18785 150 21
DS 17950 18785 -290 18785 150 21
$PAD
Sh "16B" C 591 591 0 0 0
Dr 315 0 0
At STD N 00E0FFFF
Ne 0 ""
Po -285 13675
$EndPAD
$PAD
Sh "16A" C 591 591 0 0 0
Dr 315 0 0
At STD N 00E0FFFF
Ne 0 ""
Po -285 14685
$EndPAD
$PAD
Sh "15B" C 591 591 0 0 0
Dr 315 0 0
At STD N 00E0FFFF
Ne 0 ""
Po -1295 13675
$EndPAD
$PAD
Sh "15A" C 591 591 0 0 0
Dr 315 0 0
At STD N 00E0FFFF
Ne 0 ""
Po -1305 14695
$EndPAD
$PAD
Sh "14B" C 591 591 0 0 0
Dr 315 0 0
At STD N 00E0FFFF
Ne 0 ""
Po -2300 13675
$EndPAD
$PAD
Sh "13B" C 591 591 0 0 0
Dr 315 0 0
At STD N 00E0FFFF
Ne 0 ""
Po -3300 13700
$EndPAD
$PAD
Sh "12B" C 591 591 0 0 0
Dr 315 0 0
At STD N 00E0FFFF
Ne 0 ""
Po -4300 13700
$EndPAD
$PAD
Sh "11B" C 591 591 0 0 0
Dr 315 0 0
At STD N 00E0FFFF
Ne 0 ""
Po -5300 13700
$EndPAD
$PAD
Sh "10B" C 591 591 0 0 0
Dr 315 0 0
At STD N 00E0FFFF
Ne 0 ""
Po -6300 13700
$EndPAD
$PAD
Sh "9B" C 591 591 0 0 0
Dr 315 0 0
At STD N 00E0FFFF
Ne 0 ""
Po -7300 13700
$EndPAD
$PAD
Sh "8B" C 591 591 0 0 0
Dr 315 0 0
At STD N 00E0FFFF
Ne 0 ""
Po -8300 13700
$EndPAD
$PAD
Sh "7B" C 591 591 0 0 0
Dr 315 0 0
At STD N 00E0FFFF
Ne 0 ""
Po -9300 13700
$EndPAD
$PAD
Sh "6B" C 591 591 0 0 0
Dr 315 0 0
At STD N 00E0FFFF
Ne 0 ""
Po -10300 13700
$EndPAD
$PAD
Sh "5B" C 591 591 0 0 0
Dr 315 0 0
At STD N 00E0FFFF
Ne 0 ""
Po -11300 13700
$EndPAD
$PAD
Sh "4B" C 591 591 0 0 0
Dr 315 0 0
At STD N 00E0FFFF
Ne 0 ""
Po -12300 13700
$EndPAD
$PAD
Sh "3B" C 591 591 0 0 0
Dr 315 0 0
At STD N 00E0FFFF
Ne 0 ""
Po -13300 13700
$EndPAD
$PAD
Sh "2B" C 591 591 0 0 0
Dr 315 0 0
At STD N 00E0FFFF
Ne 0 ""
Po -14300 13700
$EndPAD
$PAD
Sh "1B" C 591 591 0 0 0
Dr 315 0 0
At STD N 00E0FFFF
Ne 0 ""
Po -15300 13700
$EndPAD
$PAD
Sh "14A" C 591 591 0 0 0
Dr 315 0 0
At STD N 00E0FFFF
Ne 0 ""
Po -2300 14675
$EndPAD
$PAD
Sh "13A" C 591 591 0 0 0
Dr 315 0 0
At STD N 00E0FFFF
Ne 0 ""
Po -3300 14675
$EndPAD
$PAD
Sh "12A" C 591 591 0 0 0
Dr 315 0 0
At STD N 00E0FFFF
Ne 0 ""
Po -4300 14700
$EndPAD
$PAD
Sh "11A" C 591 591 0 0 0
Dr 315 0 0
At STD N 00E0FFFF
Ne 0 ""
Po -5300 14700
$EndPAD
$PAD
Sh "10A" C 591 591 0 0 0
Dr 315 0 0
At STD N 00E0FFFF
Ne 0 ""
Po -6300 14700
$EndPAD
$PAD
Sh "9A" C 591 591 0 0 0
Dr 315 0 0
At STD N 00E0FFFF
Ne 0 ""
Po -7300 14700
$EndPAD
$PAD
Sh "8A" C 591 591 0 0 0
Dr 315 0 0
At STD N 00E0FFFF
Ne 0 ""
Po -8300 14700
$EndPAD
$PAD
Sh "7A" C 591 591 0 0 0
Dr 315 0 0
At STD N 00E0FFFF
Ne 0 ""
Po -9300 14700
$EndPAD
$PAD
Sh "6A" C 591 591 0 0 0
Dr 315 0 0
At STD N 00E0FFFF
Ne 0 ""
Po -10300 14700
$EndPAD
$PAD
Sh "5A" C 591 591 0 0 0
Dr 315 0 0
At STD N 00E0FFFF
Ne 0 ""
Po -11300 14700
$EndPAD
$PAD
Sh "4A" C 591 591 0 0 0
Dr 315 0 0
At STD N 00E0FFFF
Ne 0 ""
Po -12300 14700
$EndPAD
$PAD
Sh "3A" C 591 591 0 0 0
Dr 315 0 0
At STD N 00E0FFFF
Ne 0 ""
Po -13300 14700
$EndPAD
$PAD
Sh "2A" C 591 591 0 0 0
Dr 315 0 0
At STD N 00E0FFFF
Ne 0 ""
Po -14300 14700
$EndPAD
$PAD
Sh "1A" C 591 591 0 0 0
Dr 315 0 0
At STD N 00E0FFFF
Ne 0 ""
Po -15300 14700
$EndPAD
$PAD
Sh "17B" C 591 591 0 0 0
Dr 315 0 0
At STD N 00E0FFFF
Ne 0 ""
Po 700 13700
$EndPAD
$PAD
Sh "18B" C 591 591 0 0 0
Dr 315 0 0
At STD N 00E0FFFF
Ne 0 ""
Po 1700 13700
$EndPAD
$PAD
Sh "19B" C 591 591 0 0 0
Dr 315 0 0
At STD N 00E0FFFF
Ne 0 ""
Po 2700 13700
$EndPAD
$PAD
Sh "20B" C 591 591 0 0 0
Dr 315 0 0
At STD N 00E0FFFF
Ne 0 ""
Po 3700 13700
$EndPAD
$PAD
Sh "21B" C 591 591 0 0 0
Dr 315 0 0
At STD N 00E0FFFF
Ne 0 ""
Po 4700 13700
$EndPAD
$PAD
Sh "22B" C 591 591 0 0 0
Dr 315 0 0
At STD N 00E0FFFF
Ne 0 ""
Po 5700 13700
$EndPAD
$PAD
Sh "23B" C 591 591 0 0 0
Dr 315 0 0
At STD N 00E0FFFF
Ne 0 ""
Po 6700 13700
$EndPAD
$PAD
Sh "24B" C 591 591 0 0 0
Dr 315 0 0
At STD N 00E0FFFF
Ne 0 ""
Po 7700 13700
$EndPAD
$PAD
Sh "25B" C 591 591 0 0 0
Dr 315 0 0
At STD N 00E0FFFF
Ne 0 ""
Po 8700 13700
$EndPAD
$PAD
Sh "26B" C 591 591 0 0 0
Dr 315 0 0
At STD N 00E0FFFF
Ne 0 ""
Po 9700 13700
$EndPAD
$PAD
Sh "27B" C 591 591 0 0 0
Dr 315 0 0
At STD N 00E0FFFF
Ne 0 ""
Po 10700 13700
$EndPAD
$PAD
Sh "28B" C 591 591 0 0 0
Dr 315 0 0
At STD N 00E0FFFF
Ne 0 ""
Po 11700 13700
$EndPAD
$PAD
Sh "29B" C 591 591 0 0 0
Dr 315 0 0
At STD N 00E0FFFF
Ne 0 ""
Po 12700 13700
$EndPAD
$PAD
Sh "30B" C 591 591 0 0 0
Dr 315 0 0
At STD N 00E0FFFF
Ne 0 ""
Po 13700 13700
$EndPAD
$PAD
Sh "31B" C 591 591 0 0 0
Dr 315 0 0
At STD N 00E0FFFF
Ne 0 ""
Po 14700 13700
$EndPAD
$PAD
Sh "32B" C 591 591 0 0 0
Dr 315 0 0
At STD N 00E0FFFF
Ne 0 ""
Po 15700 13700
$EndPAD
$PAD
Sh "17A" C 591 591 0 0 0
Dr 315 0 0
At STD N 00E0FFFF
Ne 0 ""
Po 675 14700
$EndPAD
$PAD
Sh "18A" C 591 591 0 0 0
Dr 315 0 0
At STD N 00E0FFFF
Ne 0 ""
Po 1675 14700
$EndPAD
$PAD
Sh "19A" C 591 591 0 0 0
Dr 315 0 0
At STD N 00E0FFFF
Ne 0 ""
Po 2675 14700
$EndPAD
$PAD
Sh "20A" C 591 591 0 0 0
Dr 315 0 0
At STD N 00E0FFFF
Ne 0 ""
Po 3675 14700
$EndPAD
$PAD
Sh "21A" C 591 591 0 0 0
Dr 315 0 0
At STD N 00E0FFFF
Ne 0 ""
Po 4675 14700
$EndPAD
$PAD
Sh "22A" C 591 591 0 0 0
Dr 315 0 0
At STD N 00E0FFFF
Ne 0 ""
Po 5675 14700
$EndPAD
$PAD
Sh "23A" C 591 591 0 0 0
Dr 315 0 0
At STD N 00E0FFFF
Ne 0 ""
Po 6675 14700
$EndPAD
$PAD
Sh "24A" C 591 591 0 0 0
Dr 315 0 0
At STD N 00E0FFFF
Ne 0 ""
Po 7675 14700
$EndPAD
$PAD
Sh "25A" C 591 591 0 0 0
Dr 315 0 0
At STD N 00E0FFFF
Ne 0 ""
Po 8675 14700
$EndPAD
$PAD
Sh "26A" C 591 591 0 0 0
Dr 315 0 0
At STD N 00E0FFFF
Ne 0 ""
Po 9675 14700
$EndPAD
$PAD
Sh "27A" C 591 591 0 0 0
Dr 315 0 0
At STD N 00E0FFFF
Ne 0 ""
Po 10675 14700
$EndPAD
$PAD
Sh "28A" C 591 591 0 0 0
Dr 315 0 0
At STD N 00E0FFFF
Ne 0 ""
Po 11675 14700
$EndPAD
$PAD
Sh "29A" C 591 591 0 0 0
Dr 315 0 0
At STD N 00E0FFFF
Ne 0 ""
Po 12675 14700
$EndPAD
$PAD
Sh "30A" C 591 591 0 0 0
Dr 315 0 0
At STD N 00E0FFFF
Ne 0 ""
Po 13675 14700
$EndPAD
$PAD
Sh "31A" C 591 591 0 0 0
Dr 315 0 0
At STD N 00E0FFFF
Ne 0 ""
Po 14675 14700
$EndPAD
$PAD
Sh "32A" C 591 591 0 0 0
Dr 315 0 0
At STD N 00E0FFFF
Ne 0 ""
Po 15675 14700
$EndPAD
$PAD
Sh "0" C 2362 2362 0 0 0
Dr 1181 0 0
At STD N 00F0FFFF
Ne 0 ""
Po -16550 16800
$EndPAD
$PAD
Sh "0" C 2362 2362 0 0 0
Dr 1181 0 0
At STD N 00F0FFFF
Ne 0 ""
Po 15950 16800
$EndPAD
$PAD
Sh "0" C 2362 2362 0 0 0
Dr 1181 0 0
At STD N 00F0FFFF
Ne 0 ""
Po -15100 -16750
$EndPAD
$PAD
Sh "0" C 2362 2362 0 0 0
Dr 1181 0 0
At STD N 00F0FFFF
Ne 0 ""
Po 14450 -16650
$EndPAD
$SHAPE3D
Na "Devices/pc104_8bits.wrl"
Sc 2 2 2
Of 0 0 0
Ro 0 0 0
$EndSHAPE3D
$EndMODULE pc104_8bits
$EndLIBRARY
