PCBNEW-LibModule-V1  Čt 14. červen 2012, 20:01:29 CEST
# encoding utf-8
Units deci-mils
$INDEX
CerTR10H
POACAH
POACAV
POACCH
POACCV
POACH
POACV
POAH
POAMH
POAOH
POAOV
POT10T
POT10T-L
POT10T-T
POT3IL
POT63XA
POT63XB
POT63YA
POT63YB
POT93XA
POT93YA
POT93YB
POT93Z
POTA_Fav
POTA_Fav_Int
POTA_Fav_lin
POTX
POTY7A
POTY7B
POTYP
POTYPM
poth-1T
$EndINDEX
$MODULE CerTR10H
Po 0 0 0 15 47CFEEAE 00000000 ~~
Li CerTR10H
Sc 0
AR 
Op 0 0 0
T0 0 3000 400 400 0 100 N V 21 N "CerTr10H"
T1 -1500 -3000 400 400 0 100 N V 21 N "RV"
DS -2250 -2250 -2250 2250 150 21
DS -2250 -2250 2250 -2250 150 21
DS 2250 -2250 2250 2250 150 21
DS 2250 2250 -2250 2250 150 21
$PAD
Sh "2" R 1000 1000 0 0 0
Dr 320 0 0
At STD N 00E0FFFF
Ne 0 ""
Po 0 -1000
$EndPAD
$PAD
Sh "1" R 1000 1000 0 0 0
Dr 320 0 0
At STD N 00E0FFFF
Ne 0 ""
Po -1000 500
$EndPAD
$PAD
Sh "3" R 1000 1000 0 0 0
Dr 320 0 0
At STD N 00E0FFFF
Ne 0 ""
Po 1000 500
$EndPAD
$EndMODULE CerTR10H
$MODULE POACAH
Po 0 0 0 15 4FB3D5D6 00000000 ~~
Li POACAH
Sc 0
AR 
Op 0 0 0
T0 -250 -2250 394 394 0 79 N V 21 N "POACAH"
T1 0 1200 394 394 0 79 N I 21 N "Value"
DS 250 1750 -250 1750 150 21
DS 250 -1750 0 -1750 150 21
DS -1750 -1750 -2250 -1750 150 21
DS -2250 -1750 -2250 1750 150 21
DS -2250 1750 -1750 1750 150 21
DS -250 -250 250 -250 150 21
DS 250 -250 250 250 150 21
DS -250 -250 250 250 150 21
DS -250 -1750 0 -1750 150 21
DS -250 250 250 -250 150 21
DC 0 0 500 -250 150 21
DS -1750 1750 0 1750 150 21
DS -1750 -1750 -250 -1750 150 21
DA 250 0 2000 0 900 150 21
DA 250 0 250 -1750 900 150 21
$PAD
Sh "2" C 882 882 0 0 0
Dr 320 0 0
At STD N 00E0FFFF
Ne 0 ""
Po 2000 0
$EndPAD
$PAD
Sh "1" R 882 882 0 0 0
Dr 320 0 0
At STD N 00E0FFFF
Ne 0 ""
Po -2000 -1000
$EndPAD
$PAD
Sh "3" C 882 882 0 0 0
Dr 320 0 0
At STD N 00E0FFFF
Ne 0 ""
Po -2000 1000
$EndPAD
$SHAPE3D
Na "Potenciometer\\pot_li10.wrl"
Sc 1 1 1
Of 0 0 0
Ro 0 0 90
$EndSHAPE3D
$EndMODULE POACAH
$MODULE POACAV
Po 0 0 0 15 4FB3D60D 00000000 ~~
Li POACAV
Sc 0
AR 
Op 0 0 0
T0 -900 0 394 394 900 79 N V 21 N "POACAV"
T1 1950 0 394 394 900 79 N I 21 N "Value"
DS 1500 -250 1250 0 150 21
DS 1250 0 1500 250 150 21
DS -500 -250 -250 0 150 21
DS -250 0 -500 250 150 21
DS 1250 -250 -500 -250 150 21
DS -500 -250 -500 250 150 21
DS -500 250 1250 250 150 21
DS 1000 1750 1500 1750 150 21
DS 1000 -1750 1500 -1750 150 21
DS 500 -1750 1000 -1750 150 21
DS 1500 -1750 1500 1750 150 21
DS 1000 1750 500 1750 150 21
DS 1250 -250 1500 -250 150 21
DS 1500 -250 1500 250 150 21
DS 1500 250 1250 250 150 21
DS 1250 -500 1500 -500 150 21
DS 1250 -500 1250 500 150 21
DS 1500 500 1250 500 150 21
DS -500 -1750 500 -1750 150 21
DS 500 1750 -500 1750 150 21
DS -500 1500 -500 1750 150 21
DS -500 -1000 -500 1500 150 21
DS -500 -1000 -500 -1750 150 21
$PAD
Sh "2" C 882 882 0 0 0
Dr 320 0 0
At STD N 00E0FFFF
Ne 0 ""
Po 1000 0
$EndPAD
$PAD
Sh "1" R 882 882 0 0 0
Dr 320 0 0
At STD N 00E0FFFF
Ne 0 ""
Po 0 -1000
$EndPAD
$PAD
Sh "3" C 882 882 0 0 0
Dr 320 0 0
At STD N 00E0FFFF
Ne 0 ""
Po 0 1000
$EndPAD
$SHAPE3D
Na "Potenciometer\\pot_pt_10s.wrl"
Sc 1 1 1
Of 0.05 0 0
Ro 0 0 90
$EndSHAPE3D
$EndMODULE POACAV
$MODULE POACCH
Po 0 0 0 15 4FB3D63B 00000000 ~~
Li POACCH
Sc 0
AR 
Op 0 0 0
T0 0 -2150 394 394 0 79 N V 21 N "POACCH"
T1 0 1100 394 394 0 79 N I 21 N "Value"
DS 250 1750 -250 1750 150 21
DS 250 -1750 0 -1750 150 21
DS -1750 -1750 -2250 -1750 150 21
DS -2250 -1750 -2250 1750 150 21
DS -2250 1750 -1750 1750 150 21
DS -250 -250 250 -250 150 21
DS 250 -250 250 250 150 21
DS -250 -250 250 250 150 21
DS -250 -1750 0 -1750 150 21
DS -250 250 250 -250 150 21
DC 0 0 500 -250 150 21
DS -1750 1750 0 1750 150 21
DS -1750 -1750 -250 -1750 150 21
DA 250 0 2000 0 900 150 21
DA 250 0 250 -1750 900 150 21
$PAD
Sh "2" C 882 882 0 0 0
Dr 320 0 0
At STD N 00E0FFFF
Ne 0 ""
Po 2000 0
$EndPAD
$PAD
Sh "1" R 882 882 0 0 0
Dr 320 0 0
At STD N 00E0FFFF
Ne 0 ""
Po -2000 -1000
$EndPAD
$PAD
Sh "3" C 882 882 0 0 0
Dr 320 0 0
At STD N 00E0FFFF
Ne 0 ""
Po -2000 1000
$EndPAD
$SHAPE3D
Na "Potenciometer\\pot_li10.wrl"
Sc 1 1 1
Of 0 0 0
Ro 0 0 90
$EndSHAPE3D
$EndMODULE POACCH
$MODULE POACCV
Po 0 0 0 15 4FB3D66B 00000000 ~~
Li POACCV
Sc 0
AR 
Op 0 0 0
T0 -950 0 394 394 900 79 N V 21 N "POACCV"
T1 2000 0 394 394 900 79 N I 21 N "RV**"
DS 1500 -250 1250 0 150 21
DS 1250 0 1500 250 150 21
DS -500 -250 -250 0 150 21
DS -250 0 -500 250 150 21
DS 1250 -250 -500 -250 150 21
DS -500 -250 -500 250 150 21
DS -500 250 1250 250 150 21
DS 1000 1750 1500 1750 150 21
DS 1000 -1750 1500 -1750 150 21
DS 500 -1750 1000 -1750 150 21
DS 1500 -1750 1500 1750 150 21
DS 1000 1750 500 1750 150 21
DS 1250 -250 1500 -250 150 21
DS 1500 -250 1500 250 150 21
DS 1500 250 1250 250 150 21
DS 1250 -500 1500 -500 150 21
DS 1250 -500 1250 500 150 21
DS 1500 500 1250 500 150 21
DS -500 -1750 500 -1750 150 21
DS 500 1750 -500 1750 150 21
DS -500 1500 -500 1750 150 21
DS -500 -1000 -500 1500 150 21
DS -500 -1000 -500 -1750 150 21
$PAD
Sh "2" C 882 882 0 0 0
Dr 320 0 0
At STD N 00E0FFFF
Ne 0 ""
Po 1000 0
$EndPAD
$PAD
Sh "1" R 882 882 0 0 0
Dr 320 0 0
At STD N 00E0FFFF
Ne 0 ""
Po 0 -1000
$EndPAD
$PAD
Sh "3" C 882 882 0 0 0
Dr 320 0 0
At STD N 00E0FFFF
Ne 0 ""
Po 0 1000
$EndPAD
$SHAPE3D
Na "Potenciometer\\pot_pt_10s.wrl"
Sc 1 1 1
Of 0.05 0 0
Ro 0 0 90
$EndSHAPE3D
$EndMODULE POACCV
$MODULE POACH
Po 0 0 0 15 4FB3D695 00000000 ~~
Li POACH
Sc 0
AR 
Op 0 0 0
T0 0 -2150 394 394 0 79 N V 21 N "POACH"
T1 0 1200 394 394 0 79 N I 21 N "Value"
DS 250 1750 -250 1750 150 21
DS 250 -1750 0 -1750 150 21
DS -1750 -1750 -2250 -1750 150 21
DS -2250 -1750 -2250 1750 150 21
DS -2250 1750 -1750 1750 150 21
DS -250 -250 250 250 150 21
DS -250 -1750 0 -1750 150 21
DC 0 0 500 -250 150 21
DS -1750 1750 0 1750 150 21
DS -1750 -1750 -250 -1750 150 21
DA 250 0 2000 0 900 150 21
DA 250 0 250 -1750 900 150 21
$PAD
Sh "2" C 882 882 0 0 0
Dr 320 0 0
At STD N 00E0FFFF
Ne 0 ""
Po 2000 0
$EndPAD
$PAD
Sh "1" R 882 882 0 0 0
Dr 320 0 0
At STD N 00E0FFFF
Ne 0 ""
Po -2000 -1000
$EndPAD
$PAD
Sh "3" C 882 882 0 0 0
Dr 320 0 0
At STD N 00E0FFFF
Ne 0 ""
Po -2000 1000
$EndPAD
$SHAPE3D
Na "Potenciometer\\pot_li10.wrl"
Sc 1 1 1
Of 0 0 0
Ro 0 0 90
$EndSHAPE3D
$EndMODULE POACH
$MODULE POACV
Po 0 0 0 15 4FB3D6C7 00000000 ~~
Li POACV
Sc 0
AR 
Op 0 0 0
T0 -900 0 394 394 900 79 N V 21 N "POACV"
T1 1950 0 394 394 900 79 N I 21 N "Value"
DS 500 -1250 1000 -1250 150 21
DS 1000 -1250 1000 1250 150 21
DS 1000 1250 500 1250 150 21
DS 750 -250 1000 -250 150 21
DS 1000 -250 1000 250 150 21
DS 1000 250 750 250 150 21
DS 500 -500 750 -500 150 21
DS 750 -500 750 500 150 21
DS 750 500 500 500 150 21
DS -500 -1750 500 -1750 150 21
DS 500 -1750 500 1750 150 21
DS 500 1750 -500 1750 150 21
DS -500 1500 -500 1750 150 21
DS -500 -1000 -500 1500 150 21
DS -500 -1000 -500 -1750 150 21
$PAD
Sh "2" C 882 882 0 0 0
Dr 320 0 0
At STD N 00E0FFFF
Ne 0 ""
Po 1000 0
$EndPAD
$PAD
Sh "1" R 882 882 0 0 0
Dr 320 0 0
At STD N 00E0FFFF
Ne 0 ""
Po 0 -1000
$EndPAD
$PAD
Sh "3" C 882 882 0 0 0
Dr 320 0 0
At STD N 00E0FFFF
Ne 0 ""
Po 0 1000
$EndPAD
$EndMODULE POACV
$MODULE POAH
Po 0 0 0 15 4FB67864 00000000 ~~
Li POAH
Sc 0
AR 
Op 0 0 0
T0 -250 -2150 394 394 0 79 N V 21 N "POAH"
T1 0 1150 394 394 0 79 N I 21 N "Value"
DS -250 250 250 -250 150 21
DS 250 1750 -250 1750 150 21
DS 250 -1750 0 -1750 150 21
DS -1750 -1750 -2250 -1750 150 21
DS -2250 -1750 -2250 1750 150 21
DS -2250 1750 -1750 1750 150 21
DS -250 -250 250 250 150 21
DS -250 -1750 0 -1750 150 21
DC 0 0 500 -250 150 21
DS -1750 1750 0 1750 150 21
DS -1750 -1750 -250 -1750 150 21
DA 250 0 2000 0 900 150 21
DA 250 0 250 -1750 900 150 21
$PAD
Sh "2" C 882 882 0 0 0
Dr 320 0 0
At STD N 00E0FFFF
Ne 0 ""
Po 2000 0
$EndPAD
$PAD
Sh "1" R 882 882 0 0 0
Dr 320 0 0
At STD N 00E0FFFF
Ne 0 ""
Po -2000 -1000
$EndPAD
$PAD
Sh "3" C 882 882 0 0 0
Dr 320 0 0
At STD N 00E0FFFF
Ne 0 ""
Po -2000 1000
$EndPAD
$SHAPE3D
Na "Potenciometer\\pot_li10.wrl"
Sc 1 1 1
Of 0 0 0
Ro 0 0 90
$EndSHAPE3D
$EndMODULE POAH
$MODULE POAMH
Po 0 0 0 15 4FB3D6F5 00000000 ~~
Li POAMH
Sc 0
AR 
Op 0 0 0
T0 -1200 0 394 394 900 79 N V 21 N "POAMH"
T1 0 0 394 394 900 79 N I 21 N "Value"
DS 0 -3500 0 -4000 150 21
DS 0 -4000 750 -4000 150 21
DS 750 -4000 750 -3500 150 21
DS -750 -2750 -750 4500 150 21
DS -750 4500 1500 4500 150 21
DS 1500 4500 1500 -2750 150 21
DS 1500 -2750 1500 -3500 150 21
DS 1500 -3500 -750 -3500 150 21
DS -750 -3500 -750 -2750 150 21
$PAD
Sh "2" C 882 882 0 0 0
Dr 320 0 0
At STD N 00E0FFFF
Ne 0 ""
Po 1000 0
$EndPAD
$PAD
Sh "1" R 882 882 0 0 0
Dr 320 0 0
At STD N 00E0FFFF
Ne 0 ""
Po 0 -2000
$EndPAD
$PAD
Sh "3" C 882 882 0 0 0
Dr 320 0 0
At STD N 00E0FFFF
Ne 0 ""
Po 0 3000
$EndPAD
$SHAPE3D
Na "Potenciometer\\pot_sp19l.wrl"
Sc 1 1 1
Of 0.05 -0.07000000000000001 0
Ro 0 0 90
$EndSHAPE3D
$EndMODULE POAMH
$MODULE POAOH
Po 0 0 0 15 4FB3DFEA 00000000 ~~
Li POAOH
Sc 0
AR 
Op 0 0 0
T0 -250 -2250 394 394 0 79 N V 21 N "POAOH"
T1 0 1150 394 394 0 79 N I 21 N "Value"
DS -250 250 250 -250 150 21
DS 250 1750 -250 1750 150 21
DS 250 -1750 0 -1750 150 21
DS -1750 -1750 -2250 -1750 150 21
DS -2250 -1750 -2250 1750 150 21
DS -2250 1750 -1750 1750 150 21
DS -250 -250 250 250 150 21
DS -250 -1750 0 -1750 150 21
DC 0 0 500 -250 150 21
DS -1750 1750 0 1750 150 21
DS -1750 -1750 -250 -1750 150 21
DA 250 0 2000 0 900 150 21
DA 250 0 250 -1750 900 150 21
$PAD
Sh "2" C 882 882 0 0 0
Dr 320 0 0
At STD N 00E0FFFF
Ne 0 ""
Po 2000 0
$EndPAD
$PAD
Sh "1" R 882 882 0 0 0
Dr 320 0 0
At STD N 00E0FFFF
Ne 0 ""
Po -2000 -1000
$EndPAD
$PAD
Sh "3" C 882 882 0 0 0
Dr 320 0 0
At STD N 00E0FFFF
Ne 0 ""
Po -2000 1000
$EndPAD
$SHAPE3D
Na "Potenciometer\\pot_li10.wrl"
Sc 1 1 1
Of 0 0 0
Ro 0 0 90
$EndSHAPE3D
$EndMODULE POAOH
$MODULE POAOV
Po 0 0 0 15 4FB3E01B 00000000 ~~
Li POAOV
Sc 0
AR 
Op 0 0 0
T0 -900 0 394 394 900 79 N V 21 N "POAOV"
T1 2000 0 394 394 900 79 N I 21 N "Value"
DS -500 0 750 0 150 21
DS 750 -250 1000 -250 150 21
DS 1000 -250 1000 250 150 21
DS 1000 250 750 250 150 21
DS 500 -500 750 -500 150 21
DS 750 -500 750 500 150 21
DS 750 500 500 500 150 21
DS -500 -1750 500 -1750 150 21
DS 500 -1750 500 1750 150 21
DS 500 1750 -500 1750 150 21
DS -500 1500 -500 1750 150 21
DS -500 -1000 -500 1500 150 21
DS -500 -1000 -500 -1750 150 21
$PAD
Sh "2" C 882 882 0 0 0
Dr 320 0 0
At STD N 00E0FFFF
Ne 0 ""
Po 1000 0
$EndPAD
$PAD
Sh "1" R 882 882 0 0 0
Dr 320 0 0
At STD N 00E0FFFF
Ne 0 ""
Po 0 -1000
$EndPAD
$PAD
Sh "3" C 882 882 0 0 0
Dr 320 0 0
At STD N 00E0FFFF
Ne 0 ""
Po 0 1000
$EndPAD
$EndMODULE POAOV
$MODULE POT10T
Po 0 0 0 15 4FD64E74 00000000 ~~
Li POT10T
Sc 0
AR 
Op 0 0 0
T0 0 -2000 393 393 0 78 N V 21 N "POT10T"
T1 0 1000 393 393 0 78 N I 21 N "Value"
DS -1950 -750 -1050 -1250 150 21
DC -1500 -1000 -1500 -500 150 21
DS -2000 -1500 2000 -1500 150 21
DS 2000 -1500 2000 500 150 21
DS 2000 500 -2000 500 150 21
DS -2000 500 -2000 -1500 150 21
$PAD
Sh "1" C 750 750 0 0 0
Dr 230 0 0
At STD N 00E0FFFF
Ne 0 ""
Po -1000 0
$EndPAD
$PAD
Sh "2" C 750 750 0 0 0
Dr 230 0 0
At STD N 00E0FFFF
Ne 0 ""
Po 1000 0
$EndPAD
$PAD
Sh "3" C 750 750 0 0 0
Dr 230 0 0
At STD N 00E0FFFF
Ne 0 ""
Po 0 0
$EndPAD
$PAD
Sh "3" C 750 750 0 0 0
Dr 230 0 0
At STD N 00E0FFFF
Ne 0 ""
Po 0 -1000
$EndPAD
$EndMODULE POT10T
$MODULE POT10T-L
Po 0 0 0 15 4FD64EA2 00000000 ~~
Li POT10T-L
Sc 0
AR 
Op 0 0 0
T0 0 -2000 400 400 0 100 N V 21 N "POT10T-L"
T1 0 1000 400 400 0 100 N I 21 N "Value"
DS -1950 -750 -1050 -1250 150 21
DC -1500 -1000 -1500 -500 150 21
DS -2000 -1500 2000 -1500 150 21
DS 2000 -1500 2000 500 150 21
DS 2000 500 -2000 500 150 21
DS -2000 500 -2000 -1500 150 21
$PAD
Sh "1" C 750 750 0 0 0
Dr 230 0 0
At STD N 00E0FFFF
Ne 0 ""
Po -1000 0
$EndPAD
$PAD
Sh "2" C 750 750 0 0 0
Dr 230 0 0
At STD N 00E0FFFF
Ne 0 ""
Po 1000 0
$EndPAD
$PAD
Sh "3" C 750 750 0 0 0
Dr 230 0 0
At STD N 00E0FFFF
Ne 0 ""
Po 0 0
$EndPAD
$EndMODULE POT10T-L
$MODULE POT10T-T
Po 0 0 0 15 4FD64ED8 00000000 ~~
Li POT10T-T
Sc 0
AR 
Op 0 0 0
T0 0 -1500 400 400 0 100 N V 21 N "POT10T-T"
T1 0 1500 400 400 0 100 N I 21 N "Value"
DS -1950 -250 -1050 -750 150 21
DC -1500 -500 -1500 0 150 21
DS -2000 -1000 2000 -1000 150 21
DS 2000 -1000 2000 1000 150 21
DS 2000 1000 -2000 1000 150 21
DS -2000 1000 -2000 -1000 150 21
$PAD
Sh "1" C 750 750 0 0 0
Dr 230 0 0
At STD N 00E0FFFF
Ne 0 ""
Po -1000 500
$EndPAD
$PAD
Sh "2" C 750 750 0 0 0
Dr 230 0 0
At STD N 00E0FFFF
Ne 0 ""
Po 1000 500
$EndPAD
$PAD
Sh "3" C 750 750 0 0 0
Dr 230 0 0
At STD N 00E0FFFF
Ne 0 ""
Po 0 -500
$EndPAD
$EndMODULE POT10T-T
$MODULE POT3IL
Po 0 0 0 15 4FDA26BA 00000000 ~~
Li POT3IL
Kw POT 3 EN LIGNE
Sc 0
AR 
Op 0 0 0
T0 0 -1500 393 393 0 78 N V 21 N "POT3DIL"
T1 0 1500 392 392 0 77 N I 21 N "Value"
DS -2000 -1000 -2000 1000 150 21
DS -2000 1000 2000 1000 150 21
DS 2000 1000 2000 -1000 150 21
DS 2000 -1000 -2000 -1000 150 21
$PAD
Sh "2" C 600 600 0 0 0
Dr 200 0 0
At STD N 00E0FFFF
Ne 0 ""
Po 0 0
$EndPAD
$PAD
Sh "1" R 600 600 0 0 0
Dr 200 0 0
At STD N 00E0FFFF
Ne 0 ""
Po -1000 0
$EndPAD
$PAD
Sh "3" C 600 600 0 0 0
Dr 200 0 0
At STD N 00E0FFFF
Ne 0 ""
Po 1000 0
$EndPAD
$SHAPE3D
Na "Potenciometer/POT-3pv.wrl"
Sc 1 1 1
Of -0.1 0 0
Ro 0 0 0
$EndSHAPE3D
$EndMODULE POT3IL
$MODULE POT63XA
Po 0 0 0 15 4FB3E054 00000000 ~~
Li POT63XA
Sc 0
AR 
Op 0 0 0
T0 -1350 0 394 394 900 79 N V 21 N "POT63XA"
T1 2000 0 394 394 900 79 N I 21 N "RV**"
DS 500 -2250 1250 -2250 150 21
DS 500 -2000 500 -2500 150 21
DS 500 -2500 1250 -2500 150 21
DS 1250 -2500 1250 -2000 150 21
DS 1250 2000 1500 2000 150 21
DS 1500 2000 1500 -2000 150 21
DS -750 -2000 -750 2000 150 21
DS -750 2000 1250 2000 150 21
DS 1500 -2000 -750 -2000 150 21
$PAD
Sh "2" C 803 803 0 0 0
Dr 320 0 0
At STD N 00E0FFFF
Ne 0 ""
Po 0 0
$EndPAD
$PAD
Sh "1" R 882 882 0 0 0
Dr 320 0 0
At STD N 00E0FFFF
Ne 0 ""
Po 0 -1000
$EndPAD
$PAD
Sh "3" C 882 882 0 0 0
Dr 320 0 0
At STD N 00E0FFFF
Ne 0 ""
Po 0 1000
$EndPAD
$EndMODULE POT63XA
$MODULE POT63XB
Po 0 0 0 15 4FB67AD5 00000000 ~~
Li POT63XB
Sc 0
AR 
Op 0 0 0
T0 -1150 0 394 394 900 79 N V 21 N "POT63XB"
T1 1950 -50 394 394 900 79 N I 21 N "Value"
DS 1250 2000 1500 2000 150 21
DS 1500 2000 1500 -2000 150 21
DS -750 -2000 -750 2000 150 21
DS -750 2000 1250 2000 150 21
DS 0 -2000 0 -2500 150 21
DS 0 -2500 750 -2500 150 21
DS 750 -2500 750 -2000 150 21
DS 1500 -2000 -750 -2000 150 21
$PAD
Sh "2" C 882 882 0 0 0
Dr 320 0 0
At STD N 00E0FFFF
Ne 0 ""
Po 1000 0
$EndPAD
$PAD
Sh "1" R 882 882 0 0 0
Dr 320 0 0
At STD N 00E0FFFF
Ne 0 ""
Po 0 -1000
$EndPAD
$PAD
Sh "3" C 882 882 0 0 0
Dr 320 0 0
At STD N 00E0FFFF
Ne 0 ""
Po 0 1000
$EndPAD
$SHAPE3D
Na "Potenciometer\\pot_s64y.wrl"
Sc 1 1 1
Of 0.05 0 0
Ro 0 0 -90
$EndSHAPE3D
$EndMODULE POT63XB
$MODULE POT63YA
Po 0 0 0 15 4FB3E2A8 00000000 ~~
Li POT63YA
Sc 0
AR 
Op 0 0 0
T0 -1100 0 394 394 900 79 N V 21 N "POT63YA"
T1 1950 0 394 394 900 79 N I 21 N "RV**"
DS 500 -1000 1000 -1500 150 21
DC 750 -1250 1250 -1250 150 21
DS 1250 2000 1500 2000 150 21
DS 1500 2000 1500 -2000 150 21
DS -750 -2000 -750 2000 150 21
DS -750 2000 1250 2000 150 21
DS 1500 -2000 -750 -2000 150 21
$PAD
Sh "2" C 803 803 0 0 0
Dr 320 0 0
At STD N 00E0FFFF
Ne 0 ""
Po 0 0
$EndPAD
$PAD
Sh "1" R 882 882 0 0 0
Dr 320 0 0
At STD N 00E0FFFF
Ne 0 ""
Po 0 -1000
$EndPAD
$PAD
Sh "3" C 882 882 0 0 0
Dr 320 0 0
At STD N 00E0FFFF
Ne 0 ""
Po 0 1000
$EndPAD
$SHAPE3D
Na "Potenciometer\\pot_rj9w.wrl"
Sc 1 1 1
Of 0.03 0 0
Ro 0 0 -90
$EndSHAPE3D
$EndMODULE POT63YA
$MODULE POT63YB
Po 0 0 0 15 4FB3E2DC 00000000 ~~
Li POT63YB
Sc 0
AR 
Op 0 0 0
T0 -1250 0 394 394 900 79 N V 21 N "POT63YB"
T1 2000 0 394 394 900 79 N I 21 N "RV**"
DS 1250 2000 1500 2000 150 21
DS 1500 2000 1500 -2000 150 21
DS -750 -2000 -750 2000 150 21
DS -750 2000 1250 2000 150 21
DS 0 -2000 0 -2500 150 21
DS 0 -2500 750 -2500 150 21
DS 750 -2500 750 -2000 150 21
DS 1500 -2000 -750 -2000 150 21
$PAD
Sh "2" C 882 882 0 0 0
Dr 320 0 0
At STD N 00E0FFFF
Ne 0 ""
Po 1000 0
$EndPAD
$PAD
Sh "1" R 882 882 0 0 0
Dr 320 0 0
At STD N 00E0FFFF
Ne 0 ""
Po 0 -1000
$EndPAD
$PAD
Sh "3" C 882 882 0 0 0
Dr 320 0 0
At STD N 00E0FFFF
Ne 0 ""
Po 0 1000
$EndPAD
$EndMODULE POT63YB
$MODULE POT93XA
Po 0 0 0 15 4FB3E351 00000000 ~~
Li POT93XA
Sc 0
AR 
Op 0 0 0
T0 -1150 0 394 394 900 79 N V 21 N "POT93XA"
T1 1950 0 394 394 900 79 N I 21 N "RV**"
DS 500 -2250 1250 -2250 150 21
DS 500 -2000 500 -2500 150 21
DS 500 -2500 1250 -2500 150 21
DS 1250 -2500 1250 -2000 150 21
DS 1250 2000 1500 2000 150 21
DS 1500 2000 1500 -2000 150 21
DS -750 -2000 -750 2000 150 21
DS -750 2000 1250 2000 150 21
DS 1500 -2000 -750 -2000 150 21
$PAD
Sh "2" C 803 803 0 0 0
Dr 320 0 0
At STD N 00E0FFFF
Ne 0 ""
Po 0 0
$EndPAD
$PAD
Sh "1" R 882 882 0 0 0
Dr 320 0 0
At STD N 00E0FFFF
Ne 0 ""
Po 0 -1000
$EndPAD
$PAD
Sh "3" C 882 882 0 0 0
Dr 320 0 0
At STD N 00E0FFFF
Ne 0 ""
Po 0 1000
$EndPAD
$EndMODULE POT93XA
$MODULE POT93YA
Po 0 0 0 15 4FB3E37B 00000000 ~~
Li POT93YA
Sc 0
AR 
Op 0 0 0
T0 -1100 0 394 394 900 79 N V 21 N "POT93YA"
T1 1950 0 394 394 900 79 N I 21 N "RV**"
DS 500 -1000 1000 -1500 150 21
DC 750 -1250 1250 -1250 150 21
DS 1250 2000 1500 2000 150 21
DS 1500 2000 1500 -2000 150 21
DS -750 -2000 -750 2000 150 21
DS -750 2000 1250 2000 150 21
DS 1500 -2000 -750 -2000 150 21
$PAD
Sh "2" C 803 803 0 0 0
Dr 320 0 0
At STD N 00E0FFFF
Ne 0 ""
Po 0 0
$EndPAD
$PAD
Sh "1" R 882 882 0 0 0
Dr 320 0 0
At STD N 00E0FFFF
Ne 0 ""
Po 0 -1000
$EndPAD
$PAD
Sh "3" C 882 882 0 0 0
Dr 320 0 0
At STD N 00E0FFFF
Ne 0 ""
Po 0 1000
$EndPAD
$SHAPE3D
Na "Potenciometer\\pot_rj9w.wrl"
Sc 1 1 1
Of 0.03 0 0
Ro 0 0 -90
$EndSHAPE3D
$EndMODULE POT93YA
$MODULE POT93YB
Po 0 0 0 15 4FB3E3AC 00000000 ~~
Li POT93YB
Sc 0
AR 
Op 0 0 0
T0 -1100 0 394 394 900 79 N V 21 N "POT93YA"
T1 2000 0 394 394 900 79 N I 21 N "RV**"
DS 500 -1000 1000 -1500 150 21
DC 750 -1250 1250 -1250 150 21
DS 1250 2000 1500 2000 150 21
DS 1500 2000 1500 -2000 150 21
DS -750 -2000 -750 2000 150 21
DS -750 2000 1250 2000 150 21
DS 1500 -2000 -750 -2000 150 21
$PAD
Sh "2" C 803 803 0 0 0
Dr 320 0 0
At STD N 00E0FFFF
Ne 0 ""
Po 1000 0
$EndPAD
$PAD
Sh "1" R 882 882 0 0 0
Dr 320 0 0
At STD N 00E0FFFF
Ne 0 ""
Po 0 -1000
$EndPAD
$PAD
Sh "3" C 882 882 0 0 0
Dr 320 0 0
At STD N 00E0FFFF
Ne 0 ""
Po 0 1000
$EndPAD
$EndMODULE POT93YB
$MODULE POT93Z
Po 0 0 0 15 4FB3E3E4 00000000 ~~
Li POT93Z
Sc 0
AR 
Op 0 0 0
T0 -2400 0 394 394 900 79 N V 21 N "POT93Z"
T1 1500 0 394 394 900 79 N I 21 N "RV**"
DS 2250 750 2000 750 150 21
DS 2250 750 2500 750 150 21
DS 2500 750 2500 1500 150 21
DS 2500 1500 2000 1500 150 21
DS -1500 -2000 2000 -2000 150 21
DS 2000 -2000 2000 2000 150 21
DS 2000 2000 -2000 2000 150 21
DS -2000 2000 -2000 -2000 150 21
DS -2000 -2000 -1500 -2000 150 21
$PAD
Sh "2" C 803 803 0 0 0
Dr 320 0 0
At STD N 00E0FFFF
Ne 0 ""
Po 500 0
$EndPAD
$PAD
Sh "1" R 803 803 0 0 0
Dr 320 0 0
At STD N 00E0FFFF
Ne 0 ""
Po -500 -1000
$EndPAD
$PAD
Sh "3" C 803 803 0 0 0
Dr 320 0 0
At STD N 00E0FFFF
Ne 0 ""
Po -500 1000
$EndPAD
$EndMODULE POT93Z
$MODULE POTA_Fav
Po 0 0 0 15 4FB3E408 00000000 ~~
Li POTA_Fav
Sc 0
AR 
Op 0 0 0
T0 1000 -4500 394 394 0 79 N V 21 N "POTA_Fav"
T1 -7000 0 394 394 0 79 N I 21 N "RV**"
DS -4000 -1000 -11000 -1000 150 21
DS -11000 -1000 -11000 1000 150 21
DS -11000 1000 -4000 1000 150 21
DS -1000 -2000 -4000 -2000 150 21
DS -4000 -2000 -4000 2000 150 21
DS -4000 2000 -1000 2000 150 21
DS 3000 -4000 3000 4000 150 21
DS 3000 4000 0 4000 150 21
DS 0 4000 -1000 4000 150 21
DS -1000 4000 -1000 -4000 150 21
DS -1000 -4000 3000 -4000 150 21
$PAD
Sh "2" C 943 943 0 0 0
Dr 320 0 0
At STD N 00E0FFFF
Ne 0 ""
Po 2000 0
$EndPAD
$PAD
Sh "1" R 882 882 0 0 0
Dr 320 0 0
At STD N 00E0FFFF
Ne 0 ""
Po 2000 -2000
$EndPAD
$PAD
Sh "3" C 882 882 0 0 0
Dr 320 0 0
At STD N 00E0FFFF
Ne 0 ""
Po 2000 2000
$EndPAD
$EndMODULE POTA_Fav
$MODULE POTA_Fav_Int
Po 0 0 0 15 4FB3E47D 00000000 ~~
Li POTA_Fav_Int
Sc 0
AR 
Op 0 0 0
T0 2000 -5000 600 600 0 120 N V 21 N "POTA_Fav_Int"
T1 -7000 0 600 600 0 120 N I 21 N "RV**"
DS 3000 -3000 7000 -3000 150 21
DS 7000 -3000 7000 3000 150 21
DS 7000 3000 3000 3000 150 21
DS -4000 -1000 -11000 -1000 150 21
DS -11000 -1000 -11000 1000 150 21
DS -11000 1000 -4000 1000 150 21
DS -1000 -2000 -4000 -2000 150 21
DS -4000 -2000 -4000 2000 150 21
DS -4000 2000 -1000 2000 150 21
DS 3000 -4000 3000 4000 150 21
DS 3000 4000 0 4000 150 21
DS 0 4000 -1000 4000 150 21
DS -1000 4000 -1000 -4000 150 21
DS -1000 -4000 3000 -4000 150 21
$PAD
Sh "2" C 943 943 0 0 0
Dr 320 0 0
At STD N 00E0FFFF
Ne 0 ""
Po 2000 0
$EndPAD
$PAD
Sh "1" R 882 882 0 0 0
Dr 320 0 0
At STD N 00E0FFFF
Ne 0 ""
Po 2000 -2000
$EndPAD
$PAD
Sh "3" C 882 882 0 0 0
Dr 320 0 0
At STD N 00E0FFFF
Ne 0 ""
Po 2000 2000
$EndPAD
$PAD
Sh "5" C 943 943 0 0 0
Dr 320 0 0
At STD N 00E0FFFF
Ne 0 ""
Po 6000 -2000
$EndPAD
$PAD
Sh "4" C 943 943 0 0 0
Dr 320 0 0
At STD N 00E0FFFF
Ne 0 ""
Po 6000 2000
$EndPAD
$EndMODULE POTA_Fav_Int
$MODULE POTA_Fav_lin
Po 0 0 0 15 4FB3E494 00000000 ~~
Li POTA_Fav_lin
Sc 0
AR 
Op 0 0 0
T0 0 -2750 600 600 0 120 N V 21 N "POTA_Fav_Lin"
T1 2150 0 600 600 0 120 N I 21 N "RV**"
DS -3000 -2000 -2000 2000 150 21
DS -2000 2000 -3000 2000 150 21
DS -3000 2000 -2000 -2000 150 21
DS -3000 -1000 -3000 1000 150 21
DS -3000 1000 -2000 1000 150 21
DS -2000 1000 -2000 -1000 150 21
DS -2000 -1000 -2000 -2000 150 21
DS -2000 -2000 -3000 -2000 150 21
DS -3000 -2000 -3000 2000 150 21
DS -3000 2000 -2000 2000 150 21
DS -2000 2000 -2000 1000 150 21
DS -10000 -1000 12000 -1000 150 21
DS 12000 -1000 12000 1000 150 21
DS 12000 1000 -10000 1000 150 21
DS -10000 1000 -10000 -1000 150 21
DS -13000 -2000 14000 -2000 150 21
DS 14000 -2000 14000 2000 150 21
DS 14000 2000 -13000 2000 150 21
DS -13000 2000 -13000 -2000 150 21
$PAD
Sh "2" C 943 943 0 0 0
Dr 320 0 0
At STD N 00E0FFFF
Ne 0 ""
Po 9000 0
$EndPAD
$PAD
Sh "1" R 882 882 0 0 0
Dr 320 0 0
At STD N 00E0FFFF
Ne 0 ""
Po -9000 0
$EndPAD
$PAD
Sh "3" C 882 882 0 0 0
Dr 320 0 0
At STD N 00E0FFFF
Ne 0 ""
Po 11000 0
$EndPAD
$EndMODULE POTA_Fav_lin
$MODULE POTX
Po 0 0 0 15 4FB6727B 00000000 ~~
Li POTX
Sc 0
AR 
Op 0 0 0
T0 -2050 0 394 394 900 79 N V 21 N "POTX"
T1 1000 0 394 394 900 79 N I 21 N "RV**"
DS 500 2000 -1500 2000 150 21
DS -1000 -2000 500 -2000 150 21
DS 500 -2000 500 2000 150 21
DS -1500 2000 -1500 -2000 150 21
DS -1500 -2000 -1000 -2000 150 21
DS 500 -500 250 0 150 21
DS 250 0 0 -250 150 21
DS 0 -250 500 -500 150 21
DS -500 500 500 -500 150 21
$PAD
Sh "2" C 803 803 0 0 0
Dr 320 0 0
At STD N 00E0FFFF
Ne 0 ""
Po -1000 0
$EndPAD
$PAD
Sh "1" R 803 803 0 0 0
Dr 320 0 0
At STD N 00E0FFFF
Ne 0 ""
Po 0 -1000
$EndPAD
$PAD
Sh "3" C 803 803 0 0 0
Dr 320 0 0
At STD N 00E0FFFF
Ne 0 ""
Po 0 1000
$EndPAD
$EndMODULE POTX
$MODULE POTY7A
Po 0 0 0 15 4FB672B9 00000000 ~~
Li POTY7A
Sc 0
AR 
Op 0 0 0
T0 0 -2400 394 394 0 79 N V 21 N "POT7YA"
T1 0 2550 394 394 0 79 N I 21 N "Value"
DS 500 -500 250 0 150 21
DS 250 0 0 -250 150 21
DS 0 -250 500 -500 150 21
DS -500 500 500 -500 150 21
DC 0 0 1000 0 150 21
DC 0 0 2000 0 150 21
$PAD
Sh "2" C 803 803 0 0 0
Dr 320 0 0
At STD N 00E0FFFF
Ne 0 ""
Po 1000 0
$EndPAD
$PAD
Sh "1" R 803 803 0 0 0
Dr 320 0 0
At STD N 00E0FFFF
Ne 0 ""
Po 0 -1000
$EndPAD
$PAD
Sh "3" C 803 803 0 0 0
Dr 320 0 0
At STD N 00E0FFFF
Ne 0 ""
Po 0 1000
$EndPAD
$SHAPE3D
Na "Potenciometer\\pot_s75p.wrl"
Sc 1 1 1
Of 0 0 0
Ro 0 0 90
$EndSHAPE3D
$EndMODULE POTY7A
$MODULE POTY7B
Po 0 0 0 15 4FB673A0 00000000 ~~
Li POTY7B
Sc 0
AR 
Op 0 0 0
T0 0 -2400 394 394 0 79 N V 21 N "POT7YB"
T1 0 2500 394 394 0 79 N I 21 N "Value"
DS 500 -500 250 0 150 21
DS 250 0 0 -250 150 21
DS 0 -250 500 -500 150 21
DS -500 500 500 -500 150 21
DC 0 0 1000 0 150 21
DC 0 0 2000 0 150 21
$PAD
Sh "2" C 803 803 0 0 0
Dr 320 0 0
At STD N 00E0FFFF
Ne 0 ""
Po 750 0
$EndPAD
$PAD
Sh "1" R 803 803 0 0 0
Dr 320 0 0
At STD N 00E0FFFF
Ne 0 ""
Po -500 -750
$EndPAD
$PAD
Sh "3" C 803 803 0 0 0
Dr 320 0 0
At STD N 00E0FFFF
Ne 0 ""
Po -500 750
$EndPAD
$EndMODULE POTY7B
$MODULE POTYP
Po 0 0 0 15 4FB67492 00000000 ~~
Li POTYP
Sc 0
AR 
Op 0 0 0
T0 0 -2400 394 394 0 79 N V 21 N "POTYP"
T1 0 2450 394 394 0 79 N I 21 N "RV**"
DS -1500 -2000 2000 -2000 150 21
DS 2000 -2000 2000 2000 150 21
DS 2000 2000 -2000 2000 150 21
DS -2000 2000 -2000 -2000 150 21
DS -2000 -2000 -1500 -2000 150 21
DS 500 -500 250 0 150 21
DS 250 0 0 -250 150 21
DS 0 -250 500 -500 150 21
DS -500 500 500 -500 150 21
DC 0 0 1000 0 150 21
$PAD
Sh "2" C 803 803 0 0 0
Dr 320 0 0
At STD N 00E0FFFF
Ne 0 ""
Po -1500 0
$EndPAD
$PAD
Sh "1" R 803 803 0 0 0
Dr 320 0 0
At STD N 00E0FFFF
Ne 0 ""
Po 500 -1000
$EndPAD
$PAD
Sh "3" C 803 803 0 0 0
Dr 320 0 0
At STD N 00E0FFFF
Ne 0 ""
Po 500 1000
$EndPAD
$SHAPE3D
Na "Potenciometer\\pot_rs3.wrl"
Sc 1 1 1
Of -0.05 0 0
Ro 0 0 90
$EndSHAPE3D
$EndMODULE POTYP
$MODULE POTYPM
Po 0 0 0 15 4FB67638 00000000 ~~
Li POTYPM
Sc 0
AR 
Op 0 0 0
T0 0 -2350 394 394 0 79 N V 21 N "POTYPM"
T1 0 2500 394 394 0 79 N I 21 N "RV**"
DS -1500 -2000 2000 -2000 150 21
DS 2000 -2000 2000 2000 150 21
DS 2000 2000 -2000 2000 150 21
DS -2000 2000 -2000 -2000 150 21
DS -2000 -2000 -1500 -2000 150 21
DS 500 -500 250 0 150 21
DS 250 0 0 -250 150 21
DS 0 -250 500 -500 150 21
DS -500 500 500 -500 150 21
DC 0 0 1000 0 150 21
$PAD
Sh "2" C 803 803 0 0 0
Dr 320 0 0
At STD N 00E0FFFF
Ne 0 ""
Po -1500 0
$EndPAD
$PAD
Sh "1" R 803 803 0 0 0
Dr 320 0 0
At STD N 00E0FFFF
Ne 0 ""
Po 500 -1000
$EndPAD
$PAD
Sh "3" C 803 803 0 0 0
Dr 320 0 0
At STD N 00E0FFFF
Ne 0 ""
Po 500 1000
$EndPAD
$SHAPE3D
Na "Potenciometer\\pot_rs3.wrl"
Sc 1 1 1
Of -0.05 0 0
Ro 0 0 90
$EndSHAPE3D
$EndMODULE POTYPM
$MODULE poth-1T
Po 0 0 0 15 4FD64F00 00000000 ~~
Li poth-1T
Sc 0
AR 
Op 0 0 0
T0 0 -2500 400 400 0 100 N V 21 N "Poth-1T"
T1 0 1500 400 400 0 100 N I 21 N "Value"
DS -2000 -2000 2000 -2000 150 21
DS 2000 -2000 2000 2000 150 21
DS 2000 2000 -2000 2000 150 21
DS -2000 2000 -2000 -2000 150 21
$PAD
Sh "1" C 750 750 0 0 0
Dr 230 0 0
At STD N 00E0FFFF
Ne 0 ""
Po -1000 0
$EndPAD
$PAD
Sh "2" C 750 750 0 0 0
Dr 230 0 0
At STD N 00E0FFFF
Ne 0 ""
Po 1000 0
$EndPAD
$PAD
Sh "3" C 750 750 0 0 0
Dr 230 0 0
At STD N 00E0FFFF
Ne 0 ""
Po 0 -1000
$EndPAD
$EndMODULE poth-1T
$EndLIBRARY
