PCBNEW-LibModule-V1  mar 16 ago 2011 10:45:18 CEST
$INDEX
plcc20_pth-skt
plcc28_pth-skt
plcc32_pth-skt
plcc44_pth-skt
plcc52_pth-skt
plcc68_pth-skt
plcc84_pth-skt
$EndINDEX
$MODULE plcc20_pth-skt
Po 0 0 0 15 4E498657 00000000 ~~
Li plcc20_pth-skt
Sc 00000000
AR
Op 0 0 0
T0 0 -4000 600 600 0 120 N V 21 N"plcc20_pth-skt"
T1 0 4000 600 600 0 120 N V 21 N"VAL**"
DS -1772 1339 -1772 -1772 100 21
DS -1772 -1772 1339 -1772 100 21
DS 1339 -1772 2165 -2598 100 21
DS 2165 -2598 2598 -2165 100 21
DS 2598 -2165 1772 -1339 100 21
DS 1772 -1339 1772 1181 100 21
DS 1772 1181 1181 1772 100 21
DS 1181 1772 -1339 1772 100 21
DS -1772 1339 -2598 2165 100 21
DS -2598 2165 -2165 2598 100 21
DS -2165 2598 -1339 1772 100 21
DS 3071 -3071 -3071 -3071 100 21
DS -3071 -3071 -3071 3071 100 21
DS -3071 3071 2362 3071 100 21
DS 2362 3071 3071 2362 100 21
DS 3071 2362 3071 -3071 100 21
$PAD
Sh "1" C 669 669 0 0 0
Dr 394 0 0
At STD N 00E0FFFF
Ne 0 ""
Po 0 2000
$EndPAD
$PAD
Sh "2" C 669 669 0 0 0
Dr 394 0 0
At STD N 00E0FFFF
Ne 0 ""
Po 0 1000
$EndPAD
$PAD
Sh "3" C 669 669 0 0 0
Dr 394 0 0
At STD N 00E0FFFF
Ne 0 ""
Po 1000 2000
$EndPAD
$PAD
Sh "4" C 669 669 0 0 0
Dr 394 0 0
At STD N 00E0FFFF
Ne 0 ""
Po 2000 1000
$EndPAD
$PAD
Sh "5" C 669 669 0 0 0
Dr 394 0 0
At STD N 00E0FFFF
Ne 0 ""
Po 1000 1000
$EndPAD
$PAD
Sh "6" C 669 669 0 0 0
Dr 394 0 0
At STD N 00E0FFFF
Ne 0 ""
Po 2000 0
$EndPAD
$PAD
Sh "7" C 669 669 0 0 0
Dr 394 0 0
At STD N 00E0FFFF
Ne 0 ""
Po 1000 0
$EndPAD
$PAD
Sh "8" C 669 669 0 0 0
Dr 394 0 0
At STD N 00E0FFFF
Ne 0 ""
Po 2000 -1000
$EndPAD
$PAD
Sh "9" C 669 669 0 0 0
Dr 394 0 0
At STD N 00E0FFFF
Ne 0 ""
Po 1000 -2000
$EndPAD
$PAD
Sh "10" C 669 669 0 0 0
Dr 394 0 0
At STD N 00E0FFFF
Ne 0 ""
Po 1000 -1000
$EndPAD
$PAD
Sh "11" C 669 669 0 0 0
Dr 394 0 0
At STD N 00E0FFFF
Ne 0 ""
Po 0 -2000
$EndPAD
$PAD
Sh "12" C 669 669 0 0 0
Dr 394 0 0
At STD N 00E0FFFF
Ne 0 ""
Po 0 -1000
$EndPAD
$PAD
Sh "13" C 669 669 0 0 0
Dr 394 0 0
At STD N 00E0FFFF
Ne 0 ""
Po -1000 -2000
$EndPAD
$PAD
Sh "14" C 669 669 0 0 0
Dr 394 0 0
At STD N 00E0FFFF
Ne 0 ""
Po -2000 -1000
$EndPAD
$PAD
Sh "15" C 669 669 0 0 0
Dr 394 0 0
At STD N 00E0FFFF
Ne 0 ""
Po -1000 -1000
$EndPAD
$PAD
Sh "16" C 669 669 0 0 0
Dr 394 0 0
At STD N 00E0FFFF
Ne 0 ""
Po -2000 0
$EndPAD
$PAD
Sh "17" C 669 669 0 0 0
Dr 394 0 0
At STD N 00E0FFFF
Ne 0 ""
Po -1000 0
$EndPAD
$PAD
Sh "18" C 669 669 0 0 0
Dr 394 0 0
At STD N 00E0FFFF
Ne 0 ""
Po -2000 1000
$EndPAD
$PAD
Sh "19" C 669 669 0 0 0
Dr 394 0 0
At STD N 00E0FFFF
Ne 0 ""
Po -1000 2000
$EndPAD
$PAD
Sh "20" C 669 669 0 0 0
Dr 394 0 0
At STD N 00E0FFFF
Ne 0 ""
Po -1000 1000
$EndPAD
$SHAPE3D
Na "walter\pth_plcc\plcc20_pth-skt.wrl"
Sc 1.000000 1.000000 1.000000
Of 0.000000 0.000000 0.000000
Ro 0.000000 0.000000 0.000000
$EndSHAPE3D
$EndMODULE  plcc20_pth-skt
$MODULE plcc28_pth-skt
Po 0 0 0 15 4E4988F9 00000000 ~~
Li plcc28_pth-skt
Sc 00000000
AR
Op 0 0 0
T0 0 -4252 600 600 0 120 N V 21 N"plcc28_pth-skt"
T1 0 4252 600 600 0 120 N V 21 N"VAL**"
DS 2283 -1850 2283 1693 100 21
DS -2283 1850 -2283 -2283 100 21
DS -2283 -2283 1850 -2283 100 21
DS 1693 2283 -1850 2283 100 21
DS 1693 2283 2283 1693 100 21
DS 3583 -3583 -3583 -3583 100 21
DS -3583 -3583 -3583 3583 100 21
DS -3583 3583 2874 3583 100 21
DS 2874 3583 3583 2874 100 21
DS 3583 2874 3583 -3583 100 21
DS 1851 -2283 2677 -3109 100 21
DS 2677 -3109 3110 -2676 100 21
DS 3110 -2677 2284 -1851 100 21
DS -2284 1851 -3110 2677 100 21
DS -3110 2677 -2677 3110 100 21
DS -2677 3109 -1851 2283 100 21
$PAD
Sh "2" C 669 669 0 0 0
Dr 394 0 0
At STD N 00E0FFFF
Ne 0 ""
Po 500 2500
$EndPAD
$PAD
Sh "1" C 669 669 0 0 0
Dr 394 0 0
At STD N 00E0FFFF
Ne 0 ""
Po -500 1500
$EndPAD
$PAD
Sh "3" C 669 669 0 0 0
Dr 394 0 0
At STD N 00E0FFFF
Ne 0 ""
Po 500 1500
$EndPAD
$PAD
Sh "4" C 669 669 0 0 0
Dr 394 0 0
At STD N 00E0FFFF
Ne 0 ""
Po 1500 2500
$EndPAD
$PAD
Sh "5" C 669 669 0 0 0
Dr 394 0 0
At STD N 00E0FFFF
Ne 0 ""
Po 2500 1500
$EndPAD
$PAD
Sh "6" C 669 669 0 0 0
Dr 394 0 0
At STD N 00E0FFFF
Ne 0 ""
Po 1500 1500
$EndPAD
$PAD
Sh "7" C 669 669 0 0 0
Dr 394 0 0
At STD N 00E0FFFF
Ne 0 ""
Po 2500 500
$EndPAD
$PAD
Sh "8" C 669 669 0 0 0
Dr 394 0 0
At STD N 00E0FFFF
Ne 0 ""
Po 1500 500
$EndPAD
$PAD
Sh "9" C 669 669 0 0 0
Dr 394 0 0
At STD N 00E0FFFF
Ne 0 ""
Po 2500 -500
$EndPAD
$PAD
Sh "10" C 669 669 0 0 0
Dr 394 0 0
At STD N 00E0FFFF
Ne 0 ""
Po 1500 -500
$EndPAD
$PAD
Sh "11" C 669 669 0 0 0
Dr 394 0 0
At STD N 00E0FFFF
Ne 0 ""
Po 2500 -1500
$EndPAD
$PAD
Sh "12" C 669 669 0 0 0
Dr 394 0 0
At STD N 00E0FFFF
Ne 0 ""
Po 1500 -2500
$EndPAD
$PAD
Sh "13" C 669 669 0 0 0
Dr 394 0 0
At STD N 00E0FFFF
Ne 0 ""
Po 1500 -1500
$EndPAD
$PAD
Sh "14" C 669 669 0 0 0
Dr 394 0 0
At STD N 00E0FFFF
Ne 0 ""
Po 500 -2500
$EndPAD
$PAD
Sh "15" C 669 669 0 0 0
Dr 394 0 0
At STD N 00E0FFFF
Ne 0 ""
Po 500 -1500
$EndPAD
$PAD
Sh "16" C 669 669 0 0 0
Dr 394 0 0
At STD N 00E0FFFF
Ne 0 ""
Po -500 -2500
$EndPAD
$PAD
Sh "17" C 669 669 0 0 0
Dr 394 0 0
At STD N 00E0FFFF
Ne 0 ""
Po -500 -1500
$EndPAD
$PAD
Sh "18" C 669 669 0 0 0
Dr 394 0 0
At STD N 00E0FFFF
Ne 0 ""
Po -1500 -2500
$EndPAD
$PAD
Sh "19" C 669 669 0 0 0
Dr 394 0 0
At STD N 00E0FFFF
Ne 0 ""
Po -2500 -1500
$EndPAD
$PAD
Sh "20" C 669 669 0 0 0
Dr 394 0 0
At STD N 00E0FFFF
Ne 0 ""
Po -1500 -1500
$EndPAD
$PAD
Sh "21" C 669 669 0 0 0
Dr 394 0 0
At STD N 00E0FFFF
Ne 0 ""
Po -2500 -500
$EndPAD
$PAD
Sh "22" C 669 669 0 0 0
Dr 394 0 0
At STD N 00E0FFFF
Ne 0 ""
Po -1500 -500
$EndPAD
$PAD
Sh "23" C 669 669 0 0 0
Dr 394 0 0
At STD N 00E0FFFF
Ne 0 ""
Po -2500 500
$EndPAD
$PAD
Sh "24" C 669 669 0 0 0
Dr 394 0 0
At STD N 00E0FFFF
Ne 0 ""
Po -1500 500
$EndPAD
$PAD
Sh "25" C 669 669 0 0 0
Dr 394 0 0
At STD N 00E0FFFF
Ne 0 ""
Po -2500 1500
$EndPAD
$PAD
Sh "26" C 669 669 0 0 0
Dr 394 0 0
At STD N 00E0FFFF
Ne 0 ""
Po -1500 2500
$EndPAD
$PAD
Sh "27" C 669 669 0 0 0
Dr 394 0 0
At STD N 00E0FFFF
Ne 0 ""
Po -1500 1500
$EndPAD
$PAD
Sh "28" C 669 669 0 0 0
Dr 394 0 0
At STD N 00E0FFFF
Ne 0 ""
Po -500 2500
$EndPAD
$SHAPE3D
Na "walter\pth_plcc\plcc28_pth-skt.wrl"
Sc 1.000000 1.000000 1.000000
Of 0.000000 0.000000 0.000000
Ro 0.000000 0.000000 0.000000
$EndSHAPE3D
$EndMODULE  plcc28_pth-skt
$MODULE plcc32_pth-skt
Po 0 0 0 15 4E498ACB 00000000 ~~
Li plcc32_pth-skt
Sc 00000000
AR
Op 0 0 0
T0 0 -4724 600 600 0 120 N V 21 N"plcc32_pth-skt"
T1 0 4724 600 600 0 120 N V 21 N"VAL**"
DS -2283 -2756 -2283 2323 100 21
DS 2283 2165 2283 -2323 100 21
DS -3583 4055 -3583 -4055 100 21
DS 3583 -4055 3583 3346 100 21
DS -2283 -2756 1850 -2756 100 21
DS 1693 2756 -1850 2756 100 21
DS 1693 2755 2283 2165 100 21
DS 3583 -4055 -3583 -4055 100 21
DS -3583 4055 2874 4055 100 21
DS 2874 4056 3583 3347 100 21
DS 1851 -2755 2677 -3581 100 21
DS 2677 -3581 3110 -3148 100 21
DS 3110 -3150 2284 -2324 100 21
DS -2284 2323 -3110 3149 100 21
DS -3110 3150 -2677 3583 100 21
DS -2677 3581 -1851 2755 100 21
$PAD
Sh "2" C 669 669 0 0 0
Dr 394 0 0
At STD N 00E0FFFF
Ne 0 ""
Po 500 3000
$EndPAD
$PAD
Sh "1" C 669 669 0 0 0
Dr 394 0 0
At STD N 00E0FFFF
Ne 0 ""
Po -500 2000
$EndPAD
$PAD
Sh "3" C 669 669 0 0 0
Dr 394 0 0
At STD N 00E0FFFF
Ne 0 ""
Po 500 2000
$EndPAD
$PAD
Sh "4" C 669 669 0 0 0
Dr 394 0 0
At STD N 00E0FFFF
Ne 0 ""
Po 1500 3000
$EndPAD
$PAD
Sh "5" C 669 669 0 0 0
Dr 394 0 0
At STD N 00E0FFFF
Ne 0 ""
Po 2500 2000
$EndPAD
$PAD
Sh "6" C 669 669 0 0 0
Dr 394 0 0
At STD N 00E0FFFF
Ne 0 ""
Po 1500 2000
$EndPAD
$PAD
Sh "7" C 669 669 0 0 0
Dr 394 0 0
At STD N 00E0FFFF
Ne 0 ""
Po 2500 1000
$EndPAD
$PAD
Sh "8" C 669 669 0 0 0
Dr 394 0 0
At STD N 00E0FFFF
Ne 0 ""
Po 1500 1000
$EndPAD
$PAD
Sh "9" C 669 669 0 0 0
Dr 394 0 0
At STD N 00E0FFFF
Ne 0 ""
Po 2500 0
$EndPAD
$PAD
Sh "10" C 669 669 0 0 0
Dr 394 0 0
At STD N 00E0FFFF
Ne 0 ""
Po 1500 0
$EndPAD
$PAD
Sh "11" C 669 669 0 0 0
Dr 394 0 0
At STD N 00E0FFFF
Ne 0 ""
Po 2500 -1000
$EndPAD
$PAD
Sh "12" C 669 669 0 0 0
Dr 394 0 0
At STD N 00E0FFFF
Ne 0 ""
Po 1500 -1000
$EndPAD
$PAD
Sh "13" C 669 669 0 0 0
Dr 394 0 0
At STD N 00E0FFFF
Ne 0 ""
Po 2500 -2000
$EndPAD
$PAD
Sh "14" C 669 669 0 0 0
Dr 394 0 0
At STD N 00E0FFFF
Ne 0 ""
Po 1500 -3000
$EndPAD
$PAD
Sh "15" C 669 669 0 0 0
Dr 394 0 0
At STD N 00E0FFFF
Ne 0 ""
Po 1500 -2000
$EndPAD
$PAD
Sh "16" C 669 669 0 0 0
Dr 394 0 0
At STD N 00E0FFFF
Ne 0 ""
Po 500 -3000
$EndPAD
$PAD
Sh "17" C 669 669 0 0 0
Dr 394 0 0
At STD N 00E0FFFF
Ne 0 ""
Po 500 -2000
$EndPAD
$PAD
Sh "18" C 669 669 0 0 0
Dr 394 0 0
At STD N 00E0FFFF
Ne 0 ""
Po -500 -3000
$EndPAD
$PAD
Sh "19" C 669 669 0 0 0
Dr 394 0 0
At STD N 00E0FFFF
Ne 0 ""
Po -500 -2000
$EndPAD
$PAD
Sh "20" C 669 669 0 0 0
Dr 394 0 0
At STD N 00E0FFFF
Ne 0 ""
Po -1500 -3000
$EndPAD
$PAD
Sh "21" C 669 669 0 0 0
Dr 394 0 0
At STD N 00E0FFFF
Ne 0 ""
Po -2500 -2000
$EndPAD
$PAD
Sh "22" C 669 669 0 0 0
Dr 394 0 0
At STD N 00E0FFFF
Ne 0 ""
Po -1500 -2000
$EndPAD
$PAD
Sh "23" C 669 669 0 0 0
Dr 394 0 0
At STD N 00E0FFFF
Ne 0 ""
Po -2500 -1000
$EndPAD
$PAD
Sh "24" C 669 669 0 0 0
Dr 394 0 0
At STD N 00E0FFFF
Ne 0 ""
Po -1500 -1000
$EndPAD
$PAD
Sh "25" C 669 669 0 0 0
Dr 394 0 0
At STD N 00E0FFFF
Ne 0 ""
Po -2500 0
$EndPAD
$PAD
Sh "26" C 669 669 0 0 0
Dr 394 0 0
At STD N 00E0FFFF
Ne 0 ""
Po -1500 0
$EndPAD
$PAD
Sh "27" C 669 669 0 0 0
Dr 394 0 0
At STD N 00E0FFFF
Ne 0 ""
Po -2500 1000
$EndPAD
$PAD
Sh "32" C 669 669 0 0 0
Dr 394 0 0
At STD N 00E0FFFF
Ne 0 ""
Po -500 3000
$EndPAD
$PAD
Sh "28" C 669 669 0 0 0
Dr 394 0 0
At STD N 00E0FFFF
Ne 0 ""
Po -1500 1000
$EndPAD
$PAD
Sh "29" C 669 669 0 0 0
Dr 394 0 0
At STD N 00E0FFFF
Ne 0 ""
Po -2500 2000
$EndPAD
$PAD
Sh "30" C 669 669 0 0 0
Dr 394 0 0
At STD N 00E0FFFF
Ne 0 ""
Po -1500 3000
$EndPAD
$PAD
Sh "31" C 669 669 0 0 0
Dr 394 0 0
At STD N 00E0FFFF
Ne 0 ""
Po -1500 2000
$EndPAD
$SHAPE3D
Na "walter\pth_plcc\plcc32_pth-skt.wrl"
Sc 1.000000 1.000000 1.000000
Of 0.000000 0.000000 0.000000
Ro 0.000000 0.000000 0.000000
$EndSHAPE3D
$EndMODULE  plcc32_pth-skt
$MODULE plcc44_pth-skt
Po 0 0 0 15 4E498D66 00000000 ~~
Li plcc44_pth-skt
Sc 00000000
AR
Op 0 0 0
T0 0 -5197 600 600 0 120 N V 21 N"plcc44_pth-skt"
T1 0 5197 600 600 0 120 N V 21 N"VAL**"
DS 3307 -2874 3307 2717 100 21
DS -3307 2874 -3307 -3307 100 21
DS -3307 -3307 2874 -3307 100 21
DS 2717 3307 -2874 3307 100 21
DS 3307 2717 2717 3307 100 21
DS 3858 4567 -4567 4567 100 21
DS -4567 -4567 4567 -4567 100 21
DS 4567 -4567 4567 3858 100 21
DS 4567 3858 3858 4567 100 21
DS -4567 4567 -4567 -4567 100 21
DS 2875 -3306 3701 -4132 100 21
DS 3700 -4132 4133 -3699 100 21
DS 4134 -3701 3308 -2875 100 21
DS -3307 2874 -4133 3700 100 21
DS -4134 3702 -3701 4135 100 21
DS -3700 4132 -2874 3306 100 21
$PAD
Sh "2" C 669 669 0 0 0
Dr 394 0 0
At STD N 00E0FFFF
Ne 0 ""
Po 500 3500
$EndPAD
$PAD
Sh "1" C 669 669 0 0 0
Dr 394 0 0
At STD N 00E0FFFF
Ne 0 ""
Po -500 2500
$EndPAD
$PAD
Sh "3" C 669 669 0 0 0
Dr 394 0 0
At STD N 00E0FFFF
Ne 0 ""
Po 500 2500
$EndPAD
$PAD
Sh "4" C 669 669 0 0 0
Dr 394 0 0
At STD N 00E0FFFF
Ne 0 ""
Po 1500 3500
$EndPAD
$PAD
Sh "5" C 669 669 0 0 0
Dr 394 0 0
At STD N 00E0FFFF
Ne 0 ""
Po 1500 2500
$EndPAD
$PAD
Sh "6" C 669 669 0 0 0
Dr 394 0 0
At STD N 00E0FFFF
Ne 0 ""
Po 2500 3500
$EndPAD
$PAD
Sh "7" C 669 669 0 0 0
Dr 394 0 0
At STD N 00E0FFFF
Ne 0 ""
Po 3500 2500
$EndPAD
$PAD
Sh "8" C 669 669 0 0 0
Dr 394 0 0
At STD N 00E0FFFF
Ne 0 ""
Po 2500 2500
$EndPAD
$PAD
Sh "9" C 669 669 0 0 0
Dr 394 0 0
At STD N 00E0FFFF
Ne 0 ""
Po 3500 1500
$EndPAD
$PAD
Sh "10" C 669 669 0 0 0
Dr 394 0 0
At STD N 00E0FFFF
Ne 0 ""
Po 2500 1500
$EndPAD
$PAD
Sh "11" C 669 669 0 0 0
Dr 394 0 0
At STD N 00E0FFFF
Ne 0 ""
Po 3500 500
$EndPAD
$PAD
Sh "12" C 669 669 0 0 0
Dr 394 0 0
At STD N 00E0FFFF
Ne 0 ""
Po 2500 500
$EndPAD
$PAD
Sh "13" C 669 669 0 0 0
Dr 394 0 0
At STD N 00E0FFFF
Ne 0 ""
Po 3500 -500
$EndPAD
$PAD
Sh "14" C 669 669 0 0 0
Dr 394 0 0
At STD N 00E0FFFF
Ne 0 ""
Po 2500 -500
$EndPAD
$PAD
Sh "15" C 669 669 0 0 0
Dr 394 0 0
At STD N 00E0FFFF
Ne 0 ""
Po 3500 -1500
$EndPAD
$PAD
Sh "16" C 669 669 0 0 0
Dr 394 0 0
At STD N 00E0FFFF
Ne 0 ""
Po 2500 -1500
$EndPAD
$PAD
Sh "17" C 669 669 0 0 0
Dr 394 0 0
At STD N 00E0FFFF
Ne 0 ""
Po 3500 -2500
$EndPAD
$PAD
Sh "18" C 669 669 0 0 0
Dr 394 0 0
At STD N 00E0FFFF
Ne 0 ""
Po 2500 -3500
$EndPAD
$PAD
Sh "19" C 669 669 0 0 0
Dr 394 0 0
At STD N 00E0FFFF
Ne 0 ""
Po 2500 -2500
$EndPAD
$PAD
Sh "20" C 669 669 0 0 0
Dr 394 0 0
At STD N 00E0FFFF
Ne 0 ""
Po 1500 -3500
$EndPAD
$PAD
Sh "21" C 669 669 0 0 0
Dr 394 0 0
At STD N 00E0FFFF
Ne 0 ""
Po 1500 -2500
$EndPAD
$PAD
Sh "22" C 669 669 0 0 0
Dr 394 0 0
At STD N 00E0FFFF
Ne 0 ""
Po 500 -3500
$EndPAD
$PAD
Sh "23" C 669 669 0 0 0
Dr 394 0 0
At STD N 00E0FFFF
Ne 0 ""
Po 500 -2500
$EndPAD
$PAD
Sh "24" C 669 669 0 0 0
Dr 394 0 0
At STD N 00E0FFFF
Ne 0 ""
Po -500 -3500
$EndPAD
$PAD
Sh "25" C 669 669 0 0 0
Dr 394 0 0
At STD N 00E0FFFF
Ne 0 ""
Po -500 -2500
$EndPAD
$PAD
Sh "26" C 669 669 0 0 0
Dr 394 0 0
At STD N 00E0FFFF
Ne 0 ""
Po -1500 -3500
$EndPAD
$PAD
Sh "27" C 669 669 0 0 0
Dr 394 0 0
At STD N 00E0FFFF
Ne 0 ""
Po -1500 -2500
$EndPAD
$PAD
Sh "32" C 669 669 0 0 0
Dr 394 0 0
At STD N 00E0FFFF
Ne 0 ""
Po -2500 -1500
$EndPAD
$PAD
Sh "28" C 669 669 0 0 0
Dr 394 0 0
At STD N 00E0FFFF
Ne 0 ""
Po -2500 -3500
$EndPAD
$PAD
Sh "29" C 669 669 0 0 0
Dr 394 0 0
At STD N 00E0FFFF
Ne 0 ""
Po -3500 -2500
$EndPAD
$PAD
Sh "30" C 669 669 0 0 0
Dr 394 0 0
At STD N 00E0FFFF
Ne 0 ""
Po -2500 -2500
$EndPAD
$PAD
Sh "31" C 669 669 0 0 0
Dr 394 0 0
At STD N 00E0FFFF
Ne 0 ""
Po -3500 -1500
$EndPAD
$PAD
Sh "33" C 669 669 0 0 0
Dr 394 0 0
At STD N 00E0FFFF
Ne 0 ""
Po -3500 -500
$EndPAD
$PAD
Sh "34" C 669 669 0 0 0
Dr 394 0 0
At STD N 00E0FFFF
Ne 0 ""
Po -2500 -500
$EndPAD
$PAD
Sh "35" C 669 669 0 0 0
Dr 394 0 0
At STD N 00E0FFFF
Ne 0 ""
Po -3500 500
$EndPAD
$PAD
Sh "36" C 669 669 0 0 0
Dr 394 0 0
At STD N 00E0FFFF
Ne 0 ""
Po -2500 500
$EndPAD
$PAD
Sh "37" C 669 669 0 0 0
Dr 394 0 0
At STD N 00E0FFFF
Ne 0 ""
Po -3500 1500
$EndPAD
$PAD
Sh "38" C 669 669 0 0 0
Dr 394 0 0
At STD N 00E0FFFF
Ne 0 ""
Po -2500 1500
$EndPAD
$PAD
Sh "39" C 669 669 0 0 0
Dr 394 0 0
At STD N 00E0FFFF
Ne 0 ""
Po -3500 2500
$EndPAD
$PAD
Sh "40" C 669 669 0 0 0
Dr 394 0 0
At STD N 00E0FFFF
Ne 0 ""
Po -2500 3500
$EndPAD
$PAD
Sh "41" C 669 669 0 0 0
Dr 394 0 0
At STD N 00E0FFFF
Ne 0 ""
Po -2500 2500
$EndPAD
$PAD
Sh "42" C 669 669 0 0 0
Dr 394 0 0
At STD N 00E0FFFF
Ne 0 ""
Po -1500 3500
$EndPAD
$PAD
Sh "43" C 669 669 0 0 0
Dr 394 0 0
At STD N 00E0FFFF
Ne 0 ""
Po -1500 2500
$EndPAD
$PAD
Sh "44" C 669 669 0 0 0
Dr 394 0 0
At STD N 00E0FFFF
Ne 0 ""
Po -500 3500
$EndPAD
$SHAPE3D
Na "walter\pth_plcc\plcc44_pth-skt.wrl"
Sc 1.000000 1.000000 1.000000
Of 0.000000 0.000000 0.000000
Ro 0.000000 0.000000 0.000000
$EndSHAPE3D
$EndMODULE  plcc44_pth-skt
$MODULE plcc52_pth-skt
Po 0 0 0 15 4E498F62 00000000 ~~
Li plcc52_pth-skt
Sc 00000000
AR
Op 0 0 0
T0 0 -5748 600 600 0 120 N V 21 N"plcc52_pth-skt"
T1 0 5748 600 600 0 120 N V 21 N"VAL**"
DS 3819 -3386 3819 3346 100 21
DS -3819 -3819 3386 -3819 100 21
DS -3386 3819 3346 3819 100 21
DS -3819 -3819 -3819 3386 100 21
DS 3346 3819 3819 3346 100 21
DS -5079 -5079 -5079 5079 100 21
DS -5079 5079 4370 5079 100 21
DS 4370 5079 5079 4370 100 21
DS 5079 4370 5079 -5079 100 21
DS 5079 -5079 -5079 -5079 100 21
DS 3387 -3818 4213 -4644 100 21
DS 4212 -4644 4645 -4211 100 21
DS 4646 -4213 3820 -3387 100 21
DS -3819 3385 -4645 4211 100 21
DS -4646 4213 -4213 4646 100 21
DS -4212 4644 -3386 3818 100 21
$PAD
Sh "2" C 669 669 0 0 0
Dr 394 0 0
At STD N 00E0FFFF
Ne 0 ""
Po 0 3000
$EndPAD
$PAD
Sh "1" C 669 669 0 0 0
Dr 394 0 0
At STD N 00E0FFFF
Ne 0 ""
Po 0 4000
$EndPAD
$PAD
Sh "3" C 669 669 0 0 0
Dr 394 0 0
At STD N 00E0FFFF
Ne 0 ""
Po 1000 4000
$EndPAD
$PAD
Sh "4" C 669 669 0 0 0
Dr 394 0 0
At STD N 00E0FFFF
Ne 0 ""
Po 1000 3000
$EndPAD
$PAD
Sh "5" C 669 669 0 0 0
Dr 394 0 0
At STD N 00E0FFFF
Ne 0 ""
Po 2000 4000
$EndPAD
$PAD
Sh "6" C 669 669 0 0 0
Dr 394 0 0
At STD N 00E0FFFF
Ne 0 ""
Po 2000 3000
$EndPAD
$PAD
Sh "7" C 669 669 0 0 0
Dr 394 0 0
At STD N 00E0FFFF
Ne 0 ""
Po 3000 4000
$EndPAD
$PAD
Sh "8" C 669 669 0 0 0
Dr 394 0 0
At STD N 00E0FFFF
Ne 0 ""
Po 4000 3000
$EndPAD
$PAD
Sh "9" C 669 669 0 0 0
Dr 394 0 0
At STD N 00E0FFFF
Ne 0 ""
Po 3000 3000
$EndPAD
$PAD
Sh "10" C 669 669 0 0 0
Dr 394 0 0
At STD N 00E0FFFF
Ne 0 ""
Po 4000 2000
$EndPAD
$PAD
Sh "11" C 669 669 0 0 0
Dr 394 0 0
At STD N 00E0FFFF
Ne 0 ""
Po 3000 2000
$EndPAD
$PAD
Sh "12" C 669 669 0 0 0
Dr 394 0 0
At STD N 00E0FFFF
Ne 0 ""
Po 4000 1000
$EndPAD
$PAD
Sh "13" C 669 669 0 0 0
Dr 394 0 0
At STD N 00E0FFFF
Ne 0 ""
Po 3000 1000
$EndPAD
$PAD
Sh "14" C 669 669 0 0 0
Dr 394 0 0
At STD N 00E0FFFF
Ne 0 ""
Po 4000 0
$EndPAD
$PAD
Sh "15" C 669 669 0 0 0
Dr 394 0 0
At STD N 00E0FFFF
Ne 0 ""
Po 3000 0
$EndPAD
$PAD
Sh "16" C 669 669 0 0 0
Dr 394 0 0
At STD N 00E0FFFF
Ne 0 ""
Po 4000 -1000
$EndPAD
$PAD
Sh "17" C 669 669 0 0 0
Dr 394 0 0
At STD N 00E0FFFF
Ne 0 ""
Po 3000 -1000
$EndPAD
$PAD
Sh "18" C 669 669 0 0 0
Dr 394 0 0
At STD N 00E0FFFF
Ne 0 ""
Po 4000 -2000
$EndPAD
$PAD
Sh "19" C 669 669 0 0 0
Dr 394 0 0
At STD N 00E0FFFF
Ne 0 ""
Po 3000 -2000
$EndPAD
$PAD
Sh "20" C 669 669 0 0 0
Dr 394 0 0
At STD N 00E0FFFF
Ne 0 ""
Po 4000 -3000
$EndPAD
$PAD
Sh "21" C 669 669 0 0 0
Dr 394 0 0
At STD N 00E0FFFF
Ne 0 ""
Po 3000 -4000
$EndPAD
$PAD
Sh "22" C 669 669 0 0 0
Dr 394 0 0
At STD N 00E0FFFF
Ne 0 ""
Po 3000 -3000
$EndPAD
$PAD
Sh "23" C 669 669 0 0 0
Dr 394 0 0
At STD N 00E0FFFF
Ne 0 ""
Po 2000 -4000
$EndPAD
$PAD
Sh "24" C 669 669 0 0 0
Dr 394 0 0
At STD N 00E0FFFF
Ne 0 ""
Po 2000 -3000
$EndPAD
$PAD
Sh "25" C 669 669 0 0 0
Dr 394 0 0
At STD N 00E0FFFF
Ne 0 ""
Po 1000 -4000
$EndPAD
$PAD
Sh "26" C 669 669 0 0 0
Dr 394 0 0
At STD N 00E0FFFF
Ne 0 ""
Po 1000 -3000
$EndPAD
$PAD
Sh "27" C 669 669 0 0 0
Dr 394 0 0
At STD N 00E0FFFF
Ne 0 ""
Po 0 -4000
$EndPAD
$PAD
Sh "32" C 669 669 0 0 0
Dr 394 0 0
At STD N 00E0FFFF
Ne 0 ""
Po -2000 -3000
$EndPAD
$PAD
Sh "28" C 669 669 0 0 0
Dr 394 0 0
At STD N 00E0FFFF
Ne 0 ""
Po 0 -3000
$EndPAD
$PAD
Sh "29" C 669 669 0 0 0
Dr 394 0 0
At STD N 00E0FFFF
Ne 0 ""
Po -1000 -4000
$EndPAD
$PAD
Sh "30" C 669 669 0 0 0
Dr 394 0 0
At STD N 00E0FFFF
Ne 0 ""
Po -1000 -3000
$EndPAD
$PAD
Sh "31" C 669 669 0 0 0
Dr 394 0 0
At STD N 00E0FFFF
Ne 0 ""
Po -2000 -4000
$EndPAD
$PAD
Sh "33" C 669 669 0 0 0
Dr 394 0 0
At STD N 00E0FFFF
Ne 0 ""
Po -3000 -4000
$EndPAD
$PAD
Sh "34" C 669 669 0 0 0
Dr 394 0 0
At STD N 00E0FFFF
Ne 0 ""
Po -4000 -3000
$EndPAD
$PAD
Sh "35" C 669 669 0 0 0
Dr 394 0 0
At STD N 00E0FFFF
Ne 0 ""
Po -3000 -3000
$EndPAD
$PAD
Sh "36" C 669 669 0 0 0
Dr 394 0 0
At STD N 00E0FFFF
Ne 0 ""
Po -4000 -2000
$EndPAD
$PAD
Sh "37" C 669 669 0 0 0
Dr 394 0 0
At STD N 00E0FFFF
Ne 0 ""
Po -3000 -2000
$EndPAD
$PAD
Sh "38" C 669 669 0 0 0
Dr 394 0 0
At STD N 00E0FFFF
Ne 0 ""
Po -4000 -1000
$EndPAD
$PAD
Sh "39" C 669 669 0 0 0
Dr 394 0 0
At STD N 00E0FFFF
Ne 0 ""
Po -3000 -1000
$EndPAD
$PAD
Sh "40" C 669 669 0 0 0
Dr 394 0 0
At STD N 00E0FFFF
Ne 0 ""
Po -4000 0
$EndPAD
$PAD
Sh "41" C 669 669 0 0 0
Dr 394 0 0
At STD N 00E0FFFF
Ne 0 ""
Po -3000 0
$EndPAD
$PAD
Sh "42" C 669 669 0 0 0
Dr 394 0 0
At STD N 00E0FFFF
Ne 0 ""
Po -4000 1000
$EndPAD
$PAD
Sh "43" C 669 669 0 0 0
Dr 394 0 0
At STD N 00E0FFFF
Ne 0 ""
Po -3000 1000
$EndPAD
$PAD
Sh "44" C 669 669 0 0 0
Dr 394 0 0
At STD N 00E0FFFF
Ne 0 ""
Po -4000 2000
$EndPAD
$PAD
Sh "45" C 669 669 0 0 0
Dr 394 0 0
At STD N 00E0FFFF
Ne 0 ""
Po -3000 2000
$EndPAD
$PAD
Sh "46" C 669 669 0 0 0
Dr 394 0 0
At STD N 00E0FFFF
Ne 0 ""
Po -4000 3000
$EndPAD
$PAD
Sh "47" C 669 669 0 0 0
Dr 394 0 0
At STD N 00E0FFFF
Ne 0 ""
Po -3000 4000
$EndPAD
$PAD
Sh "48" C 669 669 0 0 0
Dr 394 0 0
At STD N 00E0FFFF
Ne 0 ""
Po -3000 3000
$EndPAD
$PAD
Sh "49" C 669 669 0 0 0
Dr 394 0 0
At STD N 00E0FFFF
Ne 0 ""
Po -2000 4000
$EndPAD
$PAD
Sh "50" C 669 669 0 0 0
Dr 394 0 0
At STD N 00E0FFFF
Ne 0 ""
Po -2000 3000
$EndPAD
$PAD
Sh "51" C 669 669 0 0 0
Dr 394 0 0
At STD N 00E0FFFF
Ne 0 ""
Po -1000 4000
$EndPAD
$PAD
Sh "52" C 669 669 0 0 0
Dr 394 0 0
At STD N 00E0FFFF
Ne 0 ""
Po -1000 3000
$EndPAD
$SHAPE3D
Na "walter\pth_plcc\plcc52_pth-skt.wrl"
Sc 1.000000 1.000000 1.000000
Of 0.000000 0.000000 0.000000
Ro 0.000000 0.000000 0.000000
$EndSHAPE3D
$EndMODULE  plcc52_pth-skt
$MODULE plcc68_pth-skt
Po 0 0 0 15 4E49917D 00000000 ~~
Li plcc68_pth-skt
Sc 00000000
AR
Op 0 0 0
T0 0 -6693 600 600 0 120 N V 21 N"plcc68_pth-skt"
T1 0 6693 600 600 0 120 N V 21 N"VAL**"
DS -4803 4370 -4803 -4803 100 21
DS -4803 -4803 4370 -4803 100 21
DS 4213 4803 -4370 4803 100 21
DS 4803 -4370 4803 4213 100 21
DS 4803 4213 4213 4803 100 21
DS -6063 -6063 -6063 6063 100 21
DS -6063 6063 5472 6063 100 21
DS 5472 6063 6063 5472 100 21
DS 6063 5472 6063 -6063 100 21
DS 6063 -6063 -6063 -6063 100 21
DS 4370 -4802 5196 -5628 100 21
DS 5196 -5628 5629 -5195 100 21
DS 5630 -5197 4804 -4371 100 21
DS -4803 4370 -5629 5196 100 21
DS -5631 5197 -5198 5630 100 21
DS -5195 5627 -4369 4801 100 21
$PAD
Sh "2" C 669 669 0 0 0
Dr 394 0 0
At STD N 00E0FFFF
Ne 0 ""
Po 0 4000
$EndPAD
$PAD
Sh "1" C 669 669 0 0 0
Dr 394 0 0
At STD N 00E0FFFF
Ne 0 ""
Po 0 5000
$EndPAD
$PAD
Sh "3" C 669 669 0 0 0
Dr 394 0 0
At STD N 00E0FFFF
Ne 0 ""
Po 1000 5000
$EndPAD
$PAD
Sh "4" C 669 669 0 0 0
Dr 394 0 0
At STD N 00E0FFFF
Ne 0 ""
Po 1000 4000
$EndPAD
$PAD
Sh "5" C 669 669 0 0 0
Dr 394 0 0
At STD N 00E0FFFF
Ne 0 ""
Po 2000 5000
$EndPAD
$PAD
Sh "6" C 669 669 0 0 0
Dr 394 0 0
At STD N 00E0FFFF
Ne 0 ""
Po 2000 4000
$EndPAD
$PAD
Sh "7" C 669 669 0 0 0
Dr 394 0 0
At STD N 00E0FFFF
Ne 0 ""
Po 3000 5000
$EndPAD
$PAD
Sh "8" C 669 669 0 0 0
Dr 394 0 0
At STD N 00E0FFFF
Ne 0 ""
Po 3000 4000
$EndPAD
$PAD
Sh "9" C 669 669 0 0 0
Dr 394 0 0
At STD N 00E0FFFF
Ne 0 ""
Po 4000 5000
$EndPAD
$PAD
Sh "10" C 669 669 0 0 0
Dr 394 0 0
At STD N 00E0FFFF
Ne 0 ""
Po 5000 4000
$EndPAD
$PAD
Sh "11" C 669 669 0 0 0
Dr 394 0 0
At STD N 00E0FFFF
Ne 0 ""
Po 4000 4000
$EndPAD
$PAD
Sh "12" C 669 669 0 0 0
Dr 394 0 0
At STD N 00E0FFFF
Ne 0 ""
Po 5000 3000
$EndPAD
$PAD
Sh "13" C 669 669 0 0 0
Dr 394 0 0
At STD N 00E0FFFF
Ne 0 ""
Po 4000 3000
$EndPAD
$PAD
Sh "14" C 669 669 0 0 0
Dr 394 0 0
At STD N 00E0FFFF
Ne 0 ""
Po 5000 2000
$EndPAD
$PAD
Sh "15" C 669 669 0 0 0
Dr 394 0 0
At STD N 00E0FFFF
Ne 0 ""
Po 4000 2000
$EndPAD
$PAD
Sh "16" C 669 669 0 0 0
Dr 394 0 0
At STD N 00E0FFFF
Ne 0 ""
Po 5000 1000
$EndPAD
$PAD
Sh "17" C 669 669 0 0 0
Dr 394 0 0
At STD N 00E0FFFF
Ne 0 ""
Po 4000 1000
$EndPAD
$PAD
Sh "18" C 669 669 0 0 0
Dr 394 0 0
At STD N 00E0FFFF
Ne 0 ""
Po 5000 0
$EndPAD
$PAD
Sh "19" C 669 669 0 0 0
Dr 394 0 0
At STD N 00E0FFFF
Ne 0 ""
Po 4000 0
$EndPAD
$PAD
Sh "20" C 669 669 0 0 0
Dr 394 0 0
At STD N 00E0FFFF
Ne 0 ""
Po 5000 -1000
$EndPAD
$PAD
Sh "21" C 669 669 0 0 0
Dr 394 0 0
At STD N 00E0FFFF
Ne 0 ""
Po 4000 -1000
$EndPAD
$PAD
Sh "22" C 669 669 0 0 0
Dr 394 0 0
At STD N 00E0FFFF
Ne 0 ""
Po 5000 -2000
$EndPAD
$PAD
Sh "23" C 669 669 0 0 0
Dr 394 0 0
At STD N 00E0FFFF
Ne 0 ""
Po 4000 -2000
$EndPAD
$PAD
Sh "24" C 669 669 0 0 0
Dr 394 0 0
At STD N 00E0FFFF
Ne 0 ""
Po 5000 -3000
$EndPAD
$PAD
Sh "25" C 669 669 0 0 0
Dr 394 0 0
At STD N 00E0FFFF
Ne 0 ""
Po 4000 -3000
$EndPAD
$PAD
Sh "26" C 669 669 0 0 0
Dr 394 0 0
At STD N 00E0FFFF
Ne 0 ""
Po 5000 -4000
$EndPAD
$PAD
Sh "27" C 669 669 0 0 0
Dr 394 0 0
At STD N 00E0FFFF
Ne 0 ""
Po 4000 -5000
$EndPAD
$PAD
Sh "32" C 669 669 0 0 0
Dr 394 0 0
At STD N 00E0FFFF
Ne 0 ""
Po 2000 -4000
$EndPAD
$PAD
Sh "28" C 669 669 0 0 0
Dr 394 0 0
At STD N 00E0FFFF
Ne 0 ""
Po 4000 -4000
$EndPAD
$PAD
Sh "29" C 669 669 0 0 0
Dr 394 0 0
At STD N 00E0FFFF
Ne 0 ""
Po 3000 -5000
$EndPAD
$PAD
Sh "30" C 669 669 0 0 0
Dr 394 0 0
At STD N 00E0FFFF
Ne 0 ""
Po 3000 -4000
$EndPAD
$PAD
Sh "31" C 669 669 0 0 0
Dr 394 0 0
At STD N 00E0FFFF
Ne 0 ""
Po 2000 -5000
$EndPAD
$PAD
Sh "33" C 669 669 0 0 0
Dr 394 0 0
At STD N 00E0FFFF
Ne 0 ""
Po 1000 -5000
$EndPAD
$PAD
Sh "34" C 669 669 0 0 0
Dr 394 0 0
At STD N 00E0FFFF
Ne 0 ""
Po 1000 -4000
$EndPAD
$PAD
Sh "35" C 669 669 0 0 0
Dr 394 0 0
At STD N 00E0FFFF
Ne 0 ""
Po 0 -5000
$EndPAD
$PAD
Sh "36" C 669 669 0 0 0
Dr 394 0 0
At STD N 00E0FFFF
Ne 0 ""
Po 0 -4000
$EndPAD
$PAD
Sh "37" C 669 669 0 0 0
Dr 394 0 0
At STD N 00E0FFFF
Ne 0 ""
Po -1000 -5000
$EndPAD
$PAD
Sh "38" C 669 669 0 0 0
Dr 394 0 0
At STD N 00E0FFFF
Ne 0 ""
Po -1000 -4000
$EndPAD
$PAD
Sh "39" C 669 669 0 0 0
Dr 394 0 0
At STD N 00E0FFFF
Ne 0 ""
Po -2000 -5000
$EndPAD
$PAD
Sh "40" C 669 669 0 0 0
Dr 394 0 0
At STD N 00E0FFFF
Ne 0 ""
Po -2000 -4000
$EndPAD
$PAD
Sh "41" C 669 669 0 0 0
Dr 394 0 0
At STD N 00E0FFFF
Ne 0 ""
Po -3000 -5000
$EndPAD
$PAD
Sh "42" C 669 669 0 0 0
Dr 394 0 0
At STD N 00E0FFFF
Ne 0 ""
Po -3000 -4000
$EndPAD
$PAD
Sh "43" C 669 669 0 0 0
Dr 394 0 0
At STD N 00E0FFFF
Ne 0 ""
Po -4000 -5000
$EndPAD
$PAD
Sh "44" C 669 669 0 0 0
Dr 394 0 0
At STD N 00E0FFFF
Ne 0 ""
Po -5000 -4000
$EndPAD
$PAD
Sh "45" C 669 669 0 0 0
Dr 394 0 0
At STD N 00E0FFFF
Ne 0 ""
Po -4000 -4000
$EndPAD
$PAD
Sh "46" C 669 669 0 0 0
Dr 394 0 0
At STD N 00E0FFFF
Ne 0 ""
Po -5000 -3000
$EndPAD
$PAD
Sh "47" C 669 669 0 0 0
Dr 394 0 0
At STD N 00E0FFFF
Ne 0 ""
Po -4000 -3000
$EndPAD
$PAD
Sh "48" C 669 669 0 0 0
Dr 394 0 0
At STD N 00E0FFFF
Ne 0 ""
Po -5000 -2000
$EndPAD
$PAD
Sh "49" C 669 669 0 0 0
Dr 394 0 0
At STD N 00E0FFFF
Ne 0 ""
Po -4000 -2000
$EndPAD
$PAD
Sh "50" C 669 669 0 0 0
Dr 394 0 0
At STD N 00E0FFFF
Ne 0 ""
Po -5000 -1000
$EndPAD
$PAD
Sh "51" C 669 669 0 0 0
Dr 394 0 0
At STD N 00E0FFFF
Ne 0 ""
Po -4000 -1000
$EndPAD
$PAD
Sh "52" C 669 669 0 0 0
Dr 394 0 0
At STD N 00E0FFFF
Ne 0 ""
Po -5000 0
$EndPAD
$PAD
Sh "53" C 669 669 0 0 0
Dr 394 0 0
At STD N 00E0FFFF
Ne 0 ""
Po -4000 0
$EndPAD
$PAD
Sh "54" C 669 669 0 0 0
Dr 394 0 0
At STD N 00E0FFFF
Ne 0 ""
Po -5000 1000
$EndPAD
$PAD
Sh "55" C 669 669 0 0 0
Dr 394 0 0
At STD N 00E0FFFF
Ne 0 ""
Po -4000 1000
$EndPAD
$PAD
Sh "56" C 669 669 0 0 0
Dr 394 0 0
At STD N 00E0FFFF
Ne 0 ""
Po -5000 2000
$EndPAD
$PAD
Sh "57" C 669 669 0 0 0
Dr 394 0 0
At STD N 00E0FFFF
Ne 0 ""
Po -4000 2000
$EndPAD
$PAD
Sh "58" C 669 669 0 0 0
Dr 394 0 0
At STD N 00E0FFFF
Ne 0 ""
Po -5000 3000
$EndPAD
$PAD
Sh "59" C 669 669 0 0 0
Dr 394 0 0
At STD N 00E0FFFF
Ne 0 ""
Po -4000 3000
$EndPAD
$PAD
Sh "60" C 669 669 0 0 0
Dr 394 0 0
At STD N 00E0FFFF
Ne 0 ""
Po -5000 4000
$EndPAD
$PAD
Sh "61" C 669 669 0 0 0
Dr 394 0 0
At STD N 00E0FFFF
Ne 0 ""
Po -4000 5000
$EndPAD
$PAD
Sh "62" C 669 669 0 0 0
Dr 394 0 0
At STD N 00E0FFFF
Ne 0 ""
Po -4000 4000
$EndPAD
$PAD
Sh "63" C 669 669 0 0 0
Dr 394 0 0
At STD N 00E0FFFF
Ne 0 ""
Po -3000 5000
$EndPAD
$PAD
Sh "64" C 669 669 0 0 0
Dr 394 0 0
At STD N 00E0FFFF
Ne 0 ""
Po -3000 4000
$EndPAD
$PAD
Sh "65" C 669 669 0 0 0
Dr 394 0 0
At STD N 00E0FFFF
Ne 0 ""
Po -2000 5000
$EndPAD
$PAD
Sh "66" C 669 669 0 0 0
Dr 394 0 0
At STD N 00E0FFFF
Ne 0 ""
Po -2000 4000
$EndPAD
$PAD
Sh "67" C 669 669 0 0 0
Dr 394 0 0
At STD N 00E0FFFF
Ne 0 ""
Po -1000 5000
$EndPAD
$PAD
Sh "68" C 669 669 0 0 0
Dr 394 0 0
At STD N 00E0FFFF
Ne 0 ""
Po -1000 4000
$EndPAD
$SHAPE3D
Na "walter\pth_plcc\plcc68_pth-skt.wrl"
Sc 1.000000 1.000000 1.000000
Of 0.000000 0.000000 0.000000
Ro 0.000000 0.000000 0.000000
$EndSHAPE3D
$EndMODULE  plcc68_pth-skt
$MODULE plcc84_pth-skt
Po 0 0 0 15 4E49934C 00000000 ~~
Li plcc84_pth-skt
Sc 00000000
AR 
Op 0 0 0
T0 0 -7717 600 600 0 120 N V 21 N"plcc84_pth-skt"
T1 0 7717 600 600 0 120 N V 21 N"VAL**"
DS -5787 5354 -5787 -5787 100 21
DS 5787 -5354 5787 5197 100 21
DS 5787 5197 5197 5787 100 21
DS 5197 5787 -5354 5787 100 21
DS -5787 -5787 5354 -5787 100 21
DS -7087 -7087 -7087 7087 100 21
DS -7087 7087 6378 7087 100 21
DS 6378 7087 7087 6378 100 21
DS 7087 6378 7087 -7087 100 21
DS 7087 -7087 -7087 -7087 100 21
DS 5354 -5787 6180 -6613 100 21
DS 6180 -6613 6613 -6180 100 21
DS 6614 -6181 5788 -5355 100 21
DS -5787 5354 -6613 6180 100 21
DS -6615 6181 -6182 6614 100 21
DS -6179 6611 -5353 5785 100 21
$PAD
Sh "2" C 669 669 0 0 0
Dr 394 0 0
At STD N 00E0FFFF
Ne 0 ""
Po 0 5000
$EndPAD
$PAD
Sh "1" C 669 669 0 0 0
Dr 394 0 0
At STD N 00E0FFFF
Ne 0 ""
Po 0 6000
$EndPAD
$PAD
Sh "3" C 669 669 0 0 0
Dr 394 0 0
At STD N 00E0FFFF
Ne 0 ""
Po 1000 6000
$EndPAD
$PAD
Sh "4" C 669 669 0 0 0
Dr 394 0 0
At STD N 00E0FFFF
Ne 0 ""
Po 1000 5000
$EndPAD
$PAD
Sh "5" C 669 669 0 0 0
Dr 394 0 0
At STD N 00E0FFFF
Ne 0 ""
Po 2000 6000
$EndPAD
$PAD
Sh "6" C 669 669 0 0 0
Dr 394 0 0
At STD N 00E0FFFF
Ne 0 ""
Po 2000 5000
$EndPAD
$PAD
Sh "7" C 669 669 0 0 0
Dr 394 0 0
At STD N 00E0FFFF
Ne 0 ""
Po 3000 6000
$EndPAD
$PAD
Sh "8" C 669 669 0 0 0
Dr 394 0 0
At STD N 00E0FFFF
Ne 0 ""
Po 3000 5000
$EndPAD
$PAD
Sh "9" C 669 669 0 0 0
Dr 394 0 0
At STD N 00E0FFFF
Ne 0 ""
Po 4000 6000
$EndPAD
$PAD
Sh "10" C 669 669 0 0 0
Dr 394 0 0
At STD N 00E0FFFF
Ne 0 ""
Po 4000 5000
$EndPAD
$PAD
Sh "11" C 669 669 0 0 0
Dr 394 0 0
At STD N 00E0FFFF
Ne 0 ""
Po 5000 6000
$EndPAD
$PAD
Sh "12" C 669 669 0 0 0
Dr 394 0 0
At STD N 00E0FFFF
Ne 0 ""
Po 6000 5000
$EndPAD
$PAD
Sh "13" C 669 669 0 0 0
Dr 394 0 0
At STD N 00E0FFFF
Ne 0 ""
Po 5000 5000
$EndPAD
$PAD
Sh "14" C 669 669 0 0 0
Dr 394 0 0
At STD N 00E0FFFF
Ne 0 ""
Po 6000 4000
$EndPAD
$PAD
Sh "15" C 669 669 0 0 0
Dr 394 0 0
At STD N 00E0FFFF
Ne 0 ""
Po 5000 4000
$EndPAD
$PAD
Sh "16" C 669 669 0 0 0
Dr 394 0 0
At STD N 00E0FFFF
Ne 0 ""
Po 6000 3000
$EndPAD
$PAD
Sh "17" C 669 669 0 0 0
Dr 394 0 0
At STD N 00E0FFFF
Ne 0 ""
Po 5000 3000
$EndPAD
$PAD
Sh "18" C 669 669 0 0 0
Dr 394 0 0
At STD N 00E0FFFF
Ne 0 ""
Po 6000 2000
$EndPAD
$PAD
Sh "19" C 669 669 0 0 0
Dr 394 0 0
At STD N 00E0FFFF
Ne 0 ""
Po 5000 2000
$EndPAD
$PAD
Sh "20" C 669 669 0 0 0
Dr 394 0 0
At STD N 00E0FFFF
Ne 0 ""
Po 6000 1000
$EndPAD
$PAD
Sh "21" C 669 669 0 0 0
Dr 394 0 0
At STD N 00E0FFFF
Ne 0 ""
Po 5000 1000
$EndPAD
$PAD
Sh "22" C 669 669 0 0 0
Dr 394 0 0
At STD N 00E0FFFF
Ne 0 ""
Po 6000 0
$EndPAD
$PAD
Sh "23" C 669 669 0 0 0
Dr 394 0 0
At STD N 00E0FFFF
Ne 0 ""
Po 5000 0
$EndPAD
$PAD
Sh "24" C 669 669 0 0 0
Dr 394 0 0
At STD N 00E0FFFF
Ne 0 ""
Po 6000 -1000
$EndPAD
$PAD
Sh "25" C 669 669 0 0 0
Dr 394 0 0
At STD N 00E0FFFF
Ne 0 ""
Po 5000 -1000
$EndPAD
$PAD
Sh "26" C 669 669 0 0 0
Dr 394 0 0
At STD N 00E0FFFF
Ne 0 ""
Po 6000 -2000
$EndPAD
$PAD
Sh "27" C 669 669 0 0 0
Dr 394 0 0
At STD N 00E0FFFF
Ne 0 ""
Po 5000 -2000
$EndPAD
$PAD
Sh "32" C 669 669 0 0 0
Dr 394 0 0
At STD N 00E0FFFF
Ne 0 ""
Po 6000 -5000
$EndPAD
$PAD
Sh "28" C 669 669 0 0 0
Dr 394 0 0
At STD N 00E0FFFF
Ne 0 ""
Po 6000 -3000
$EndPAD
$PAD
Sh "29" C 669 669 0 0 0
Dr 394 0 0
At STD N 00E0FFFF
Ne 0 ""
Po 5000 -3000
$EndPAD
$PAD
Sh "30" C 669 669 0 0 0
Dr 394 0 0
At STD N 00E0FFFF
Ne 0 ""
Po 6000 -4000
$EndPAD
$PAD
Sh "31" C 669 669 0 0 0
Dr 394 0 0
At STD N 00E0FFFF
Ne 0 ""
Po 5000 -4000
$EndPAD
$PAD
Sh "33" C 669 669 0 0 0
Dr 394 0 0
At STD N 00E0FFFF
Ne 0 ""
Po 5000 -6000
$EndPAD
$PAD
Sh "34" C 669 669 0 0 0
Dr 394 0 0
At STD N 00E0FFFF
Ne 0 ""
Po 5000 -5000
$EndPAD
$PAD
Sh "35" C 669 669 0 0 0
Dr 394 0 0
At STD N 00E0FFFF
Ne 0 ""
Po 4000 -6000
$EndPAD
$PAD
Sh "36" C 669 669 0 0 0
Dr 394 0 0
At STD N 00E0FFFF
Ne 0 ""
Po 4000 -5000
$EndPAD
$PAD
Sh "37" C 669 669 0 0 0
Dr 394 0 0
At STD N 00E0FFFF
Ne 0 ""
Po 3000 -6000
$EndPAD
$PAD
Sh "38" C 669 669 0 0 0
Dr 394 0 0
At STD N 00E0FFFF
Ne 0 ""
Po 3000 -5000
$EndPAD
$PAD
Sh "39" C 669 669 0 0 0
Dr 394 0 0
At STD N 00E0FFFF
Ne 0 ""
Po 2000 -6000
$EndPAD
$PAD
Sh "40" C 669 669 0 0 0
Dr 394 0 0
At STD N 00E0FFFF
Ne 0 ""
Po 2000 -5000
$EndPAD
$PAD
Sh "41" C 669 669 0 0 0
Dr 394 0 0
At STD N 00E0FFFF
Ne 0 ""
Po 1000 -6000
$EndPAD
$PAD
Sh "42" C 669 669 0 0 0
Dr 394 0 0
At STD N 00E0FFFF
Ne 0 ""
Po 1000 -5000
$EndPAD
$PAD
Sh "43" C 669 669 0 0 0
Dr 394 0 0
At STD N 00E0FFFF
Ne 0 ""
Po 0 -6000
$EndPAD
$PAD
Sh "44" C 669 669 0 0 0
Dr 394 0 0
At STD N 00E0FFFF
Ne 0 ""
Po 0 -5000
$EndPAD
$PAD
Sh "45" C 669 669 0 0 0
Dr 394 0 0
At STD N 00E0FFFF
Ne 0 ""
Po -1000 -6000
$EndPAD
$PAD
Sh "46" C 669 669 0 0 0
Dr 394 0 0
At STD N 00E0FFFF
Ne 0 ""
Po -1000 -5000
$EndPAD
$PAD
Sh "47" C 669 669 0 0 0
Dr 394 0 0
At STD N 00E0FFFF
Ne 0 ""
Po -2000 -6000
$EndPAD
$PAD
Sh "48" C 669 669 0 0 0
Dr 394 0 0
At STD N 00E0FFFF
Ne 0 ""
Po -2000 -5000
$EndPAD
$PAD
Sh "49" C 669 669 0 0 0
Dr 394 0 0
At STD N 00E0FFFF
Ne 0 ""
Po -3000 -6000
$EndPAD
$PAD
Sh "50" C 669 669 0 0 0
Dr 394 0 0
At STD N 00E0FFFF
Ne 0 ""
Po -3000 -5000
$EndPAD
$PAD
Sh "51" C 669 669 0 0 0
Dr 394 0 0
At STD N 00E0FFFF
Ne 0 ""
Po -4000 -6000
$EndPAD
$PAD
Sh "52" C 669 669 0 0 0
Dr 394 0 0
At STD N 00E0FFFF
Ne 0 ""
Po -4000 -5000
$EndPAD
$PAD
Sh "53" C 669 669 0 0 0
Dr 394 0 0
At STD N 00E0FFFF
Ne 0 ""
Po -5000 -6000
$EndPAD
$PAD
Sh "54" C 669 669 0 0 0
Dr 394 0 0
At STD N 00E0FFFF
Ne 0 ""
Po -6000 -5000
$EndPAD
$PAD
Sh "55" C 669 669 0 0 0
Dr 394 0 0
At STD N 00E0FFFF
Ne 0 ""
Po -5000 -5000
$EndPAD
$PAD
Sh "56" C 669 669 0 0 0
Dr 394 0 0
At STD N 00E0FFFF
Ne 0 ""
Po -6000 -4000
$EndPAD
$PAD
Sh "57" C 669 669 0 0 0
Dr 394 0 0
At STD N 00E0FFFF
Ne 0 ""
Po -5000 -4000
$EndPAD
$PAD
Sh "58" C 669 669 0 0 0
Dr 394 0 0
At STD N 00E0FFFF
Ne 0 ""
Po -6000 -3000
$EndPAD
$PAD
Sh "59" C 669 669 0 0 0
Dr 394 0 0
At STD N 00E0FFFF
Ne 0 ""
Po -5000 -3000
$EndPAD
$PAD
Sh "60" C 669 669 0 0 0
Dr 394 0 0
At STD N 00E0FFFF
Ne 0 ""
Po -6000 -2000
$EndPAD
$PAD
Sh "61" C 669 669 0 0 0
Dr 394 0 0
At STD N 00E0FFFF
Ne 0 ""
Po -5000 -2000
$EndPAD
$PAD
Sh "62" C 669 669 0 0 0
Dr 394 0 0
At STD N 00E0FFFF
Ne 0 ""
Po -6000 -1000
$EndPAD
$PAD
Sh "63" C 669 669 0 0 0
Dr 394 0 0
At STD N 00E0FFFF
Ne 0 ""
Po -5000 -1000
$EndPAD
$PAD
Sh "64" C 669 669 0 0 0
Dr 394 0 0
At STD N 00E0FFFF
Ne 0 ""
Po -6000 0
$EndPAD
$PAD
Sh "65" C 669 669 0 0 0
Dr 394 0 0
At STD N 00E0FFFF
Ne 0 ""
Po -5000 0
$EndPAD
$PAD
Sh "66" C 669 669 0 0 0
Dr 394 0 0
At STD N 00E0FFFF
Ne 0 ""
Po -6000 1000
$EndPAD
$PAD
Sh "67" C 669 669 0 0 0
Dr 394 0 0
At STD N 00E0FFFF
Ne 0 ""
Po -5000 1000
$EndPAD
$PAD
Sh "68" C 669 669 0 0 0
Dr 394 0 0
At STD N 00E0FFFF
Ne 0 ""
Po -6000 2000
$EndPAD
$PAD
Sh "69" C 669 669 0 0 0
Dr 394 0 0
At STD N 00E0FFFF
Ne 0 ""
Po -5000 2000
$EndPAD
$PAD
Sh "70" C 669 669 0 0 0
Dr 394 0 0
At STD N 00E0FFFF
Ne 0 ""
Po -6000 3000
$EndPAD
$PAD
Sh "71" C 669 669 0 0 0
Dr 394 0 0
At STD N 00E0FFFF
Ne 0 ""
Po -5000 3000
$EndPAD
$PAD
Sh "72" C 669 669 0 0 0
Dr 394 0 0
At STD N 00E0FFFF
Ne 0 ""
Po -6000 4000
$EndPAD
$PAD
Sh "73" C 669 669 0 0 0
Dr 394 0 0
At STD N 00E0FFFF
Ne 0 ""
Po -5000 4000
$EndPAD
$PAD
Sh "74" C 669 669 0 0 0
Dr 394 0 0
At STD N 00E0FFFF
Ne 0 ""
Po -6000 5000
$EndPAD
$PAD
Sh "75" C 669 669 0 0 0
Dr 394 0 0
At STD N 00E0FFFF
Ne 0 ""
Po -5000 6000
$EndPAD
$PAD
Sh "76" C 669 669 0 0 0
Dr 394 0 0
At STD N 00E0FFFF
Ne 0 ""
Po -5000 5000
$EndPAD
$PAD
Sh "77" C 669 669 0 0 0
Dr 394 0 0
At STD N 00E0FFFF
Ne 0 ""
Po -4000 6000
$EndPAD
$PAD
Sh "78" C 669 669 0 0 0
Dr 394 0 0
At STD N 00E0FFFF
Ne 0 ""
Po -4000 5000
$EndPAD
$PAD
Sh "79" C 669 669 0 0 0
Dr 394 0 0
At STD N 00E0FFFF
Ne 0 ""
Po -3000 6000
$EndPAD
$PAD
Sh "80" C 669 669 0 0 0
Dr 394 0 0
At STD N 00E0FFFF
Ne 0 ""
Po -3000 5000
$EndPAD
$PAD
Sh "81" C 669 669 0 0 0
Dr 394 0 0
At STD N 00E0FFFF
Ne 0 ""
Po -2000 6000
$EndPAD
$PAD
Sh "82" C 669 669 0 0 0
Dr 394 0 0
At STD N 00E0FFFF
Ne 0 ""
Po -2000 5000
$EndPAD
$PAD
Sh "83" C 669 669 0 0 0
Dr 394 0 0
At STD N 00E0FFFF
Ne 0 ""
Po -1000 6000
$EndPAD
$PAD
Sh "84" C 669 669 0 0 0
Dr 394 0 0
At STD N 00E0FFFF
Ne 0 ""
Po -1000 5000
$EndPAD
$SHAPE3D
Na "walter\pth_plcc\plcc84_pth-skt.wrl"
Sc 1.000000 1.000000 1.000000
Of 0.000000 0.000000 0.000000
Ro 0.000000 0.000000 0.000000
$EndSHAPE3D
$EndMODULE  plcc84_pth-skt
$EndLIBRARY
