PCBNEW-LibModule-V1  So 1. prosinec 2012, 09:19:49 CET
# encoding utf-8
Units deci-mils
$INDEX
MLW06
MLW10
MLW12
MLW14
MLW16
MLW20
MLW26
MLW34
MLW40
MLW50
$EndINDEX
$MODULE MLW06
Po 0 0 0 15 50B9BA5B 00000000 ~~
Li MLW06
Sc 0
AR 
Op 0 0 0
T0 0 -2500 472 472 0 79 N V 21 N "MLW06"
T1 0 3000 472 472 0 79 N I 21 N "Value"
DS 820 1780 2950 1780 70 21
DS 2950 1780 2950 -1770 70 21
DS 2950 -1770 -2960 -1770 70 21
DS -2960 -1770 -2960 1780 70 21
DS -2960 1780 -830 1780 70 21
DS -830 1780 -830 1380 70 21
DS -830 1380 -2560 1380 70 21
DS -2560 1380 -2560 -1370 70 21
DS -2560 -1370 2550 -1370 70 21
DS 2550 -1370 2550 1380 70 21
DS 2550 1380 820 1380 70 21
DS 820 1380 820 1740 70 21
DS -1070 1890 -710 2250 70 21
DS -710 2250 -1420 2250 70 21
DS -1420 2250 -1070 1890 70 21
DS -830 1780 820 1780 70 21
$PAD
Sh "1" R 620 620 0 0 0
Dr 380 0 0
At STD N 00C08001
Ne 0 ""
Po -1000 500
$EndPAD
$PAD
Sh "2" C 620 620 0 0 0
Dr 380 0 0
At STD N 00C08001
Ne 0 ""
Po -1000 -500
$EndPAD
$PAD
Sh "3" C 620 620 0 0 0
Dr 380 0 0
At STD N 00C08001
Ne 0 ""
Po 0 500
$EndPAD
$PAD
Sh "4" C 620 620 0 0 0
Dr 380 0 0
At STD N 00C08001
Ne 0 ""
Po 0 -500
$EndPAD
$PAD
Sh "5" C 620 620 0 0 0
Dr 380 0 0
At STD N 00C08001
Ne 0 ""
Po 1000 500
$EndPAD
$PAD
Sh "6" C 620 620 0 0 0
Dr 380 0 0
At STD N 00C08001
Ne 0 ""
Po 1000 -500
$EndPAD
$EndMODULE MLW06
$MODULE MLW10
Po 0 0 0 15 50B9BB34 00000000 ~~
Li MLW10
Sc 0
AR 
Op 0 0 0
T0 0 -2500 472 472 0 79 N V 21 N "MLW10"
T1 0 2500 472 472 0 79 N I 21 N "Value"
DS 820 1780 2950 1780 70 21
DS 2950 1780 2950 -1770 70 21
DS 2950 -1770 -2960 -1770 70 21
DS -2960 -1770 -2960 1780 70 21
DS -2960 1780 -830 1780 70 21
DS -830 1780 -830 1380 70 21
DS -830 1380 -2560 1380 70 21
DS -2560 1380 -2560 -1370 70 21
DS -2560 -1370 2550 -1370 70 21
DS 2550 -1370 2550 1380 70 21
DS 2550 1380 820 1380 70 21
DS 820 1380 820 1740 70 21
DS -2010 1890 -1660 2250 70 21
DS -1660 2250 -2370 2250 70 21
DS -2370 2250 -2010 1890 70 21
DS -830 1780 820 1780 70 21
$PAD
Sh "1" R 620 620 0 0 0
Dr 380 0 0
At STD N 00C08001
Ne 0 ""
Po -2000 500
$EndPAD
$PAD
Sh "2" C 620 620 0 0 0
Dr 380 0 0
At STD N 00C08001
Ne 0 ""
Po -2000 -500
$EndPAD
$PAD
Sh "3" C 620 620 0 0 0
Dr 380 0 0
At STD N 00C08001
Ne 0 ""
Po -1000 500
$EndPAD
$PAD
Sh "4" C 620 620 0 0 0
Dr 380 0 0
At STD N 00C08001
Ne 0 ""
Po -1000 -500
$EndPAD
$PAD
Sh "5" C 620 620 0 0 0
Dr 380 0 0
At STD N 00C08001
Ne 0 ""
Po 0 500
$EndPAD
$PAD
Sh "6" C 620 620 0 0 0
Dr 380 0 0
At STD N 00C08001
Ne 0 ""
Po 0 -500
$EndPAD
$PAD
Sh "7" C 620 620 0 0 0
Dr 380 0 0
At STD N 00C08001
Ne 0 ""
Po 1000 500
$EndPAD
$PAD
Sh "8" C 620 620 0 0 0
Dr 380 0 0
At STD N 00C08001
Ne 0 ""
Po 1000 -500
$EndPAD
$PAD
Sh "9" C 620 620 0 0 0
Dr 380 0 0
At STD N 00C08001
Ne 0 ""
Po 2000 500
$EndPAD
$PAD
Sh "10" C 620 620 0 0 0
Dr 380 0 0
At STD N 00C08001
Ne 0 ""
Po 2000 -500
$EndPAD
$SHAPE3D
Na "walter/conn_strip/vasch_strip_5x2.wrl"
Sc 1 1 1
Of 0 0 0
Ro 0 0 0
$EndSHAPE3D
$EndMODULE MLW10
$MODULE MLW12
Po 0 0 0 15 50B9BB7C 00000000 ~~
Li MLW12
Sc 0
AR 
Op 0 0 0
T0 0 -2500 472 472 0 79 N V 21 N "MLW12"
T1 0 2500 472 472 0 79 N I 21 N "Value"
DS 866 1378 3661 1378 79 21
DS 3661 1378 3661 -1378 79 21
DS 3661 -1378 -3661 -1378 79 21
DS -3661 -1378 -3661 1378 79 21
DS -3661 1378 -866 1378 79 21
DS -866 1378 -866 1772 79 21
DS -4055 1772 4055 1772 79 21
DS 4055 1772 4055 -1772 79 21
DS 4055 -1772 -4055 -1772 79 21
DS 866 1772 866 1378 79 21
DS -4055 -1772 -4055 1772 79 21
DS -2570 1890 -2210 2250 70 21
DS -2210 2250 -2920 2250 70 21
DS -2920 2250 -2570 1890 70 21
$PAD
Sh "1" R 620 620 0 0 0
Dr 380 0 0
At STD N 00C0FFFF
Ne 0 ""
Po -2500 500
.SolderMask 39
$EndPAD
$PAD
Sh "2" C 620 620 0 0 0
Dr 380 0 0
At STD N 00C0FFFF
Ne 0 ""
Po -2500 -500
.SolderMask 39
$EndPAD
$PAD
Sh "3" C 620 620 0 0 0
Dr 380 0 0
At STD N 00C0FFFF
Ne 0 ""
Po -1500 500
.SolderMask 39
$EndPAD
$PAD
Sh "4" C 620 620 0 0 0
Dr 380 0 0
At STD N 00C0FFFF
Ne 0 ""
Po -1500 -500
.SolderMask 39
$EndPAD
$PAD
Sh "5" C 620 620 0 0 0
Dr 380 0 0
At STD N 00C0FFFF
Ne 0 ""
Po -500 500
.SolderMask 39
$EndPAD
$PAD
Sh "6" C 620 620 0 0 0
Dr 380 0 0
At STD N 00C0FFFF
Ne 0 ""
Po -500 -500
.SolderMask 39
$EndPAD
$PAD
Sh "7" C 620 620 0 0 0
Dr 380 0 0
At STD N 00C0FFFF
Ne 0 ""
Po 500 500
.SolderMask 39
$EndPAD
$PAD
Sh "8" C 620 620 0 0 0
Dr 380 0 0
At STD N 00C0FFFF
Ne 0 ""
Po 500 -500
.SolderMask 39
$EndPAD
$PAD
Sh "9" C 620 620 0 0 0
Dr 380 0 0
At STD N 00C0FFFF
Ne 0 ""
Po 1500 500
.SolderMask 39
$EndPAD
$PAD
Sh "10" C 620 620 0 0 0
Dr 380 0 0
At STD N 00C0FFFF
Ne 0 ""
Po 1500 -500
.SolderMask 39
$EndPAD
$PAD
Sh "11" C 620 620 0 0 0
Dr 380 0 0
At STD N 00C0FFFF
Ne 0 ""
Po 2500 500
.SolderMask 39
$EndPAD
$PAD
Sh "12" C 620 620 0 0 0
Dr 380 0 0
At STD N 00C0FFFF
Ne 0 ""
Po 2500 -500
.SolderMask 39
$EndPAD
$EndMODULE MLW12
$MODULE MLW14
Po 0 0 0 15 50B9BBC8 00000000 ~~
Li MLW14
Sc 0
AR 
Op 0 0 0
T0 0 -2500 472 472 0 79 N V 21 N "MLW14"
T1 0 2500 472 472 0 79 N I 21 N "Value"
DS 820 1780 820 1380 70 21
DS 820 1380 4560 1380 70 21
DS 4560 1380 4560 -1370 70 21
DS 4560 -1370 -4570 -1370 70 21
DS -4570 -1370 -4570 1380 70 21
DS -4570 1380 -830 1380 70 21
DS -830 1380 -830 1780 70 21
DS -830 1780 -4970 1780 70 21
DS -4970 1780 -4970 -1770 70 21
DS -4970 -1770 4960 -1770 70 21
DS 4960 -1770 4960 1780 70 21
DS 4960 1780 -180 1780 70 21
DS -3000 1890 -3350 2250 70 21
DS -3350 2250 -2640 2250 70 21
DS -2640 2250 -3000 1890 70 21
DS -1830 1780 -180 1780 70 21
$PAD
Sh "1" R 620 620 0 0 0
Dr 380 0 0
At STD N 00C08001
Ne 0 ""
Po -3000 500
$EndPAD
$PAD
Sh "2" C 620 620 0 0 0
Dr 380 0 0
At STD N 00C08001
Ne 0 ""
Po -3000 -500
$EndPAD
$PAD
Sh "3" C 620 620 0 0 0
Dr 380 0 0
At STD N 00C08001
Ne 0 ""
Po -2000 500
$EndPAD
$PAD
Sh "4" C 620 620 0 0 0
Dr 380 0 0
At STD N 00C08001
Ne 0 ""
Po -2000 -500
$EndPAD
$PAD
Sh "5" C 620 620 0 0 0
Dr 380 0 0
At STD N 00C08001
Ne 0 ""
Po -1000 500
$EndPAD
$PAD
Sh "6" C 620 620 0 0 0
Dr 380 0 0
At STD N 00C08001
Ne 0 ""
Po -1000 -500
$EndPAD
$PAD
Sh "7" C 620 620 0 0 0
Dr 380 0 0
At STD N 00C08001
Ne 0 ""
Po 0 500
$EndPAD
$PAD
Sh "8" C 620 620 0 0 0
Dr 380 0 0
At STD N 00C08001
Ne 0 ""
Po 0 -500
$EndPAD
$PAD
Sh "9" C 620 620 0 0 0
Dr 380 0 0
At STD N 00C08001
Ne 0 ""
Po 1000 500
$EndPAD
$PAD
Sh "10" C 620 620 0 0 0
Dr 380 0 0
At STD N 00C08001
Ne 0 ""
Po 1000 -500
$EndPAD
$PAD
Sh "11" C 620 620 0 0 0
Dr 380 0 0
At STD N 00C08001
Ne 0 ""
Po 2000 500
$EndPAD
$PAD
Sh "12" C 620 620 0 0 0
Dr 380 0 0
At STD N 00C08001
Ne 0 ""
Po 2000 -500
$EndPAD
$PAD
Sh "13" C 620 620 0 0 0
Dr 380 0 0
At STD N 00C08001
Ne 0 ""
Po 3000 500
$EndPAD
$PAD
Sh "14" C 620 620 0 0 0
Dr 380 0 0
At STD N 00C08001
Ne 0 ""
Po 3000 -500
$EndPAD
$SHAPE3D
Na "walter/conn_strip/vasch_strip_7x2.wrl"
Sc 1 1 1
Of 0 0 0
Ro 0 0 0
$EndSHAPE3D
$EndMODULE MLW14
$MODULE MLW16
Po 0 0 0 15 50B9BC22 00000000 ~~
Li MLW16
Sc 0
AR 
Op 0 0 0
T0 0 -2500 472 472 0 79 N V 21 N "MLW16"
T1 0 2500 472 472 0 79 N I 21 N "Value"
DS 820 1780 820 1380 70 21
DS 820 1380 5070 1380 70 21
DS 5070 1380 5070 -1370 70 21
DS 5070 -1370 -5080 -1370 70 21
DS -5080 -1370 -5080 1380 70 21
DS -5080 1380 -830 1380 70 21
DS -830 1380 -830 1780 70 21
DS -830 1780 -5480 1780 70 21
DS -5480 1780 -5480 -1770 70 21
DS -5480 -1770 5470 -1770 70 21
DS 5470 -1770 5470 1780 70 21
DS 5470 1780 -680 1780 70 21
DS -3510 1890 -3820 2210 70 21
DS -3820 2210 -3190 2210 70 21
DS -3190 2210 -3510 1890 70 21
DS -2330 1780 -680 1780 70 21
$PAD
Sh "1" R 620 620 0 0 0
Dr 380 0 0
At STD N 00C08001
Ne 0 ""
Po -3500 500
$EndPAD
$PAD
Sh "2" C 620 620 0 0 0
Dr 380 0 0
At STD N 00C08001
Ne 0 ""
Po -3500 -500
$EndPAD
$PAD
Sh "3" C 620 620 0 0 0
Dr 380 0 0
At STD N 00C08001
Ne 0 ""
Po -2500 500
$EndPAD
$PAD
Sh "4" C 620 620 0 0 0
Dr 380 0 0
At STD N 00C08001
Ne 0 ""
Po -2500 -500
$EndPAD
$PAD
Sh "5" C 620 620 0 0 0
Dr 380 0 0
At STD N 00C08001
Ne 0 ""
Po -1500 500
$EndPAD
$PAD
Sh "6" C 620 620 0 0 0
Dr 380 0 0
At STD N 00C08001
Ne 0 ""
Po -1500 -500
$EndPAD
$PAD
Sh "7" C 620 620 0 0 0
Dr 380 0 0
At STD N 00C08001
Ne 0 ""
Po -500 500
$EndPAD
$PAD
Sh "8" C 620 620 0 0 0
Dr 380 0 0
At STD N 00C08001
Ne 0 ""
Po -500 -500
$EndPAD
$PAD
Sh "9" C 620 620 0 0 0
Dr 380 0 0
At STD N 00C08001
Ne 0 ""
Po 500 500
$EndPAD
$PAD
Sh "10" C 620 620 0 0 0
Dr 380 0 0
At STD N 00C08001
Ne 0 ""
Po 500 -500
$EndPAD
$PAD
Sh "11" C 620 620 0 0 0
Dr 380 0 0
At STD N 00C08001
Ne 0 ""
Po 1500 500
$EndPAD
$PAD
Sh "12" C 620 620 0 0 0
Dr 380 0 0
At STD N 00C08001
Ne 0 ""
Po 1500 -500
$EndPAD
$PAD
Sh "13" C 620 620 0 0 0
Dr 380 0 0
At STD N 00C08001
Ne 0 ""
Po 2500 500
$EndPAD
$PAD
Sh "14" C 620 620 0 0 0
Dr 380 0 0
At STD N 00C08001
Ne 0 ""
Po 2500 -500
$EndPAD
$PAD
Sh "15" C 620 620 0 0 0
Dr 380 0 0
At STD N 00C08001
Ne 0 ""
Po 3500 500
$EndPAD
$PAD
Sh "16" C 620 620 0 0 0
Dr 380 0 0
At STD N 00C08001
Ne 0 ""
Po 3500 -500
$EndPAD
$SHAPE3D
Na "walter/conn_strip/vasch_strip_8x2.wrl"
Sc 1 1 1
Of 0 0 0
Ro 0 0 0
$EndSHAPE3D
$EndMODULE MLW16
$MODULE MLW20
Po 0 0 0 15 50B9BC67 00000000 ~~
Li MLW20
Sc 0
AR 
Op 0 0 0
T0 0 -2500 472 472 0 79 N V 21 N "MLW20"
T1 0 2500 472 472 0 79 N I 21 N "Value"
DS -4530 1890 -4850 2210 70 21
DS -4850 2210 -4220 2210 70 21
DS -4220 2210 -4530 1890 70 21
DS -3330 1780 -1680 1780 70 21
DS 820 1780 820 1380 70 21
DS 820 1380 6060 1380 70 21
DS 6060 1380 6060 -1370 70 21
DS 6060 -1370 -6070 -1370 70 21
DS -6070 -1370 -6070 1380 70 21
DS -6070 1380 -830 1380 70 21
DS -830 1380 -830 1780 70 21
DS -830 1780 -6460 1780 70 21
DS -6460 1780 -6460 -1770 70 21
DS -6460 -1770 6450 -1770 70 21
DS 6450 -1770 6450 1780 70 21
DS 6450 1780 -1680 1780 70 21
$PAD
Sh "1" R 620 620 0 0 0
Dr 380 0 0
At STD N 00C08001
Ne 0 ""
Po -4500 500
$EndPAD
$PAD
Sh "2" C 620 620 0 0 0
Dr 380 0 0
At STD N 00C08001
Ne 0 ""
Po -4500 -500
$EndPAD
$PAD
Sh "3" C 620 620 0 0 0
Dr 380 0 0
At STD N 00C08001
Ne 0 ""
Po -3500 500
$EndPAD
$PAD
Sh "4" C 620 620 0 0 0
Dr 380 0 0
At STD N 00C08001
Ne 0 ""
Po -3500 -500
$EndPAD
$PAD
Sh "5" C 620 620 0 0 0
Dr 380 0 0
At STD N 00C08001
Ne 0 ""
Po -2500 500
$EndPAD
$PAD
Sh "6" C 620 620 0 0 0
Dr 380 0 0
At STD N 00C08001
Ne 0 ""
Po -2500 -500
$EndPAD
$PAD
Sh "7" C 620 620 0 0 0
Dr 380 0 0
At STD N 00C08001
Ne 0 ""
Po -1500 500
$EndPAD
$PAD
Sh "8" C 620 620 0 0 0
Dr 380 0 0
At STD N 00C08001
Ne 0 ""
Po -1500 -500
$EndPAD
$PAD
Sh "9" C 620 620 0 0 0
Dr 380 0 0
At STD N 00C08001
Ne 0 ""
Po -500 500
$EndPAD
$PAD
Sh "10" C 620 620 0 0 0
Dr 380 0 0
At STD N 00C08001
Ne 0 ""
Po -500 -500
$EndPAD
$PAD
Sh "11" C 620 620 0 0 0
Dr 380 0 0
At STD N 00C08001
Ne 0 ""
Po 500 500
$EndPAD
$PAD
Sh "12" C 620 620 0 0 0
Dr 380 0 0
At STD N 00C08001
Ne 0 ""
Po 500 -500
$EndPAD
$PAD
Sh "13" C 620 620 0 0 0
Dr 380 0 0
At STD N 00C08001
Ne 0 ""
Po 1500 500
$EndPAD
$PAD
Sh "14" C 620 620 0 0 0
Dr 380 0 0
At STD N 00C08001
Ne 0 ""
Po 1500 -500
$EndPAD
$PAD
Sh "15" C 620 620 0 0 0
Dr 380 0 0
At STD N 00C08001
Ne 0 ""
Po 2500 500
$EndPAD
$PAD
Sh "16" C 620 620 0 0 0
Dr 380 0 0
At STD N 00C08001
Ne 0 ""
Po 2500 -500
$EndPAD
$PAD
Sh "17" C 620 620 0 0 0
Dr 380 0 0
At STD N 00C08001
Ne 0 ""
Po 3500 500
$EndPAD
$PAD
Sh "18" C 620 620 0 0 0
Dr 380 0 0
At STD N 00C08001
Ne 0 ""
Po 3500 -500
$EndPAD
$PAD
Sh "19" C 620 620 0 0 0
Dr 380 0 0
At STD N 00C08001
Ne 0 ""
Po 4500 500
$EndPAD
$PAD
Sh "20" C 620 620 0 0 0
Dr 380 0 0
At STD N 00C08001
Ne 0 ""
Po 4500 -500
$EndPAD
$SHAPE3D
Na "walter/conn_strip/vasch_strip_10x2.wrl"
Sc 1 1 1
Of 0 0 0
Ro 0 0 0
$EndSHAPE3D
$EndMODULE MLW20
$MODULE MLW26
Po 0 0 0 15 50B9BCB5 00000000 ~~
Li MLW26
Sc 0
AR 
Op 0 0 0
T0 0 -2500 472 472 0 79 N V 21 N "MLW26"
T1 0 2500 472 472 0 79 N I 21 N "Value"
DS -3180 1780 7950 1780 70 21
DS 7950 1780 7950 -1770 70 21
DS 7950 -1770 -7960 -1770 70 21
DS -7960 -1770 -7960 1780 70 21
DS -7960 1780 -830 1780 70 21
DS -830 1780 -830 1380 70 21
DS -830 1380 -7570 1380 70 21
DS -7570 1380 -7570 -1370 70 21
DS -7570 -1370 7550 -1370 70 21
DS 7550 -1370 7550 1380 70 21
DS 7550 1380 820 1380 70 21
DS 820 1380 820 1780 70 21
DS -6030 1890 -6350 2210 70 21
DS -6350 2210 -5720 2210 70 21
DS -5720 2210 -6030 1890 70 21
DS -4830 1780 -3180 1780 70 21
$PAD
Sh "1" R 620 620 0 0 0
Dr 380 0 0
At STD N 00C08001
Ne 0 ""
Po -6000 500
$EndPAD
$PAD
Sh "2" C 620 620 0 0 0
Dr 380 0 0
At STD N 00C08001
Ne 0 ""
Po -6000 -500
$EndPAD
$PAD
Sh "3" C 620 620 0 0 0
Dr 380 0 0
At STD N 00C08001
Ne 0 ""
Po -5000 500
$EndPAD
$PAD
Sh "4" C 620 620 0 0 0
Dr 380 0 0
At STD N 00C08001
Ne 0 ""
Po -5000 -500
$EndPAD
$PAD
Sh "5" C 620 620 0 0 0
Dr 380 0 0
At STD N 00C08001
Ne 0 ""
Po -4000 500
$EndPAD
$PAD
Sh "6" C 620 620 0 0 0
Dr 380 0 0
At STD N 00C08001
Ne 0 ""
Po -4000 -500
$EndPAD
$PAD
Sh "7" C 620 620 0 0 0
Dr 380 0 0
At STD N 00C08001
Ne 0 ""
Po -3000 500
$EndPAD
$PAD
Sh "8" C 620 620 0 0 0
Dr 380 0 0
At STD N 00C08001
Ne 0 ""
Po -3000 -500
$EndPAD
$PAD
Sh "9" C 620 620 0 0 0
Dr 380 0 0
At STD N 00C08001
Ne 0 ""
Po -2000 500
$EndPAD
$PAD
Sh "10" C 620 620 0 0 0
Dr 380 0 0
At STD N 00C08001
Ne 0 ""
Po -2000 -500
$EndPAD
$PAD
Sh "11" C 620 620 0 0 0
Dr 380 0 0
At STD N 00C08001
Ne 0 ""
Po -1000 500
$EndPAD
$PAD
Sh "12" C 620 620 0 0 0
Dr 380 0 0
At STD N 00C08001
Ne 0 ""
Po -1000 -500
$EndPAD
$PAD
Sh "13" C 620 620 0 0 0
Dr 380 0 0
At STD N 00C08001
Ne 0 ""
Po 0 500
$EndPAD
$PAD
Sh "14" C 620 620 0 0 0
Dr 380 0 0
At STD N 00C08001
Ne 0 ""
Po 0 -500
$EndPAD
$PAD
Sh "15" C 620 620 0 0 0
Dr 380 0 0
At STD N 00C08001
Ne 0 ""
Po 1000 500
$EndPAD
$PAD
Sh "16" C 620 620 0 0 0
Dr 380 0 0
At STD N 00C08001
Ne 0 ""
Po 1000 -500
$EndPAD
$PAD
Sh "17" C 620 620 0 0 0
Dr 380 0 0
At STD N 00C08001
Ne 0 ""
Po 2000 500
$EndPAD
$PAD
Sh "18" C 620 620 0 0 0
Dr 380 0 0
At STD N 00C08001
Ne 0 ""
Po 2000 -500
$EndPAD
$PAD
Sh "19" C 620 620 0 0 0
Dr 380 0 0
At STD N 00C08001
Ne 0 ""
Po 3000 500
$EndPAD
$PAD
Sh "20" C 620 620 0 0 0
Dr 380 0 0
At STD N 00C08001
Ne 0 ""
Po 3000 -500
$EndPAD
$PAD
Sh "21" C 620 620 0 0 0
Dr 380 0 0
At STD N 00C08001
Ne 0 ""
Po 4000 500
$EndPAD
$PAD
Sh "22" C 620 620 0 0 0
Dr 380 0 0
At STD N 00C08001
Ne 0 ""
Po 4000 -500
$EndPAD
$PAD
Sh "23" C 620 620 0 0 0
Dr 380 0 0
At STD N 00C08001
Ne 0 ""
Po 5000 500
$EndPAD
$PAD
Sh "24" C 620 620 0 0 0
Dr 380 0 0
At STD N 00C08001
Ne 0 ""
Po 5000 -500
$EndPAD
$PAD
Sh "25" C 620 620 0 0 0
Dr 380 0 0
At STD N 00C08001
Ne 0 ""
Po 6000 500
$EndPAD
$PAD
Sh "26" C 620 620 0 0 0
Dr 380 0 0
At STD N 00C08001
Ne 0 ""
Po 6000 -500
$EndPAD
$SHAPE3D
Na "walter/conn_strip/vasch_strip_13x2.wrl"
Sc 1 1 1
Of 0 0 0
Ro 0 0 0
$EndSHAPE3D
$EndMODULE MLW26
$MODULE MLW34
Po 0 0 0 15 50B9BCFF 00000000 ~~
Li MLW34
Sc 0
AR 
Op 0 0 0
T0 0 -2500 472 472 0 79 N V 21 N "MLW34"
T1 0 2500 472 472 0 79 N I 21 N "Value"
DS -5180 1780 9960 1780 70 21
DS 9960 1780 9960 -1770 70 21
DS 9960 -1770 -9960 -1770 70 21
DS -9960 -1770 -9960 1780 70 21
DS -9960 1780 -830 1780 70 21
DS -830 1780 -830 1380 70 21
DS -830 1380 -9570 1380 70 21
DS -9570 1380 -9570 -1370 70 21
DS -9570 -1370 9560 -1370 70 21
DS 9560 -1370 9560 1380 70 21
DS 9560 1380 820 1380 70 21
DS 820 1380 820 1780 70 21
DS -8030 1890 -8350 2210 70 21
DS -8350 2210 -7720 2210 70 21
DS -7720 2210 -8030 1890 70 21
DS -6830 1780 -5180 1780 70 21
$PAD
Sh "1" R 620 620 0 0 0
Dr 380 0 0
At STD N 00C08001
Ne 0 ""
Po -8000 500
$EndPAD
$PAD
Sh "2" C 620 620 0 0 0
Dr 380 0 0
At STD N 00C08001
Ne 0 ""
Po -8000 -500
$EndPAD
$PAD
Sh "3" C 620 620 0 0 0
Dr 380 0 0
At STD N 00C08001
Ne 0 ""
Po -7000 500
$EndPAD
$PAD
Sh "4" C 620 620 0 0 0
Dr 380 0 0
At STD N 00C08001
Ne 0 ""
Po -7000 -500
$EndPAD
$PAD
Sh "5" C 620 620 0 0 0
Dr 380 0 0
At STD N 00C08001
Ne 0 ""
Po -6000 500
$EndPAD
$PAD
Sh "6" C 620 620 0 0 0
Dr 380 0 0
At STD N 00C08001
Ne 0 ""
Po -6000 -500
$EndPAD
$PAD
Sh "7" C 620 620 0 0 0
Dr 380 0 0
At STD N 00C08001
Ne 0 ""
Po -5000 500
$EndPAD
$PAD
Sh "8" C 620 620 0 0 0
Dr 380 0 0
At STD N 00C08001
Ne 0 ""
Po -5000 -500
$EndPAD
$PAD
Sh "9" C 620 620 0 0 0
Dr 380 0 0
At STD N 00C08001
Ne 0 ""
Po -4000 500
$EndPAD
$PAD
Sh "10" C 620 620 0 0 0
Dr 380 0 0
At STD N 00C08001
Ne 0 ""
Po -4000 -500
$EndPAD
$PAD
Sh "11" C 620 620 0 0 0
Dr 380 0 0
At STD N 00C08001
Ne 0 ""
Po -3000 500
$EndPAD
$PAD
Sh "12" C 620 620 0 0 0
Dr 380 0 0
At STD N 00C08001
Ne 0 ""
Po -3000 -500
$EndPAD
$PAD
Sh "13" C 620 620 0 0 0
Dr 380 0 0
At STD N 00C08001
Ne 0 ""
Po -2000 500
$EndPAD
$PAD
Sh "14" C 620 620 0 0 0
Dr 380 0 0
At STD N 00C08001
Ne 0 ""
Po -2000 -500
$EndPAD
$PAD
Sh "15" C 620 620 0 0 0
Dr 380 0 0
At STD N 00C08001
Ne 0 ""
Po -1000 500
$EndPAD
$PAD
Sh "16" C 620 620 0 0 0
Dr 380 0 0
At STD N 00C08001
Ne 0 ""
Po -1000 -500
$EndPAD
$PAD
Sh "17" C 620 620 0 0 0
Dr 380 0 0
At STD N 00C08001
Ne 0 ""
Po 0 500
$EndPAD
$PAD
Sh "18" C 620 620 0 0 0
Dr 380 0 0
At STD N 00C08001
Ne 0 ""
Po 0 -500
$EndPAD
$PAD
Sh "19" C 620 620 0 0 0
Dr 380 0 0
At STD N 00C08001
Ne 0 ""
Po 1000 500
$EndPAD
$PAD
Sh "20" C 620 620 0 0 0
Dr 380 0 0
At STD N 00C08001
Ne 0 ""
Po 1000 -500
$EndPAD
$PAD
Sh "21" C 620 620 0 0 0
Dr 380 0 0
At STD N 00C08001
Ne 0 ""
Po 2000 500
$EndPAD
$PAD
Sh "22" C 620 620 0 0 0
Dr 380 0 0
At STD N 00C08001
Ne 0 ""
Po 2000 -500
$EndPAD
$PAD
Sh "23" C 620 620 0 0 0
Dr 380 0 0
At STD N 00C08001
Ne 0 ""
Po 3000 500
$EndPAD
$PAD
Sh "24" C 620 620 0 0 0
Dr 380 0 0
At STD N 00C08001
Ne 0 ""
Po 3000 -500
$EndPAD
$PAD
Sh "25" C 620 620 0 0 0
Dr 380 0 0
At STD N 00C08001
Ne 0 ""
Po 4000 500
$EndPAD
$PAD
Sh "26" C 620 620 0 0 0
Dr 380 0 0
At STD N 00C08001
Ne 0 ""
Po 4000 -500
$EndPAD
$PAD
Sh "27" C 620 620 0 0 0
Dr 380 0 0
At STD N 00C08001
Ne 0 ""
Po 5000 500
$EndPAD
$PAD
Sh "28" C 620 620 0 0 0
Dr 380 0 0
At STD N 00C08001
Ne 0 ""
Po 5000 -500
$EndPAD
$PAD
Sh "29" C 620 620 0 0 0
Dr 380 0 0
At STD N 00C08001
Ne 0 ""
Po 6000 500
$EndPAD
$PAD
Sh "30" C 620 620 0 0 0
Dr 380 0 0
At STD N 00C08001
Ne 0 ""
Po 6000 -500
$EndPAD
$PAD
Sh "31" C 620 620 0 0 0
Dr 380 0 0
At STD N 00C08001
Ne 0 ""
Po 7000 500
$EndPAD
$PAD
Sh "32" C 620 620 0 0 0
Dr 380 0 0
At STD N 00C08001
Ne 0 ""
Po 6970 -490
$EndPAD
$PAD
Sh "33" C 620 620 0 0 0
Dr 380 0 0
At STD N 00C08001
Ne 0 ""
Po 8000 500
$EndPAD
$PAD
Sh "34" C 620 620 0 0 0
Dr 380 0 0
At STD N 00C08001
Ne 0 ""
Po 8000 -500
$EndPAD
$SHAPE3D
Na "walter/conn_strip/vasch_strip_17x2.wrl"
Sc 1 1 1
Of 0 0 0
Ro 0 0 0
$EndSHAPE3D
$EndMODULE MLW34
$MODULE MLW40
Po 0 0 0 15 50B9BD49 00000000 ~~
Li MLW40
Sc 0
AR 
Op 0 0 0
T0 0 -2500 472 472 0 79 N V 21 N "MLW40"
T1 0 2500 472 472 0 79 N I 21 N "Value"
DS -9530 1890 -9890 2250 70 21
DS -9890 2250 -9180 2250 70 21
DS -9180 2250 -9530 1890 70 21
DS -9530 1890 -9890 2250 70 21
DS -9890 2250 -9180 2250 70 21
DS -9180 2250 -9530 1890 70 21
DS -8330 1780 -6680 1780 70 21
DS 820 1780 820 1380 70 21
DS 820 1380 11060 1380 70 21
DS 11060 1380 11060 -1370 70 21
DS 11060 -1370 -11070 -1370 70 21
DS -11070 -1370 -11070 1380 70 21
DS -11070 1380 -830 1380 70 21
DS -830 1380 -830 1780 70 21
DS -830 1780 -11460 1780 70 21
DS -11460 1780 -11460 -1770 70 21
DS -11460 -1770 11450 -1770 70 21
DS 11450 -1770 11450 1780 70 21
DS 11450 1780 -6680 1780 70 21
$PAD
Sh "1" R 620 620 0 0 0
Dr 380 0 0
At STD N 00C08001
Ne 0 ""
Po -9500 500
$EndPAD
$PAD
Sh "2" C 620 620 0 0 0
Dr 380 0 0
At STD N 00C08001
Ne 0 ""
Po -9500 -500
$EndPAD
$PAD
Sh "3" C 620 620 0 0 0
Dr 380 0 0
At STD N 00C08001
Ne 0 ""
Po -8500 500
$EndPAD
$PAD
Sh "4" C 620 620 0 0 0
Dr 380 0 0
At STD N 00C08001
Ne 0 ""
Po -8500 -500
$EndPAD
$PAD
Sh "5" C 620 620 0 0 0
Dr 380 0 0
At STD N 00C08001
Ne 0 ""
Po -7500 500
$EndPAD
$PAD
Sh "6" C 620 620 0 0 0
Dr 380 0 0
At STD N 00C08001
Ne 0 ""
Po -7500 -500
$EndPAD
$PAD
Sh "7" C 620 620 0 0 0
Dr 380 0 0
At STD N 00C08001
Ne 0 ""
Po -6500 500
$EndPAD
$PAD
Sh "8" C 620 620 0 0 0
Dr 380 0 0
At STD N 00C08001
Ne 0 ""
Po -6500 -500
$EndPAD
$PAD
Sh "9" C 620 620 0 0 0
Dr 380 0 0
At STD N 00C08001
Ne 0 ""
Po -5500 500
$EndPAD
$PAD
Sh "10" C 620 620 0 0 0
Dr 380 0 0
At STD N 00C08001
Ne 0 ""
Po -5500 -500
$EndPAD
$PAD
Sh "11" C 620 620 0 0 0
Dr 380 0 0
At STD N 00C08001
Ne 0 ""
Po -4500 500
$EndPAD
$PAD
Sh "12" C 620 620 0 0 0
Dr 380 0 0
At STD N 00C08001
Ne 0 ""
Po -4500 -500
$EndPAD
$PAD
Sh "13" C 620 620 0 0 0
Dr 380 0 0
At STD N 00C08001
Ne 0 ""
Po -3500 500
$EndPAD
$PAD
Sh "14" C 620 620 0 0 0
Dr 380 0 0
At STD N 00C08001
Ne 0 ""
Po -3500 -500
$EndPAD
$PAD
Sh "15" C 620 620 0 0 0
Dr 380 0 0
At STD N 00C08001
Ne 0 ""
Po -2500 500
$EndPAD
$PAD
Sh "16" C 620 620 0 0 0
Dr 380 0 0
At STD N 00C08001
Ne 0 ""
Po -2500 -500
$EndPAD
$PAD
Sh "17" C 620 620 0 0 0
Dr 380 0 0
At STD N 00C08001
Ne 0 ""
Po -1500 500
$EndPAD
$PAD
Sh "18" C 620 620 0 0 0
Dr 380 0 0
At STD N 00C08001
Ne 0 ""
Po -1500 -500
$EndPAD
$PAD
Sh "19" C 620 620 0 0 0
Dr 380 0 0
At STD N 00C08001
Ne 0 ""
Po -500 500
$EndPAD
$PAD
Sh "20" C 620 620 0 0 0
Dr 380 0 0
At STD N 00C08001
Ne 0 ""
Po -500 -500
$EndPAD
$PAD
Sh "21" C 620 620 0 0 0
Dr 380 0 0
At STD N 00C08001
Ne 0 ""
Po 500 500
$EndPAD
$PAD
Sh "22" C 620 620 0 0 0
Dr 380 0 0
At STD N 00C08001
Ne 0 ""
Po 500 -500
$EndPAD
$PAD
Sh "23" C 620 620 0 0 0
Dr 380 0 0
At STD N 00C08001
Ne 0 ""
Po 1500 500
$EndPAD
$PAD
Sh "24" C 620 620 0 0 0
Dr 380 0 0
At STD N 00C08001
Ne 0 ""
Po 1500 -500
$EndPAD
$PAD
Sh "25" C 620 620 0 0 0
Dr 380 0 0
At STD N 00C08001
Ne 0 ""
Po 2500 500
$EndPAD
$PAD
Sh "26" C 620 620 0 0 0
Dr 380 0 0
At STD N 00C08001
Ne 0 ""
Po 2500 -500
$EndPAD
$PAD
Sh "27" C 620 620 0 0 0
Dr 380 0 0
At STD N 00C08001
Ne 0 ""
Po 3500 500
$EndPAD
$PAD
Sh "28" C 620 620 0 0 0
Dr 380 0 0
At STD N 00C08001
Ne 0 ""
Po 3500 -500
$EndPAD
$PAD
Sh "29" C 620 620 0 0 0
Dr 380 0 0
At STD N 00C08001
Ne 0 ""
Po 4500 500
$EndPAD
$PAD
Sh "30" C 620 620 0 0 0
Dr 380 0 0
At STD N 00C08001
Ne 0 ""
Po 4500 -500
$EndPAD
$PAD
Sh "31" C 620 620 0 0 0
Dr 380 0 0
At STD N 00C08001
Ne 0 ""
Po 5500 500
$EndPAD
$PAD
Sh "32" C 620 620 0 0 0
Dr 380 0 0
At STD N 00C08001
Ne 0 ""
Po 5500 -500
$EndPAD
$PAD
Sh "33" C 620 620 0 0 0
Dr 380 0 0
At STD N 00C08001
Ne 0 ""
Po 6500 500
$EndPAD
$PAD
Sh "34" C 620 620 0 0 0
Dr 380 0 0
At STD N 00C08001
Ne 0 ""
Po 6500 -500
$EndPAD
$PAD
Sh "35" C 620 620 0 0 0
Dr 380 0 0
At STD N 00C08001
Ne 0 ""
Po 7500 500
$EndPAD
$PAD
Sh "36" C 620 620 0 0 0
Dr 380 0 0
At STD N 00C08001
Ne 0 ""
Po 7500 -500
$EndPAD
$PAD
Sh "37" C 620 620 0 0 0
Dr 380 0 0
At STD N 00C08001
Ne 0 ""
Po 8500 500
$EndPAD
$PAD
Sh "38" C 620 620 0 0 0
Dr 380 0 0
At STD N 00C08001
Ne 0 ""
Po 8500 -500
$EndPAD
$PAD
Sh "39" C 620 620 0 0 0
Dr 380 0 0
At STD N 00C08001
Ne 0 ""
Po 9500 500
$EndPAD
$PAD
Sh "40" C 620 620 0 0 0
Dr 380 0 0
At STD N 00C08001
Ne 0 ""
Po 9500 -500
$EndPAD
$SHAPE3D
Na "walter/conn_strip/vasch_strip_20x2.wrl"
Sc 1 1 1
Of 0 0 0
Ro 0 0 0
$EndSHAPE3D
$EndMODULE MLW40
$MODULE MLW50
Po 0 0 0 15 50B9BD96 00000000 ~~
Li MLW50
Sc 0
AR 
Op 0 0 0
T0 0 -2500 472 472 0 79 N V 21 N "MLW50"
T1 0 2500 472 472 0 79 N I 21 N "Value"
DS -12030 1890 -12390 2250 70 21
DS -12390 2250 -11680 2250 70 21
DS -11680 2250 -12030 1890 70 21
DS -12030 1890 -12390 2250 70 21
DS -12390 2250 -11680 2250 70 21
DS -11680 2250 -12030 1890 70 21
DS -10830 1780 -9180 1780 70 21
DS 820 1760 820 1380 70 21
DS 820 1380 13540 1380 70 21
DS 13540 1380 13540 -1370 70 21
DS 13540 -1370 -13550 -1370 70 21
DS -13550 -1370 -13550 1380 70 21
DS -13550 1380 -830 1380 70 21
DS -830 1380 -830 1780 70 21
DS -830 1780 -14060 1780 70 21
DS -14060 1780 -14060 -1770 70 21
DS -14060 -1770 14050 -1770 70 21
DS 14050 -1770 14050 1780 70 21
DS 14050 1780 -9180 1780 70 21
$PAD
Sh "1" R 620 620 0 0 0
Dr 380 0 0
At STD N 00C08001
Ne 0 ""
Po -12000 500
$EndPAD
$PAD
Sh "2" C 620 620 0 0 0
Dr 380 0 0
At STD N 00C08001
Ne 0 ""
Po -12000 -500
$EndPAD
$PAD
Sh "3" C 620 620 0 0 0
Dr 380 0 0
At STD N 00C08001
Ne 0 ""
Po -11000 500
$EndPAD
$PAD
Sh "4" C 620 620 0 0 0
Dr 380 0 0
At STD N 00C08001
Ne 0 ""
Po -11000 -500
$EndPAD
$PAD
Sh "5" C 620 620 0 0 0
Dr 380 0 0
At STD N 00C08001
Ne 0 ""
Po -10000 500
$EndPAD
$PAD
Sh "6" C 620 620 0 0 0
Dr 380 0 0
At STD N 00C08001
Ne 0 ""
Po -10000 -500
$EndPAD
$PAD
Sh "7" C 620 620 0 0 0
Dr 380 0 0
At STD N 00C08001
Ne 0 ""
Po -9000 500
$EndPAD
$PAD
Sh "8" C 620 620 0 0 0
Dr 380 0 0
At STD N 00C08001
Ne 0 ""
Po -9000 -500
$EndPAD
$PAD
Sh "9" C 620 620 0 0 0
Dr 380 0 0
At STD N 00C08001
Ne 0 ""
Po -8000 500
$EndPAD
$PAD
Sh "10" C 620 620 0 0 0
Dr 380 0 0
At STD N 00C08001
Ne 0 ""
Po -8000 -500
$EndPAD
$PAD
Sh "11" C 620 620 0 0 0
Dr 380 0 0
At STD N 00C08001
Ne 0 ""
Po -7000 500
$EndPAD
$PAD
Sh "12" C 620 620 0 0 0
Dr 380 0 0
At STD N 00C08001
Ne 0 ""
Po -7000 -500
$EndPAD
$PAD
Sh "13" C 620 620 0 0 0
Dr 380 0 0
At STD N 00C08001
Ne 0 ""
Po -6000 500
$EndPAD
$PAD
Sh "14" C 620 620 0 0 0
Dr 380 0 0
At STD N 00C08001
Ne 0 ""
Po -6000 -500
$EndPAD
$PAD
Sh "15" C 620 620 0 0 0
Dr 380 0 0
At STD N 00C08001
Ne 0 ""
Po -5000 500
$EndPAD
$PAD
Sh "16" C 620 620 0 0 0
Dr 380 0 0
At STD N 00C08001
Ne 0 ""
Po -5000 -500
$EndPAD
$PAD
Sh "17" C 620 620 0 0 0
Dr 380 0 0
At STD N 00C08001
Ne 0 ""
Po -4000 500
$EndPAD
$PAD
Sh "18" C 620 620 0 0 0
Dr 380 0 0
At STD N 00C08001
Ne 0 ""
Po -4000 -500
$EndPAD
$PAD
Sh "19" C 620 620 0 0 0
Dr 380 0 0
At STD N 00C08001
Ne 0 ""
Po -3000 500
$EndPAD
$PAD
Sh "20" C 620 620 0 0 0
Dr 380 0 0
At STD N 00C08001
Ne 0 ""
Po -3000 -500
$EndPAD
$PAD
Sh "21" C 620 620 0 0 0
Dr 380 0 0
At STD N 00C08001
Ne 0 ""
Po -2000 500
$EndPAD
$PAD
Sh "22" C 620 620 0 0 0
Dr 380 0 0
At STD N 00C08001
Ne 0 ""
Po -2000 -500
$EndPAD
$PAD
Sh "23" C 620 620 0 0 0
Dr 380 0 0
At STD N 00C08001
Ne 0 ""
Po -1000 500
$EndPAD
$PAD
Sh "24" C 620 620 0 0 0
Dr 380 0 0
At STD N 00C08001
Ne 0 ""
Po -1000 -500
$EndPAD
$PAD
Sh "25" C 620 620 0 0 0
Dr 380 0 0
At STD N 00C08001
Ne 0 ""
Po 0 500
$EndPAD
$PAD
Sh "26" C 620 620 0 0 0
Dr 380 0 0
At STD N 00C08001
Ne 0 ""
Po 0 -500
$EndPAD
$PAD
Sh "27" C 620 620 0 0 0
Dr 380 0 0
At STD N 00C08001
Ne 0 ""
Po 1000 500
$EndPAD
$PAD
Sh "28" C 620 620 0 0 0
Dr 380 0 0
At STD N 00C08001
Ne 0 ""
Po 1000 -500
$EndPAD
$PAD
Sh "29" C 620 620 0 0 0
Dr 380 0 0
At STD N 00C08001
Ne 0 ""
Po 2000 500
$EndPAD
$PAD
Sh "30" C 620 620 0 0 0
Dr 380 0 0
At STD N 00C08001
Ne 0 ""
Po 2000 -500
$EndPAD
$PAD
Sh "31" C 620 620 0 0 0
Dr 380 0 0
At STD N 00C08001
Ne 0 ""
Po 3000 500
$EndPAD
$PAD
Sh "32" C 620 620 0 0 0
Dr 380 0 0
At STD N 00C08001
Ne 0 ""
Po 3000 -500
$EndPAD
$PAD
Sh "33" C 620 620 0 0 0
Dr 380 0 0
At STD N 00C08001
Ne 0 ""
Po 4000 500
$EndPAD
$PAD
Sh "34" C 620 620 0 0 0
Dr 380 0 0
At STD N 00C08001
Ne 0 ""
Po 4000 -500
$EndPAD
$PAD
Sh "35" C 620 620 0 0 0
Dr 380 0 0
At STD N 00C08001
Ne 0 ""
Po 5000 500
$EndPAD
$PAD
Sh "36" C 620 620 0 0 0
Dr 380 0 0
At STD N 00C08001
Ne 0 ""
Po 5000 -500
$EndPAD
$PAD
Sh "37" C 620 620 0 0 0
Dr 380 0 0
At STD N 00C08001
Ne 0 ""
Po 6000 500
$EndPAD
$PAD
Sh "38" C 620 620 0 0 0
Dr 380 0 0
At STD N 00C08001
Ne 0 ""
Po 6000 -500
$EndPAD
$PAD
Sh "39" C 620 620 0 0 0
Dr 380 0 0
At STD N 00C08001
Ne 0 ""
Po 7000 500
$EndPAD
$PAD
Sh "40" C 620 620 0 0 0
Dr 380 0 0
At STD N 00C08001
Ne 0 ""
Po 7000 -500
$EndPAD
$PAD
Sh "41" C 620 620 0 0 0
Dr 380 0 0
At STD N 00C08001
Ne 0 ""
Po 8000 500
$EndPAD
$PAD
Sh "42" C 620 620 0 0 0
Dr 380 0 0
At STD N 00C08001
Ne 0 ""
Po 8000 -500
$EndPAD
$PAD
Sh "43" C 620 620 0 0 0
Dr 380 0 0
At STD N 00C08001
Ne 0 ""
Po 9000 500
$EndPAD
$PAD
Sh "44" C 620 620 0 0 0
Dr 380 0 0
At STD N 00C08001
Ne 0 ""
Po 9000 -500
$EndPAD
$PAD
Sh "45" C 620 620 0 0 0
Dr 380 0 0
At STD N 00C08001
Ne 0 ""
Po 10000 500
$EndPAD
$PAD
Sh "46" C 620 620 0 0 0
Dr 380 0 0
At STD N 00C08001
Ne 0 ""
Po 10000 -500
$EndPAD
$PAD
Sh "47" C 620 620 0 0 0
Dr 380 0 0
At STD N 00C08001
Ne 0 ""
Po 11000 500
$EndPAD
$PAD
Sh "48" C 620 620 0 0 0
Dr 380 0 0
At STD N 00C08001
Ne 0 ""
Po 11000 -500
$EndPAD
$PAD
Sh "49" C 620 620 0 0 0
Dr 380 0 0
At STD N 00C08001
Ne 0 ""
Po 12000 500
$EndPAD
$PAD
Sh "50" C 620 620 0 0 0
Dr 380 0 0
At STD N 00C08001
Ne 0 ""
Po 12000 -500
$EndPAD
$SHAPE3D
Na "walter/conn_strip/vasch_strip_25x2.wrl"
Sc 1 1 1
Of 0 0 0
Ro 0 0 0
$EndSHAPE3D
$EndMODULE MLW50
$EndLIBRARY
