PCBNEW-LibModule-V1  St 20. červen 2012, 18:46:27 CEST
# encoding utf-8
Units deci-mils
$INDEX
SIOV-S05K115
SIOV-S05K130
SIOV-S05K14
SIOV-S05K140
SIOV-S05K150
SIOV-S05K17
SIOV-S05K175
SIOV-S05K20
SIOV-S05K230
SIOV-S05K25
SIOV-S05K250
SIOV-S05K275
SIOV-S05K30
SIOV-S05K300
SIOV-S05K35
SIOV-S05K385
SIOV-S05K40
SIOV-S05K420
SIOV-S05K440
SIOV-S05K460
SIOV-S05K50
SIOV-S05K60
SIOV-S05K75
SIOV-S05K95
SIOV-S07K11
SIOV-S07K115
SIOV-S07K130
SIOV-S07K14
SIOV-S07K140
SIOV-S07K150
SIOV-S07K17
SIOV-S07K175
SIOV-S07K20
SIOV-S07K230
SIOV-S07K25
SIOV-S07K250
SIOV-S07K275
SIOV-S07K30
SIOV-S07K300
SIOV-S07K35
SIOV-S07K385
SIOV-S07K40
SIOV-S07K420
SIOV-S07K440
SIOV-S07K460
SIOV-S07K50
SIOV-S07K60
SIOV-S07K75
SIOV-S07K95
SIOV-S10K11
SIOV-S10K115
SIOV-S10K130
SIOV-S10K14
SIOV-S10K140
SIOV-S10K150
SIOV-S10K17
SIOV-S10K175
SIOV-S10K20
SIOV-S10K230
SIOV-S10K25
SIOV-S10K250
SIOV-S10K275
SIOV-S10K30
SIOV-S10K300
SIOV-S10K320
SIOV-S10K35
SIOV-S10K385
SIOV-S10K40
SIOV-S10K420
SIOV-S10K440
SIOV-S10K460
SIOV-S10K50
SIOV-S10K510
SIOV-S10K550
SIOV-S10K60
SIOV-S10K625
SIOV-S10K680
SIOV-S10K75
SIOV-S10K95
SIOV-S14K10001
SIOV-S14K11
SIOV-S14K115
SIOV-S14K130
SIOV-S14K14
SIOV-S14K140
SIOV-S14K150
SIOV-S14K17
SIOV-S14K175
SIOV-S14K20
SIOV-S14K230
SIOV-S14K25
SIOV-S14K250
SIOV-S14K275
SIOV-S14K30
SIOV-S14K300
SIOV-S14K320
SIOV-S14K35
SIOV-S14K385
SIOV-S14K40
SIOV-S14K420
SIOV-S14K440
SIOV-S14K460
SIOV-S14K50
SIOV-S14K510
SIOV-S14K550
SIOV-S14K60
SIOV-S14K625
SIOV-S14K680
SIOV-S14K75
SIOV-S14K95
SIOV-S20K10001
SIOV-S20K11
SIOV-S20K115
SIOV-S20K130
SIOV-S20K14
SIOV-S20K140
SIOV-S20K150
SIOV-S20K17
SIOV-S20K175
SIOV-S20K20
SIOV-S20K230
SIOV-S20K25
SIOV-S20K250
SIOV-S20K275
SIOV-S20K30
SIOV-S20K300
SIOV-S20K320
SIOV-S20K35
SIOV-S20K385
SIOV-S20K40
SIOV-S20K420
SIOV-S20K440
SIOV-S20K460
SIOV-S20K50
SIOV-S20K510
SIOV-S20K550
SIOV-S20K60
SIOV-S20K625
SIOV-S20K680
SIOV-S20K75
SIOV-S20K95
$EndINDEX
$MODULE SIOV-S05K115
Po 0 0 0 15 4A19473C 00000000 ~~
Li SIOV-S05K115
Cd Varistor Epcos SIOV-S05K115
Kw R
Sc 0
AR 
Op 0 A 0
T0 0 0 550 500 0 80 N V 21 N "VR"
T1 0 0 550 500 0 80 N V 21 N "Val*"
DS -1378 -709 1378 -709 150 21
DS 1378 -709 1378 709 150 21
DS 1378 709 -1378 709 150 21
DS -1378 709 -1378 -709 150 21
$PAD
Sh "1" C 550 550 0 0 0
Dr 320 0 0
At STD N 00E0FFFF
Ne 0 ""
Po -984 295
$EndPAD
$PAD
Sh "2" C 550 550 0 0 0
Dr 320 0 0
At STD N 00E0FFFF
Ne 0 ""
Po 984 -295
$EndPAD
$EndMODULE SIOV-S05K115
$MODULE SIOV-S05K130
Po 0 0 0 15 4A19473C 00000000 ~~
Li SIOV-S05K130
Cd Varistor Epcos SIOV-S05K130
Kw R
Sc 0
AR 
Op 0 A 0
T0 0 0 550 500 0 80 N V 21 N "VR"
T1 0 0 550 500 0 80 N V 21 N "Val*"
DS -1378 -709 1378 -709 150 21
DS 1378 -709 1378 709 150 21
DS 1378 709 -1378 709 150 21
DS -1378 709 -1378 -709 150 21
$PAD
Sh "1" C 550 550 0 0 0
Dr 320 0 0
At STD N 00E0FFFF
Ne 0 ""
Po -984 315
$EndPAD
$PAD
Sh "2" C 550 550 0 0 0
Dr 320 0 0
At STD N 00E0FFFF
Ne 0 ""
Po 984 -315
$EndPAD
$EndMODULE SIOV-S05K130
$MODULE SIOV-S05K14
Po 0 0 0 15 4FE1FDFD 00000000 ~~
Li SIOV-S05K14
Cd Varistor Epcos SIOV-S05K14
Kw R
Sc 0
AR 
Op 0 A 0
T0 0 -1250 392 392 0 80 N V 21 N "SIOV-S05K14"
T1 0 1250 393 393 0 80 N I 21 N "Value"
DS -1378 -669 1378 -669 150 21
DS 1378 -669 1378 669 150 21
DS 1378 669 -1378 669 150 21
DS -1378 669 -1378 -669 150 21
$PAD
Sh "1" C 550 550 0 0 0
Dr 320 0 0
At STD N 00E0FFFF
Ne 0 ""
Po -984 256
$EndPAD
$PAD
Sh "2" C 550 550 0 0 0
Dr 320 0 0
At STD N 00E0FFFF
Ne 0 ""
Po 984 -256
$EndPAD
$EndMODULE SIOV-S05K14
$MODULE SIOV-S05K140
Po 0 0 0 15 4A19473C 00000000 ~~
Li SIOV-S05K140
Cd Varistor Epcos SIOV-S05K140
Kw R
Sc 0
AR 
Op 0 A 0
T0 0 0 550 500 0 80 N V 21 N "VR"
T1 0 0 550 500 0 80 N V 21 N "Val*"
DS -1378 -728 1378 -728 150 21
DS 1378 -728 1378 728 150 21
DS 1378 728 -1378 728 150 21
DS -1378 728 -1378 -728 150 21
$PAD
Sh "1" C 550 550 0 0 0
Dr 320 0 0
At STD N 00E0FFFF
Ne 0 ""
Po -984 335
$EndPAD
$PAD
Sh "2" C 550 550 0 0 0
Dr 320 0 0
At STD N 00E0FFFF
Ne 0 ""
Po 984 -335
$EndPAD
$EndMODULE SIOV-S05K140
$MODULE SIOV-S05K150
Po 0 0 0 15 4A19473C 00000000 ~~
Li SIOV-S05K150
Cd Varistor Epcos SIOV-S05K150
Kw R
Sc 0
AR 
Op 0 A 0
T0 0 0 550 500 0 80 N V 21 N "VR"
T1 0 0 550 500 0 80 N V 21 N "Val*"
DS -1378 -748 1378 -748 150 21
DS 1378 -748 1378 748 150 21
DS 1378 748 -1378 748 150 21
DS -1378 748 -1378 -748 150 21
$PAD
Sh "1" C 550 550 0 0 0
Dr 320 0 0
At STD N 00E0FFFF
Ne 0 ""
Po -984 354
$EndPAD
$PAD
Sh "2" C 550 550 0 0 0
Dr 320 0 0
At STD N 00E0FFFF
Ne 0 ""
Po 984 -354
$EndPAD
$EndMODULE SIOV-S05K150
$MODULE SIOV-S05K17
Po 0 0 0 15 4FE1FE5C 00000000 ~~
Li SIOV-S05K17
Cd Varistor Epcos SIOV-S05K17
Kw R
Sc 0
AR 
Op 0 A 0
T0 0 -1250 392 392 0 80 N V 21 N "Varistor Epcos SIOV-S05K17"
T1 0 1250 393 393 0 80 N I 21 N "Val*"
DS -1378 -689 1378 -689 150 21
DS 1378 -689 1378 689 150 21
DS 1378 689 -1378 689 150 21
DS -1378 689 -1378 -689 150 21
$PAD
Sh "1" C 550 550 0 0 0
Dr 320 0 0
At STD N 00E0FFFF
Ne 0 ""
Po -984 276
$EndPAD
$PAD
Sh "2" C 550 550 0 0 0
Dr 320 0 0
At STD N 00E0FFFF
Ne 0 ""
Po 984 -276
$EndPAD
$EndMODULE SIOV-S05K17
$MODULE SIOV-S05K175
Po 0 0 0 15 4A19473C 00000000 ~~
Li SIOV-S05K175
Cd Varistor Epcos SIOV-S05K175
Kw R
Sc 0
AR 
Op 0 A 0
T0 0 0 550 500 0 80 N V 21 N "VR"
T1 0 0 550 500 0 80 N V 21 N "Val*"
DS -1378 -768 1378 -768 150 21
DS 1378 -768 1378 768 150 21
DS 1378 768 -1378 768 150 21
DS -1378 768 -1378 -768 150 21
$PAD
Sh "1" C 550 550 0 0 0
Dr 320 0 0
At STD N 00E0FFFF
Ne 0 ""
Po -984 394
$EndPAD
$PAD
Sh "2" C 550 550 0 0 0
Dr 320 0 0
At STD N 00E0FFFF
Ne 0 ""
Po 984 -394
$EndPAD
$EndMODULE SIOV-S05K175
$MODULE SIOV-S05K20
Po 0 0 0 15 4A19473C 00000000 ~~
Li SIOV-S05K20
Cd Varistor Epcos SIOV-S05K20
Kw R
Sc 0
AR 
Op 0 A 0
T0 0 0 550 500 0 80 N V 21 N "VR"
T1 0 0 550 500 0 80 N V 21 N "Val*"
DS -1378 -689 1378 -689 150 21
DS 1378 -689 1378 689 150 21
DS 1378 689 -1378 689 150 21
DS -1378 689 -1378 -689 150 21
$PAD
Sh "1" C 550 550 0 0 0
Dr 320 0 0
At STD N 00E0FFFF
Ne 0 ""
Po -984 236
$EndPAD
$PAD
Sh "2" C 550 550 0 0 0
Dr 320 0 0
At STD N 00E0FFFF
Ne 0 ""
Po 984 -236
$EndPAD
$EndMODULE SIOV-S05K20
$MODULE SIOV-S05K230
Po 0 0 0 15 4A19473C 00000000 ~~
Li SIOV-S05K230
Cd Varistor Epcos SIOV-S05K230
Kw R
Sc 0
AR 
Op 0 A 0
T0 0 0 550 500 0 80 N V 21 N "VR"
T1 0 0 550 500 0 80 N V 21 N "Val*"
DS -1378 -787 1378 -787 150 21
DS 1378 -787 1378 787 150 21
DS 1378 787 -1378 787 150 21
DS -1378 787 -1378 -787 150 21
$PAD
Sh "1" C 550 550 0 0 0
Dr 320 0 0
At STD N 00E0FFFF
Ne 0 ""
Po -984 354
$EndPAD
$PAD
Sh "2" C 550 550 0 0 0
Dr 320 0 0
At STD N 00E0FFFF
Ne 0 ""
Po 984 -354
$EndPAD
$EndMODULE SIOV-S05K230
$MODULE SIOV-S05K25
Po 0 0 0 15 4A19473C 00000000 ~~
Li SIOV-S05K25
Cd Varistor Epcos SIOV-S05K25
Kw R
Sc 0
AR 
Op 0 A 0
T0 0 0 550 500 0 80 N V 21 N "VR"
T1 0 0 550 500 0 80 N V 21 N "Val*"
DS -1378 -709 1378 -709 150 21
DS 1378 -709 1378 709 150 21
DS 1378 709 -1378 709 150 21
DS -1378 709 -1378 -709 150 21
$PAD
Sh "1" C 550 550 0 0 0
Dr 320 0 0
At STD N 00E0FFFF
Ne 0 ""
Po -984 256
$EndPAD
$PAD
Sh "2" C 550 550 0 0 0
Dr 320 0 0
At STD N 00E0FFFF
Ne 0 ""
Po 984 -256
$EndPAD
$EndMODULE SIOV-S05K25
$MODULE SIOV-S05K250
Po 0 0 0 15 4A19473C 00000000 ~~
Li SIOV-S05K250
Cd Varistor Epcos SIOV-S05K250
Kw R
Sc 0
AR 
Op 0 A 0
T0 0 0 550 500 0 80 N V 21 N "VR"
T1 0 0 550 500 0 80 N V 21 N "Val*"
DS -1378 -827 1378 -827 150 21
DS 1378 -827 1378 827 150 21
DS 1378 827 -1378 827 150 21
DS -1378 827 -1378 -827 150 21
$PAD
Sh "1" C 550 550 0 0 0
Dr 320 0 0
At STD N 00E0FFFF
Ne 0 ""
Po -984 354
$EndPAD
$PAD
Sh "2" C 550 550 0 0 0
Dr 320 0 0
At STD N 00E0FFFF
Ne 0 ""
Po 984 -354
$EndPAD
$EndMODULE SIOV-S05K250
$MODULE SIOV-S05K275
Po 0 0 0 15 4A19473C 00000000 ~~
Li SIOV-S05K275
Cd Varistor Epcos SIOV-S05K275
Kw R
Sc 0
AR 
Op 0 A 0
T0 0 0 550 500 0 80 N V 21 N "VR"
T1 0 0 550 500 0 80 N V 21 N "Val*"
DS -1378 -846 1378 -846 150 21
DS 1378 -846 1378 846 150 21
DS 1378 846 -1378 846 150 21
DS -1378 846 -1378 -846 150 21
$PAD
Sh "1" C 550 550 0 0 0
Dr 320 0 0
At STD N 00E0FFFF
Ne 0 ""
Po -984 394
$EndPAD
$PAD
Sh "2" C 550 550 0 0 0
Dr 320 0 0
At STD N 00E0FFFF
Ne 0 ""
Po 984 -394
$EndPAD
$EndMODULE SIOV-S05K275
$MODULE SIOV-S05K30
Po 0 0 0 15 4A19473C 00000000 ~~
Li SIOV-S05K30
Cd Varistor Epcos SIOV-S05K30
Kw R
Sc 0
AR 
Op 0 A 0
T0 0 0 550 500 0 80 N V 21 N "VR"
T1 0 0 550 500 0 80 N V 21 N "Val*"
DS -1378 -709 1378 -709 150 21
DS 1378 -709 1378 709 150 21
DS 1378 709 -1378 709 150 21
DS -1378 709 -1378 -709 150 21
$PAD
Sh "1" C 550 550 0 0 0
Dr 320 0 0
At STD N 00E0FFFF
Ne 0 ""
Po -984 295
$EndPAD
$PAD
Sh "2" C 550 550 0 0 0
Dr 320 0 0
At STD N 00E0FFFF
Ne 0 ""
Po 984 -295
$EndPAD
$EndMODULE SIOV-S05K30
$MODULE SIOV-S05K300
Po 0 0 0 15 4A19473C 00000000 ~~
Li SIOV-S05K300
Cd Varistor Epcos SIOV-S05K300
Kw R
Sc 0
AR 
Op 0 A 0
T0 0 0 550 500 0 80 N V 21 N "VR"
T1 0 0 550 500 0 80 N V 21 N "Val*"
DS -1378 -886 1378 -886 150 21
DS 1378 -886 1378 886 150 21
DS 1378 886 -1378 886 150 21
DS -1378 886 -1378 -886 150 21
$PAD
Sh "1" C 550 550 0 0 0
Dr 320 0 0
At STD N 00E0FFFF
Ne 0 ""
Po -984 413
$EndPAD
$PAD
Sh "2" C 550 550 0 0 0
Dr 320 0 0
At STD N 00E0FFFF
Ne 0 ""
Po 984 -413
$EndPAD
$EndMODULE SIOV-S05K300
$MODULE SIOV-S05K35
Po 0 0 0 15 4A19473C 00000000 ~~
Li SIOV-S05K35
Cd Varistor Epcos SIOV-S05K35
Kw R
Sc 0
AR 
Op 0 A 0
T0 0 0 550 500 0 80 N V 21 N "VR"
T1 0 0 550 500 0 80 N V 21 N "Val*"
DS -1378 -728 1378 -728 150 21
DS 1378 -728 1378 728 150 21
DS 1378 728 -1378 728 150 21
DS -1378 728 -1378 -728 150 21
$PAD
Sh "1" C 550 550 0 0 0
Dr 320 0 0
At STD N 00E0FFFF
Ne 0 ""
Po -984 315
$EndPAD
$PAD
Sh "2" C 550 550 0 0 0
Dr 320 0 0
At STD N 00E0FFFF
Ne 0 ""
Po 984 -315
$EndPAD
$EndMODULE SIOV-S05K35
$MODULE SIOV-S05K385
Po 0 0 0 15 4A19473C 00000000 ~~
Li SIOV-S05K385
Cd Varistor Epcos SIOV-S05K385
Kw R
Sc 0
AR 
Op 0 A 0
T0 0 0 550 500 0 80 N V 21 N "VR"
T1 0 0 550 500 0 80 N V 21 N "Val*"
DS -1378 -1004 1378 -1004 150 21
DS 1378 -1004 1378 1004 150 21
DS 1378 1004 -1378 1004 150 21
DS -1378 1004 -1378 -1004 150 21
$PAD
Sh "1" C 550 550 0 0 0
Dr 320 0 0
At STD N 00E0FFFF
Ne 0 ""
Po -984 492
$EndPAD
$PAD
Sh "2" C 550 550 0 0 0
Dr 320 0 0
At STD N 00E0FFFF
Ne 0 ""
Po 984 -492
$EndPAD
$EndMODULE SIOV-S05K385
$MODULE SIOV-S05K40
Po 0 0 0 15 4A19473C 00000000 ~~
Li SIOV-S05K40
Cd Varistor Epcos SIOV-S05K40
Kw R
Sc 0
AR 
Op 0 A 0
T0 0 0 550 500 0 80 N V 21 N "VR"
T1 0 0 550 500 0 80 N V 21 N "Val*"
DS -1378 -768 1378 -768 150 21
DS 1378 -768 1378 768 150 21
DS 1378 768 -1378 768 150 21
DS -1378 768 -1378 -768 150 21
$PAD
Sh "1" C 550 550 0 0 0
Dr 320 0 0
At STD N 00E0FFFF
Ne 0 ""
Po -984 354
$EndPAD
$PAD
Sh "2" C 550 550 0 0 0
Dr 320 0 0
At STD N 00E0FFFF
Ne 0 ""
Po 984 -354
$EndPAD
$EndMODULE SIOV-S05K40
$MODULE SIOV-S05K420
Po 0 0 0 15 4A19473C 00000000 ~~
Li SIOV-S05K420
Cd Varistor Epcos SIOV-S05K420
Kw R
Sc 0
AR 
Op 0 A 0
T0 0 0 550 500 0 80 N V 21 N "VR"
T1 0 0 550 500 0 80 N V 21 N "Val*"
DS -1378 -1063 1378 -1063 150 21
DS 1378 -1063 1378 1063 150 21
DS 1378 1063 -1378 1063 150 21
DS -1378 1063 -1378 -1063 150 21
$PAD
Sh "1" C 550 550 0 0 0
Dr 320 0 0
At STD N 00E0FFFF
Ne 0 ""
Po -984 551
$EndPAD
$PAD
Sh "2" C 550 550 0 0 0
Dr 320 0 0
At STD N 00E0FFFF
Ne 0 ""
Po 984 -551
$EndPAD
$EndMODULE SIOV-S05K420
$MODULE SIOV-S05K440
Po 0 0 0 15 4A19473C 00000000 ~~
Li SIOV-S05K440
Cd Varistor Epcos SIOV-S05K440
Kw R
Sc 0
AR 
Op 0 A 0
T0 0 0 550 500 0 80 N V 21 N "VR"
T1 0 0 550 500 0 80 N V 21 N "Val*"
DS -1378 -1083 1378 -1083 150 21
DS 1378 -1083 1378 1083 150 21
DS 1378 1083 -1378 1083 150 21
DS -1378 1083 -1378 -1083 150 21
$PAD
Sh "1" C 550 550 0 0 0
Dr 320 0 0
At STD N 00E0FFFF
Ne 0 ""
Po -984 551
$EndPAD
$PAD
Sh "2" C 550 550 0 0 0
Dr 320 0 0
At STD N 00E0FFFF
Ne 0 ""
Po 984 -551
$EndPAD
$EndMODULE SIOV-S05K440
$MODULE SIOV-S05K460
Po 0 0 0 15 4A19473C 00000000 ~~
Li SIOV-S05K460
Cd Varistor Epcos SIOV-S05K460
Kw R
Sc 0
AR 
Op 0 A 0
T0 0 0 550 500 0 80 N V 21 N "VR"
T1 0 0 550 500 0 80 N V 21 N "Val*"
DS -1378 -1122 1378 -1122 150 21
DS 1378 -1122 1378 1122 150 21
DS 1378 1122 -1378 1122 150 21
DS -1378 1122 -1378 -1122 150 21
$PAD
Sh "1" C 550 550 0 0 0
Dr 320 0 0
At STD N 00E0FFFF
Ne 0 ""
Po -984 591
$EndPAD
$PAD
Sh "2" C 550 550 0 0 0
Dr 320 0 0
At STD N 00E0FFFF
Ne 0 ""
Po 984 -591
$EndPAD
$EndMODULE SIOV-S05K460
$MODULE SIOV-S05K50
Po 0 0 0 15 4A19473C 00000000 ~~
Li SIOV-S05K50
Cd Varistor Epcos SIOV-S05K50
Kw R
Sc 0
AR 
Op 0 A 0
T0 0 0 550 500 0 80 N V 21 N "VR"
T1 0 0 550 500 0 80 N V 21 N "Val*"
DS -1378 -650 1378 -650 150 21
DS 1378 -650 1378 650 150 21
DS 1378 650 -1378 650 150 21
DS -1378 650 -1378 -650 150 21
$PAD
Sh "1" C 550 550 0 0 0
Dr 320 0 0
At STD N 00E0FFFF
Ne 0 ""
Po -984 236
$EndPAD
$PAD
Sh "2" C 550 550 0 0 0
Dr 320 0 0
At STD N 00E0FFFF
Ne 0 ""
Po 984 -236
$EndPAD
$EndMODULE SIOV-S05K50
$MODULE SIOV-S05K60
Po 0 0 0 15 4A19473C 00000000 ~~
Li SIOV-S05K60
Cd Varistor Epcos SIOV-S05K60
Kw R
Sc 0
AR 
Op 0 A 0
T0 0 0 550 500 0 80 N V 21 N "VR"
T1 0 0 550 500 0 80 N V 21 N "Val*"
DS -1378 -650 1378 -650 150 21
DS 1378 -650 1378 650 150 21
DS 1378 650 -1378 650 150 21
DS -1378 650 -1378 -650 150 21
$PAD
Sh "1" C 550 550 0 0 0
Dr 320 0 0
At STD N 00E0FFFF
Ne 0 ""
Po -984 236
$EndPAD
$PAD
Sh "2" C 550 550 0 0 0
Dr 320 0 0
At STD N 00E0FFFF
Ne 0 ""
Po 984 -236
$EndPAD
$EndMODULE SIOV-S05K60
$MODULE SIOV-S05K75
Po 0 0 0 15 4A19473C 00000000 ~~
Li SIOV-S05K75
Cd Varistor Epcos SIOV-S05K75
Kw R
Sc 0
AR 
Op 0 A 0
T0 0 0 550 500 0 80 N V 21 N "VR"
T1 0 0 550 500 0 80 N V 21 N "Val*"
DS -1378 -669 1378 -669 150 21
DS 1378 -669 1378 669 150 21
DS 1378 669 -1378 669 150 21
DS -1378 669 -1378 -669 150 21
$PAD
Sh "1" C 550 550 0 0 0
Dr 320 0 0
At STD N 00E0FFFF
Ne 0 ""
Po -984 256
$EndPAD
$PAD
Sh "2" C 550 550 0 0 0
Dr 320 0 0
At STD N 00E0FFFF
Ne 0 ""
Po 984 -256
$EndPAD
$EndMODULE SIOV-S05K75
$MODULE SIOV-S05K95
Po 0 0 0 15 4A19473C 00000000 ~~
Li SIOV-S05K95
Cd Varistor Epcos SIOV-S05K95
Kw R
Sc 0
AR 
Op 0 A 0
T0 0 0 550 500 0 80 N V 21 N "VR"
T1 0 0 550 500 0 80 N V 21 N "Val*"
DS -1378 -669 1378 -669 150 21
DS 1378 -669 1378 669 150 21
DS 1378 669 -1378 669 150 21
DS -1378 669 -1378 -669 150 21
$PAD
Sh "1" C 550 550 0 0 0
Dr 320 0 0
At STD N 00E0FFFF
Ne 0 ""
Po -984 256
$EndPAD
$PAD
Sh "2" C 550 550 0 0 0
Dr 320 0 0
At STD N 00E0FFFF
Ne 0 ""
Po 984 -256
$EndPAD
$EndMODULE SIOV-S05K95
$MODULE SIOV-S07K11
Po 0 0 0 15 4A19473C 00000000 ~~
Li SIOV-S07K11
Cd Varistor Epcos SIOV-S07K11
Kw R
Sc 0
AR 
Op 0 A 0
T0 0 0 550 500 0 80 N V 21 N "VR"
T1 0 0 550 500 0 80 N V 21 N "Val*"
DS -1772 -669 1772 -669 150 21
DS 1772 -669 1772 669 150 21
DS 1772 669 -1772 669 150 21
DS -1772 669 -1772 -669 150 21
$PAD
Sh "1" C 550 550 0 0 0
Dr 320 0 0
At STD N 00E0FFFF
Ne 0 ""
Po -984 236
$EndPAD
$PAD
Sh "2" C 550 550 0 0 0
Dr 320 0 0
At STD N 00E0FFFF
Ne 0 ""
Po 984 -236
$EndPAD
$EndMODULE SIOV-S07K11
$MODULE SIOV-S07K115
Po 0 0 0 15 4A19473C 00000000 ~~
Li SIOV-S07K115
Cd Varistor Epcos SIOV-S07K115
Kw R
Sc 0
AR 
Op 0 A 0
T0 0 0 550 500 0 80 N V 21 N "VR"
T1 0 0 550 500 0 80 N V 21 N "Val*"
DS -1772 -709 1772 -709 150 21
DS 1772 -709 1772 709 150 21
DS 1772 709 -1772 709 150 21
DS -1772 709 -1772 -709 150 21
$PAD
Sh "1" C 550 550 0 0 0
Dr 320 0 0
At STD N 00E0FFFF
Ne 0 ""
Po -984 295
$EndPAD
$PAD
Sh "2" C 550 550 0 0 0
Dr 320 0 0
At STD N 00E0FFFF
Ne 0 ""
Po 984 -295
$EndPAD
$EndMODULE SIOV-S07K115
$MODULE SIOV-S07K130
Po 0 0 0 15 4A19473C 00000000 ~~
Li SIOV-S07K130
Cd Varistor Epcos SIOV-S07K130
Kw R
Sc 0
AR 
Op 0 A 0
T0 0 0 550 500 0 80 N V 21 N "VR"
T1 0 0 550 500 0 80 N V 21 N "Val*"
DS -1772 -709 1772 -709 150 21
DS 1772 -709 1772 709 150 21
DS 1772 709 -1772 709 150 21
DS -1772 709 -1772 -709 150 21
$PAD
Sh "1" C 550 550 0 0 0
Dr 320 0 0
At STD N 00E0FFFF
Ne 0 ""
Po -984 315
$EndPAD
$PAD
Sh "2" C 550 550 0 0 0
Dr 320 0 0
At STD N 00E0FFFF
Ne 0 ""
Po 984 -315
$EndPAD
$EndMODULE SIOV-S07K130
$MODULE SIOV-S07K14
Po 0 0 0 15 4A19473C 00000000 ~~
Li SIOV-S07K14
Cd Varistor Epcos SIOV-S07K14
Kw R
Sc 0
AR 
Op 0 A 0
T0 0 0 550 500 0 80 N V 21 N "VR"
T1 0 0 550 500 0 80 N V 21 N "Val*"
DS -1772 -689 1772 -689 150 21
DS 1772 -689 1772 689 150 21
DS 1772 689 -1772 689 150 21
DS -1772 689 -1772 -689 150 21
$PAD
Sh "1" C 550 550 0 0 0
Dr 320 0 0
At STD N 00E0FFFF
Ne 0 ""
Po -984 256
$EndPAD
$PAD
Sh "2" C 550 550 0 0 0
Dr 320 0 0
At STD N 00E0FFFF
Ne 0 ""
Po 984 -256
$EndPAD
$EndMODULE SIOV-S07K14
$MODULE SIOV-S07K140
Po 0 0 0 15 4A19473C 00000000 ~~
Li SIOV-S07K140
Cd Varistor Epcos SIOV-S07K140
Kw R
Sc 0
AR 
Op 0 A 0
T0 0 0 550 500 0 80 N V 21 N "VR"
T1 0 0 550 500 0 80 N V 21 N "Val*"
DS -1772 -728 1772 -728 150 21
DS 1772 -728 1772 728 150 21
DS 1772 728 -1772 728 150 21
DS -1772 728 -1772 -728 150 21
$PAD
Sh "1" C 550 550 0 0 0
Dr 320 0 0
At STD N 00E0FFFF
Ne 0 ""
Po -984 335
$EndPAD
$PAD
Sh "2" C 550 550 0 0 0
Dr 320 0 0
At STD N 00E0FFFF
Ne 0 ""
Po 984 -335
$EndPAD
$EndMODULE SIOV-S07K140
$MODULE SIOV-S07K150
Po 0 0 0 15 4A19473C 00000000 ~~
Li SIOV-S07K150
Cd Varistor Epcos SIOV-S07K150
Kw R
Sc 0
AR 
Op 0 A 0
T0 0 0 550 500 0 80 N V 21 N "VR"
T1 0 0 550 500 0 80 N V 21 N "Val*"
DS -1772 -748 1772 -748 150 21
DS 1772 -748 1772 748 150 21
DS 1772 748 -1772 748 150 21
DS -1772 748 -1772 -748 150 21
$PAD
Sh "1" C 550 550 0 0 0
Dr 320 0 0
At STD N 00E0FFFF
Ne 0 ""
Po -984 354
$EndPAD
$PAD
Sh "2" C 550 550 0 0 0
Dr 320 0 0
At STD N 00E0FFFF
Ne 0 ""
Po 984 -354
$EndPAD
$EndMODULE SIOV-S07K150
$MODULE SIOV-S07K17
Po 0 0 0 15 4A19473C 00000000 ~~
Li SIOV-S07K17
Cd Varistor Epcos SIOV-S07K17
Kw R
Sc 0
AR 
Op 0 A 0
T0 0 0 550 500 0 80 N V 21 N "VR"
T1 0 0 550 500 0 80 N V 21 N "Val*"
DS -1772 -709 1772 -709 150 21
DS 1772 -709 1772 709 150 21
DS 1772 709 -1772 709 150 21
DS -1772 709 -1772 -709 150 21
$PAD
Sh "1" C 550 550 0 0 0
Dr 320 0 0
At STD N 00E0FFFF
Ne 0 ""
Po -984 276
$EndPAD
$PAD
Sh "2" C 550 550 0 0 0
Dr 320 0 0
At STD N 00E0FFFF
Ne 0 ""
Po 984 -276
$EndPAD
$EndMODULE SIOV-S07K17
$MODULE SIOV-S07K175
Po 0 0 0 15 4A19473C 00000000 ~~
Li SIOV-S07K175
Cd Varistor Epcos SIOV-S07K175
Kw R
Sc 0
AR 
Op 0 A 0
T0 0 0 550 500 0 80 N V 21 N "VR"
T1 0 0 550 500 0 80 N V 21 N "Val*"
DS -1772 -787 1772 -787 150 21
DS 1772 -787 1772 787 150 21
DS 1772 787 -1772 787 150 21
DS -1772 787 -1772 -787 150 21
$PAD
Sh "1" C 550 550 0 0 0
Dr 320 0 0
At STD N 00E0FFFF
Ne 0 ""
Po -984 394
$EndPAD
$PAD
Sh "2" C 550 550 0 0 0
Dr 320 0 0
At STD N 00E0FFFF
Ne 0 ""
Po 984 -394
$EndPAD
$EndMODULE SIOV-S07K175
$MODULE SIOV-S07K20
Po 0 0 0 15 4A19473C 00000000 ~~
Li SIOV-S07K20
Cd Varistor Epcos SIOV-S07K20
Kw R
Sc 0
AR 
Op 0 A 0
T0 0 0 550 500 0 80 N V 21 N "VR"
T1 0 0 550 500 0 80 N V 21 N "Val*"
DS -1772 -709 1772 -709 150 21
DS 1772 -709 1772 709 150 21
DS 1772 709 -1772 709 150 21
DS -1772 709 -1772 -709 150 21
$PAD
Sh "1" C 550 550 0 0 0
Dr 320 0 0
At STD N 00E0FFFF
Ne 0 ""
Po -984 236
$EndPAD
$PAD
Sh "2" C 550 550 0 0 0
Dr 320 0 0
At STD N 00E0FFFF
Ne 0 ""
Po 984 -236
$EndPAD
$EndMODULE SIOV-S07K20
$MODULE SIOV-S07K230
Po 0 0 0 15 4A19473C 00000000 ~~
Li SIOV-S07K230
Cd Varistor Epcos SIOV-S07K230
Kw R
Sc 0
AR 
Op 0 A 0
T0 0 0 550 500 0 80 N V 21 N "VR"
T1 0 0 550 500 0 80 N V 21 N "Val*"
DS -1772 -787 1772 -787 150 21
DS 1772 -787 1772 787 150 21
DS 1772 787 -1772 787 150 21
DS -1772 787 -1772 -787 150 21
$PAD
Sh "1" C 550 550 0 0 0
Dr 320 0 0
At STD N 00E0FFFF
Ne 0 ""
Po -984 354
$EndPAD
$PAD
Sh "2" C 550 550 0 0 0
Dr 320 0 0
At STD N 00E0FFFF
Ne 0 ""
Po 984 -354
$EndPAD
$EndMODULE SIOV-S07K230
$MODULE SIOV-S07K25
Po 0 0 0 15 4A19473C 00000000 ~~
Li SIOV-S07K25
Cd Varistor Epcos SIOV-S07K25
Kw R
Sc 0
AR 
Op 0 A 0
T0 0 0 550 500 0 80 N V 21 N "VR"
T1 0 0 550 500 0 80 N V 21 N "Val*"
DS -1772 -728 1772 -728 150 21
DS 1772 -728 1772 728 150 21
DS 1772 728 -1772 728 150 21
DS -1772 728 -1772 -728 150 21
$PAD
Sh "1" C 550 550 0 0 0
Dr 320 0 0
At STD N 00E0FFFF
Ne 0 ""
Po -984 256
$EndPAD
$PAD
Sh "2" C 550 550 0 0 0
Dr 320 0 0
At STD N 00E0FFFF
Ne 0 ""
Po 984 -256
$EndPAD
$EndMODULE SIOV-S07K25
$MODULE SIOV-S07K250
Po 0 0 0 15 4A19473C 00000000 ~~
Li SIOV-S07K250
Cd Varistor Epcos SIOV-S07K250
Kw R
Sc 0
AR 
Op 0 A 0
T0 0 0 550 500 0 80 N V 21 N "VR"
T1 0 0 550 500 0 80 N V 21 N "Val*"
DS -1772 -827 1772 -827 150 21
DS 1772 -827 1772 827 150 21
DS 1772 827 -1772 827 150 21
DS -1772 827 -1772 -827 150 21
$PAD
Sh "1" C 550 550 0 0 0
Dr 320 0 0
At STD N 00E0FFFF
Ne 0 ""
Po -984 354
$EndPAD
$PAD
Sh "2" C 550 550 0 0 0
Dr 320 0 0
At STD N 00E0FFFF
Ne 0 ""
Po 984 -354
$EndPAD
$EndMODULE SIOV-S07K250
$MODULE SIOV-S07K275
Po 0 0 0 15 4A19473C 00000000 ~~
Li SIOV-S07K275
Cd Varistor Epcos SIOV-S07K275
Kw R
Sc 0
AR 
Op 0 A 0
T0 0 0 550 500 0 80 N V 21 N "VR"
T1 0 0 550 500 0 80 N V 21 N "Val*"
DS -1772 -866 1772 -866 150 21
DS 1772 -866 1772 866 150 21
DS 1772 866 -1772 866 150 21
DS -1772 866 -1772 -866 150 21
$PAD
Sh "1" C 550 550 0 0 0
Dr 320 0 0
At STD N 00E0FFFF
Ne 0 ""
Po -984 394
$EndPAD
$PAD
Sh "2" C 550 550 0 0 0
Dr 320 0 0
At STD N 00E0FFFF
Ne 0 ""
Po 984 -394
$EndPAD
$EndMODULE SIOV-S07K275
$MODULE SIOV-S07K30
Po 0 0 0 15 4A19473C 00000000 ~~
Li SIOV-S07K30
Cd Varistor Epcos SIOV-S07K30
Kw R
Sc 0
AR 
Op 0 A 0
T0 0 0 550 500 0 80 N V 21 N "VR"
T1 0 0 550 500 0 80 N V 21 N "Val*"
DS -1772 -728 1772 -728 150 21
DS 1772 -728 1772 728 150 21
DS 1772 728 -1772 728 150 21
DS -1772 728 -1772 -728 150 21
$PAD
Sh "1" C 550 550 0 0 0
Dr 320 0 0
At STD N 00E0FFFF
Ne 0 ""
Po -984 295
$EndPAD
$PAD
Sh "2" C 550 550 0 0 0
Dr 320 0 0
At STD N 00E0FFFF
Ne 0 ""
Po 984 -295
$EndPAD
$EndMODULE SIOV-S07K30
$MODULE SIOV-S07K300
Po 0 0 0 15 4A19473C 00000000 ~~
Li SIOV-S07K300
Cd Varistor Epcos SIOV-S07K300
Kw R
Sc 0
AR 
Op 0 A 0
T0 0 0 550 500 0 80 N V 21 N "VR"
T1 0 0 550 500 0 80 N V 21 N "Val*"
DS -1772 -886 1772 -886 150 21
DS 1772 -886 1772 886 150 21
DS 1772 886 -1772 886 150 21
DS -1772 886 -1772 -886 150 21
$PAD
Sh "1" C 550 550 0 0 0
Dr 320 0 0
At STD N 00E0FFFF
Ne 0 ""
Po -984 413
$EndPAD
$PAD
Sh "2" C 550 550 0 0 0
Dr 320 0 0
At STD N 00E0FFFF
Ne 0 ""
Po 984 -413
$EndPAD
$EndMODULE SIOV-S07K300
$MODULE SIOV-S07K35
Po 0 0 0 15 4A19473C 00000000 ~~
Li SIOV-S07K35
Cd Varistor Epcos SIOV-S07K35
Kw R
Sc 0
AR 
Op 0 A 0
T0 0 0 550 500 0 80 N V 21 N "VR"
T1 0 0 550 500 0 80 N V 21 N "Val*"
DS -1772 -768 1772 -768 150 21
DS 1772 -768 1772 768 150 21
DS 1772 768 -1772 768 150 21
DS -1772 768 -1772 -768 150 21
$PAD
Sh "1" C 550 550 0 0 0
Dr 320 0 0
At STD N 00E0FFFF
Ne 0 ""
Po -984 315
$EndPAD
$PAD
Sh "2" C 550 550 0 0 0
Dr 320 0 0
At STD N 00E0FFFF
Ne 0 ""
Po 984 -315
$EndPAD
$EndMODULE SIOV-S07K35
$MODULE SIOV-S07K385
Po 0 0 0 15 4A19473C 00000000 ~~
Li SIOV-S07K385
Cd Varistor Epcos SIOV-S07K385
Kw R
Sc 0
AR 
Op 0 A 0
T0 0 0 550 500 0 80 N V 21 N "VR"
T1 0 0 550 500 0 80 N V 21 N "Val*"
DS -1772 -1024 1772 -1024 150 21
DS 1772 -1024 1772 1024 150 21
DS 1772 1024 -1772 1024 150 21
DS -1772 1024 -1772 -1024 150 21
$PAD
Sh "1" C 550 550 0 0 0
Dr 320 0 0
At STD N 00E0FFFF
Ne 0 ""
Po -984 492
$EndPAD
$PAD
Sh "2" C 550 550 0 0 0
Dr 320 0 0
At STD N 00E0FFFF
Ne 0 ""
Po 984 -492
$EndPAD
$EndMODULE SIOV-S07K385
$MODULE SIOV-S07K40
Po 0 0 0 15 4A19473C 00000000 ~~
Li SIOV-S07K40
Cd Varistor Epcos SIOV-S07K40
Kw R
Sc 0
AR 
Op 0 A 0
T0 0 0 550 500 0 80 N V 21 N "VR"
T1 0 0 550 500 0 80 N V 21 N "Val*"
DS -1772 -807 1772 -807 150 21
DS 1772 -807 1772 807 150 21
DS 1772 807 -1772 807 150 21
DS -1772 807 -1772 -807 150 21
$PAD
Sh "1" C 550 550 0 0 0
Dr 320 0 0
At STD N 00E0FFFF
Ne 0 ""
Po -984 354
$EndPAD
$PAD
Sh "2" C 550 550 0 0 0
Dr 320 0 0
At STD N 00E0FFFF
Ne 0 ""
Po 984 -354
$EndPAD
$EndMODULE SIOV-S07K40
$MODULE SIOV-S07K420
Po 0 0 0 15 4A19473C 00000000 ~~
Li SIOV-S07K420
Cd Varistor Epcos SIOV-S07K420
Kw R
Sc 0
AR 
Op 0 A 0
T0 0 0 550 500 0 80 N V 21 N "VR"
T1 0 0 550 500 0 80 N V 21 N "Val*"
DS -1772 -1063 1772 -1063 150 21
DS 1772 -1063 1772 1063 150 21
DS 1772 1063 -1772 1063 150 21
DS -1772 1063 -1772 -1063 150 21
$PAD
Sh "1" C 550 550 0 0 0
Dr 320 0 0
At STD N 00E0FFFF
Ne 0 ""
Po -984 551
$EndPAD
$PAD
Sh "2" C 550 550 0 0 0
Dr 320 0 0
At STD N 00E0FFFF
Ne 0 ""
Po 984 -551
$EndPAD
$EndMODULE SIOV-S07K420
$MODULE SIOV-S07K440
Po 0 0 0 15 4A19473C 00000000 ~~
Li SIOV-S07K440
Cd Varistor Epcos SIOV-S07K440
Kw R
Sc 0
AR 
Op 0 A 0
T0 0 0 550 500 0 80 N V 21 N "VR"
T1 0 0 550 500 0 80 N V 21 N "Val*"
DS -1772 -1083 1772 -1083 150 21
DS 1772 -1083 1772 1083 150 21
DS 1772 1083 -1772 1083 150 21
DS -1772 1083 -1772 -1083 150 21
$PAD
Sh "1" C 550 550 0 0 0
Dr 320 0 0
At STD N 00E0FFFF
Ne 0 ""
Po -984 551
$EndPAD
$PAD
Sh "2" C 550 550 0 0 0
Dr 320 0 0
At STD N 00E0FFFF
Ne 0 ""
Po 984 -551
$EndPAD
$EndMODULE SIOV-S07K440
$MODULE SIOV-S07K460
Po 0 0 0 15 4A19473C 00000000 ~~
Li SIOV-S07K460
Cd Varistor Epcos SIOV-S07K460
Kw R
Sc 0
AR 
Op 0 A 0
T0 0 0 550 500 0 80 N V 21 N "VR"
T1 0 0 550 500 0 80 N V 21 N "Val*"
DS -1772 -1122 1772 -1122 150 21
DS 1772 -1122 1772 1122 150 21
DS 1772 1122 -1772 1122 150 21
DS -1772 1122 -1772 -1122 150 21
$PAD
Sh "1" C 550 550 0 0 0
Dr 320 0 0
At STD N 00E0FFFF
Ne 0 ""
Po -984 591
$EndPAD
$PAD
Sh "2" C 550 550 0 0 0
Dr 320 0 0
At STD N 00E0FFFF
Ne 0 ""
Po 984 -591
$EndPAD
$EndMODULE SIOV-S07K460
$MODULE SIOV-S07K50
Po 0 0 0 15 4A19473C 00000000 ~~
Li SIOV-S07K50
Cd Varistor Epcos SIOV-S07K50
Kw R
Sc 0
AR 
Op 0 A 0
T0 0 0 550 500 0 80 N V 21 N "VR"
T1 0 0 550 500 0 80 N V 21 N "Val*"
DS -1772 -650 1772 -650 150 21
DS 1772 -650 1772 650 150 21
DS 1772 650 -1772 650 150 21
DS -1772 650 -1772 -650 150 21
$PAD
Sh "1" C 550 550 0 0 0
Dr 320 0 0
At STD N 00E0FFFF
Ne 0 ""
Po -984 236
$EndPAD
$PAD
Sh "2" C 550 550 0 0 0
Dr 320 0 0
At STD N 00E0FFFF
Ne 0 ""
Po 984 -236
$EndPAD
$EndMODULE SIOV-S07K50
$MODULE SIOV-S07K60
Po 0 0 0 15 4A19473C 00000000 ~~
Li SIOV-S07K60
Cd Varistor Epcos SIOV-S07K60
Kw R
Sc 0
AR 
Op 0 A 0
T0 0 0 550 500 0 80 N V 21 N "VR"
T1 0 0 550 500 0 80 N V 21 N "Val*"
DS -1772 -650 1772 -650 150 21
DS 1772 -650 1772 650 150 21
DS 1772 650 -1772 650 150 21
DS -1772 650 -1772 -650 150 21
$PAD
Sh "1" C 550 550 0 0 0
Dr 320 0 0
At STD N 00E0FFFF
Ne 0 ""
Po -984 236
$EndPAD
$PAD
Sh "2" C 550 550 0 0 0
Dr 320 0 0
At STD N 00E0FFFF
Ne 0 ""
Po 984 -236
$EndPAD
$EndMODULE SIOV-S07K60
$MODULE SIOV-S07K75
Po 0 0 0 15 4A19473C 00000000 ~~
Li SIOV-S07K75
Cd Varistor Epcos SIOV-S07K75
Kw R
Sc 0
AR 
Op 0 A 0
T0 0 0 550 500 0 80 N V 21 N "VR"
T1 0 0 550 500 0 80 N V 21 N "Val*"
DS -1772 -709 1772 -709 150 21
DS 1772 -709 1772 709 150 21
DS 1772 709 -1772 709 150 21
DS -1772 709 -1772 -709 150 21
$PAD
Sh "1" C 550 550 0 0 0
Dr 320 0 0
At STD N 00E0FFFF
Ne 0 ""
Po -984 256
$EndPAD
$PAD
Sh "2" C 550 550 0 0 0
Dr 320 0 0
At STD N 00E0FFFF
Ne 0 ""
Po 984 -256
$EndPAD
$EndMODULE SIOV-S07K75
$MODULE SIOV-S07K95
Po 0 0 0 15 4A19473C 00000000 ~~
Li SIOV-S07K95
Cd Varistor Epcos SIOV-S07K95
Kw R
Sc 0
AR 
Op 0 A 0
T0 0 0 550 500 0 80 N V 21 N "VR"
T1 0 0 550 500 0 80 N V 21 N "Val*"
DS -1772 -669 1772 -669 150 21
DS 1772 -669 1772 669 150 21
DS 1772 669 -1772 669 150 21
DS -1772 669 -1772 -669 150 21
$PAD
Sh "1" C 550 550 0 0 0
Dr 320 0 0
At STD N 00E0FFFF
Ne 0 ""
Po -984 256
$EndPAD
$PAD
Sh "2" C 550 550 0 0 0
Dr 320 0 0
At STD N 00E0FFFF
Ne 0 ""
Po 984 -256
$EndPAD
$EndMODULE SIOV-S07K95
$MODULE SIOV-S10K11
Po 0 0 0 15 4A19473C 00000000 ~~
Li SIOV-S10K11
Cd Varistor Epcos SIOV-S10K11
Kw R
Sc 0
AR 
Op 0 A 0
T0 0 0 550 500 0 80 N V 21 N "VR"
T1 0 0 550 500 0 80 N V 21 N "Val*"
DS -2362 -787 2362 -787 150 21
DS 2362 -787 2362 787 150 21
DS 2362 787 -2362 787 150 21
DS -2362 787 -2362 -787 150 21
$PAD
Sh "1" C 550 550 0 0 0
Dr 320 0 0
At STD N 00E0FFFF
Ne 0 ""
Po -1476 276
$EndPAD
$PAD
Sh "2" C 550 550 0 0 0
Dr 320 0 0
At STD N 00E0FFFF
Ne 0 ""
Po 1476 -276
$EndPAD
$EndMODULE SIOV-S10K11
$MODULE SIOV-S10K115
Po 0 0 0 15 4A19473C 00000000 ~~
Li SIOV-S10K115
Cd Varistor Epcos SIOV-S10K115
Kw R
Sc 0
AR 
Op 0 A 0
T0 0 0 550 500 0 80 N V 21 N "VR"
T1 0 0 550 500 0 80 N V 21 N "Val*"
DS -2362 -827 2362 -827 150 21
DS 2362 -827 2362 827 150 21
DS 2362 827 -2362 827 150 21
DS -2362 827 -2362 -827 150 21
$PAD
Sh "1" C 550 550 0 0 0
Dr 320 0 0
At STD N 00E0FFFF
Ne 0 ""
Po -1476 315
$EndPAD
$PAD
Sh "2" C 550 550 0 0 0
Dr 320 0 0
At STD N 00E0FFFF
Ne 0 ""
Po 1476 -315
$EndPAD
$EndMODULE SIOV-S10K115
$MODULE SIOV-S10K130
Po 0 0 0 15 4A19473C 00000000 ~~
Li SIOV-S10K130
Cd Varistor Epcos SIOV-S10K130
Kw R
Sc 0
AR 
Op 0 A 0
T0 0 0 550 500 0 80 N V 21 N "VR"
T1 0 0 550 500 0 80 N V 21 N "Val*"
DS -2362 -827 2362 -827 150 21
DS 2362 -827 2362 827 150 21
DS 2362 827 -2362 827 150 21
DS -2362 827 -2362 -827 150 21
$PAD
Sh "1" C 550 550 0 0 0
Dr 320 0 0
At STD N 00E0FFFF
Ne 0 ""
Po -1476 354
$EndPAD
$PAD
Sh "2" C 550 550 0 0 0
Dr 320 0 0
At STD N 00E0FFFF
Ne 0 ""
Po 1476 -354
$EndPAD
$EndMODULE SIOV-S10K130
$MODULE SIOV-S10K14
Po 0 0 0 15 4A19473C 00000000 ~~
Li SIOV-S10K14
Cd Varistor Epcos SIOV-S10K14
Kw R
Sc 0
AR 
Op 0 A 0
T0 0 0 550 500 0 80 N V 21 N "VR"
T1 0 0 550 500 0 80 N V 21 N "Val*"
DS -2362 -827 2362 -827 150 21
DS 2362 -827 2362 827 150 21
DS 2362 827 -2362 827 150 21
DS -2362 827 -2362 -827 150 21
$PAD
Sh "1" C 550 550 0 0 0
Dr 320 0 0
At STD N 00E0FFFF
Ne 0 ""
Po -1476 295
$EndPAD
$PAD
Sh "2" C 550 550 0 0 0
Dr 320 0 0
At STD N 00E0FFFF
Ne 0 ""
Po 1476 -295
$EndPAD
$EndMODULE SIOV-S10K14
$MODULE SIOV-S10K140
Po 0 0 0 15 4A19473C 00000000 ~~
Li SIOV-S10K140
Cd Varistor Epcos SIOV-S10K140
Kw R
Sc 0
AR 
Op 0 A 0
T0 0 0 550 500 0 80 N V 21 N "VR"
T1 0 0 550 500 0 80 N V 21 N "Val*"
DS -2362 -846 2362 -846 150 21
DS 2362 -846 2362 846 150 21
DS 2362 846 -2362 846 150 21
DS -2362 846 -2362 -846 150 21
$PAD
Sh "1" C 550 550 0 0 0
Dr 320 0 0
At STD N 00E0FFFF
Ne 0 ""
Po -1476 374
$EndPAD
$PAD
Sh "2" C 550 550 0 0 0
Dr 320 0 0
At STD N 00E0FFFF
Ne 0 ""
Po 1476 -374
$EndPAD
$EndMODULE SIOV-S10K140
$MODULE SIOV-S10K150
Po 0 0 0 15 4A19473C 00000000 ~~
Li SIOV-S10K150
Cd Varistor Epcos SIOV-S10K150
Kw R
Sc 0
AR 
Op 0 A 0
T0 0 0 550 500 0 80 N V 21 N "VR"
T1 0 0 550 500 0 80 N V 21 N "Val*"
DS -2362 -866 2362 -866 150 21
DS 2362 -866 2362 866 150 21
DS 2362 866 -2362 866 150 21
DS -2362 866 -2362 -866 150 21
$PAD
Sh "1" C 550 550 0 0 0
Dr 320 0 0
At STD N 00E0FFFF
Ne 0 ""
Po -1476 394
$EndPAD
$PAD
Sh "2" C 550 550 0 0 0
Dr 320 0 0
At STD N 00E0FFFF
Ne 0 ""
Po 1476 -394
$EndPAD
$EndMODULE SIOV-S10K150
$MODULE SIOV-S10K17
Po 0 0 0 15 4A19473C 00000000 ~~
Li SIOV-S10K17
Cd Varistor Epcos SIOV-S10K17
Kw R
Sc 0
AR 
Op 0 A 0
T0 0 0 550 500 0 80 N V 21 N "VR"
T1 0 0 550 500 0 80 N V 21 N "Val*"
DS -2362 -866 2362 -866 150 21
DS 2362 -866 2362 866 150 21
DS 2362 866 -2362 866 150 21
DS -2362 866 -2362 -866 150 21
$PAD
Sh "1" C 550 550 0 0 0
Dr 320 0 0
At STD N 00E0FFFF
Ne 0 ""
Po -1476 315
$EndPAD
$PAD
Sh "2" C 550 550 0 0 0
Dr 320 0 0
At STD N 00E0FFFF
Ne 0 ""
Po 1476 -315
$EndPAD
$EndMODULE SIOV-S10K17
$MODULE SIOV-S10K175
Po 0 0 0 15 4A19473C 00000000 ~~
Li SIOV-S10K175
Cd Varistor Epcos SIOV-S10K175
Kw R
Sc 0
AR 
Op 0 A 0
T0 0 0 550 500 0 80 N V 21 N "VR"
T1 0 0 550 500 0 80 N V 21 N "Val*"
DS -2362 -906 2362 -906 150 21
DS 2362 -906 2362 906 150 21
DS 2362 906 -2362 906 150 21
DS -2362 906 -2362 -906 150 21
$PAD
Sh "1" C 550 550 0 0 0
Dr 320 0 0
At STD N 00E0FFFF
Ne 0 ""
Po -1476 433
$EndPAD
$PAD
Sh "2" C 550 550 0 0 0
Dr 320 0 0
At STD N 00E0FFFF
Ne 0 ""
Po 1476 -433
$EndPAD
$EndMODULE SIOV-S10K175
$MODULE SIOV-S10K20
Po 0 0 0 15 4A19473C 00000000 ~~
Li SIOV-S10K20
Cd Varistor Epcos SIOV-S10K20
Kw R
Sc 0
AR 
Op 0 A 0
T0 0 0 550 500 0 80 N V 21 N "VR"
T1 0 0 550 500 0 80 N V 21 N "Val*"
DS -2362 -886 2362 -886 150 21
DS 2362 -886 2362 886 150 21
DS 2362 886 -2362 886 150 21
DS -2362 886 -2362 -886 150 21
$PAD
Sh "1" C 550 550 0 0 0
Dr 320 0 0
At STD N 00E0FFFF
Ne 0 ""
Po -1476 354
$EndPAD
$PAD
Sh "2" C 550 550 0 0 0
Dr 320 0 0
At STD N 00E0FFFF
Ne 0 ""
Po 1476 -354
$EndPAD
$EndMODULE SIOV-S10K20
$MODULE SIOV-S10K230
Po 0 0 0 15 4A19473C 00000000 ~~
Li SIOV-S10K230
Cd Varistor Epcos SIOV-S10K230
Kw R
Sc 0
AR 
Op 0 A 0
T0 0 0 550 500 0 80 N V 21 N "VR"
T1 0 0 550 500 0 80 N V 21 N "Val*"
DS -2362 -925 2362 -925 150 21
DS 2362 -925 2362 925 150 21
DS 2362 925 -2362 925 150 21
DS -2362 925 -2362 -925 150 21
$PAD
Sh "1" C 550 550 0 0 0
Dr 320 0 0
At STD N 00E0FFFF
Ne 0 ""
Po -1476 394
$EndPAD
$PAD
Sh "2" C 550 550 0 0 0
Dr 320 0 0
At STD N 00E0FFFF
Ne 0 ""
Po 1476 -394
$EndPAD
$EndMODULE SIOV-S10K230
$MODULE SIOV-S10K25
Po 0 0 0 15 4A19473C 00000000 ~~
Li SIOV-S10K25
Cd Varistor Epcos SIOV-S10K25
Kw R
Sc 0
AR 
Op 0 A 0
T0 0 0 550 500 0 80 N V 21 N "VR"
T1 0 0 550 500 0 80 N V 21 N "Val*"
DS -2362 -827 2362 -827 150 21
DS 2362 -827 2362 827 150 21
DS 2362 827 -2362 827 150 21
DS -2362 827 -2362 -827 150 21
$PAD
Sh "1" C 550 550 0 0 0
Dr 320 0 0
At STD N 00E0FFFF
Ne 0 ""
Po -1476 315
$EndPAD
$PAD
Sh "2" C 550 550 0 0 0
Dr 320 0 0
At STD N 00E0FFFF
Ne 0 ""
Po 1476 -315
$EndPAD
$EndMODULE SIOV-S10K25
$MODULE SIOV-S10K250
Po 0 0 0 15 4A19473C 00000000 ~~
Li SIOV-S10K250
Cd Varistor Epcos SIOV-S10K250
Kw R
Sc 0
AR 
Op 0 A 0
T0 0 0 550 500 0 80 N V 21 N "VR"
T1 0 0 550 500 0 80 N V 21 N "Val*"
DS -2362 -945 2362 -945 150 21
DS 2362 -945 2362 945 150 21
DS 2362 945 -2362 945 150 21
DS -2362 945 -2362 -945 150 21
$PAD
Sh "1" C 550 550 0 0 0
Dr 320 0 0
At STD N 00E0FFFF
Ne 0 ""
Po -1476 394
$EndPAD
$PAD
Sh "2" C 550 550 0 0 0
Dr 320 0 0
At STD N 00E0FFFF
Ne 0 ""
Po 1476 -394
$EndPAD
$EndMODULE SIOV-S10K250
$MODULE SIOV-S10K275
Po 0 0 0 15 4A19473C 00000000 ~~
Li SIOV-S10K275
Cd Varistor Epcos SIOV-S10K275
Kw R
Sc 0
AR 
Op 0 A 0
T0 0 0 550 500 0 80 N V 21 N "VR"
T1 0 0 550 500 0 80 N V 21 N "Val*"
DS -2362 -984 2362 -984 150 21
DS 2362 -984 2362 984 150 21
DS 2362 984 -2362 984 150 21
DS -2362 984 -2362 -984 150 21
$PAD
Sh "1" C 550 550 0 0 0
Dr 320 0 0
At STD N 00E0FFFF
Ne 0 ""
Po -1476 433
$EndPAD
$PAD
Sh "2" C 550 550 0 0 0
Dr 320 0 0
At STD N 00E0FFFF
Ne 0 ""
Po 1476 -433
$EndPAD
$EndMODULE SIOV-S10K275
$MODULE SIOV-S10K30
Po 0 0 0 15 4A19473C 00000000 ~~
Li SIOV-S10K30
Cd Varistor Epcos SIOV-S10K30
Kw R
Sc 0
AR 
Op 0 A 0
T0 0 0 550 500 0 80 N V 21 N "VR"
T1 0 0 550 500 0 80 N V 21 N "Val*"
DS -2362 -866 2362 -866 150 21
DS 2362 -866 2362 866 150 21
DS 2362 866 -2362 866 150 21
DS -2362 866 -2362 -866 150 21
$PAD
Sh "1" C 550 550 0 0 0
Dr 320 0 0
At STD N 00E0FFFF
Ne 0 ""
Po -1476 335
$EndPAD
$PAD
Sh "2" C 550 550 0 0 0
Dr 320 0 0
At STD N 00E0FFFF
Ne 0 ""
Po 1476 -335
$EndPAD
$EndMODULE SIOV-S10K30
$MODULE SIOV-S10K300
Po 0 0 0 15 4A19473C 00000000 ~~
Li SIOV-S10K300
Cd Varistor Epcos SIOV-S10K300
Kw R
Sc 0
AR 
Op 0 A 0
T0 0 0 550 500 0 80 N V 21 N "VR"
T1 0 0 550 500 0 80 N V 21 N "Val*"
DS -2362 -1004 2362 -1004 150 21
DS 2362 -1004 2362 1004 150 21
DS 2362 1004 -2362 1004 150 21
DS -2362 1004 -2362 -1004 150 21
$PAD
Sh "1" C 550 550 0 0 0
Dr 320 0 0
At STD N 00E0FFFF
Ne 0 ""
Po -1476 453
$EndPAD
$PAD
Sh "2" C 550 550 0 0 0
Dr 320 0 0
At STD N 00E0FFFF
Ne 0 ""
Po 1476 -453
$EndPAD
$EndMODULE SIOV-S10K300
$MODULE SIOV-S10K320
Po 0 0 0 15 4A19473C 00000000 ~~
Li SIOV-S10K320
Cd Varistor Epcos SIOV-S10K320
Kw R
Sc 0
AR 
Op 0 A 0
T0 0 0 550 500 0 80 N V 21 N "VR"
T1 0 0 550 500 0 80 N V 21 N "Val*"
DS -2362 -1063 2362 -1063 150 21
DS 2362 -1063 2362 1063 150 21
DS 2362 1063 -2362 1063 150 21
DS -2362 1063 -2362 -1063 150 21
$PAD
Sh "1" C 550 550 0 0 0
Dr 320 0 0
At STD N 00E0FFFF
Ne 0 ""
Po -1476 472
$EndPAD
$PAD
Sh "2" C 550 550 0 0 0
Dr 320 0 0
At STD N 00E0FFFF
Ne 0 ""
Po 1476 -472
$EndPAD
$EndMODULE SIOV-S10K320
$MODULE SIOV-S10K35
Po 0 0 0 15 4A19473C 00000000 ~~
Li SIOV-S10K35
Cd Varistor Epcos SIOV-S10K35
Kw R
Sc 0
AR 
Op 0 A 0
T0 0 0 550 500 0 80 N V 21 N "VR"
T1 0 0 550 500 0 80 N V 21 N "Val*"
DS -2362 -866 2362 -866 150 21
DS 2362 -866 2362 866 150 21
DS 2362 866 -2362 866 150 21
DS -2362 866 -2362 -866 150 21
$PAD
Sh "1" C 550 550 0 0 0
Dr 320 0 0
At STD N 00E0FFFF
Ne 0 ""
Po -1476 354
$EndPAD
$PAD
Sh "2" C 550 550 0 0 0
Dr 320 0 0
At STD N 00E0FFFF
Ne 0 ""
Po 1476 -354
$EndPAD
$EndMODULE SIOV-S10K35
$MODULE SIOV-S10K385
Po 0 0 0 15 4A19473C 00000000 ~~
Li SIOV-S10K385
Cd Varistor Epcos SIOV-S10K385
Kw R
Sc 0
AR 
Op 0 A 0
T0 0 0 550 500 0 80 N V 21 N "VR"
T1 0 0 550 500 0 80 N V 21 N "Val*"
DS -2362 -1142 2362 -1142 150 21
DS 2362 -1142 2362 1142 150 21
DS 2362 1142 -2362 1142 150 21
DS -2362 1142 -2362 -1142 150 21
$PAD
Sh "1" C 550 550 0 0 0
Dr 320 0 0
At STD N 00E0FFFF
Ne 0 ""
Po -1476 531
$EndPAD
$PAD
Sh "2" C 550 550 0 0 0
Dr 320 0 0
At STD N 00E0FFFF
Ne 0 ""
Po 1476 -531
$EndPAD
$EndMODULE SIOV-S10K385
$MODULE SIOV-S10K40
Po 0 0 0 15 4A19473C 00000000 ~~
Li SIOV-S10K40
Cd Varistor Epcos SIOV-S10K40
Kw R
Sc 0
AR 
Op 0 A 0
T0 0 0 550 500 0 80 N V 21 N "VR"
T1 0 0 550 500 0 80 N V 21 N "Val*"
DS -2362 -945 2362 -945 150 21
DS 2362 -945 2362 945 150 21
DS 2362 945 -2362 945 150 21
DS -2362 945 -2362 -945 150 21
$PAD
Sh "1" C 550 550 0 0 0
Dr 320 0 0
At STD N 00E0FFFF
Ne 0 ""
Po -1476 413
$EndPAD
$PAD
Sh "2" C 550 550 0 0 0
Dr 320 0 0
At STD N 00E0FFFF
Ne 0 ""
Po 1476 -413
$EndPAD
$EndMODULE SIOV-S10K40
$MODULE SIOV-S10K420
Po 0 0 0 15 4A19473C 00000000 ~~
Li SIOV-S10K420
Cd Varistor Epcos SIOV-S10K420
Kw R
Sc 0
AR 
Op 0 A 0
T0 0 0 550 500 0 80 N V 21 N "VR"
T1 0 0 550 500 0 80 N V 21 N "Val*"
DS -2362 -1201 2362 -1201 150 21
DS 2362 -1201 2362 1201 150 21
DS 2362 1201 -2362 1201 150 21
DS -2362 1201 -2362 -1201 150 21
$PAD
Sh "1" C 550 550 0 0 0
Dr 320 0 0
At STD N 00E0FFFF
Ne 0 ""
Po -1476 571
$EndPAD
$PAD
Sh "2" C 550 550 0 0 0
Dr 320 0 0
At STD N 00E0FFFF
Ne 0 ""
Po 1476 -571
$EndPAD
$EndMODULE SIOV-S10K420
$MODULE SIOV-S10K440
Po 0 0 0 15 4A19473C 00000000 ~~
Li SIOV-S10K440
Cd Varistor Epcos SIOV-S10K440
Kw R
Sc 0
AR 
Op 0 A 0
T0 0 0 550 500 0 80 N V 21 N "VR"
T1 0 0 550 500 0 80 N V 21 N "Val*"
DS -2362 -1220 2362 -1220 150 21
DS 2362 -1220 2362 1220 150 21
DS 2362 1220 -2362 1220 150 21
DS -2362 1220 -2362 -1220 150 21
$PAD
Sh "1" C 550 550 0 0 0
Dr 320 0 0
At STD N 00E0FFFF
Ne 0 ""
Po -1476 591
$EndPAD
$PAD
Sh "2" C 550 550 0 0 0
Dr 320 0 0
At STD N 00E0FFFF
Ne 0 ""
Po 1476 -591
$EndPAD
$EndMODULE SIOV-S10K440
$MODULE SIOV-S10K460
Po 0 0 0 15 4A19473C 00000000 ~~
Li SIOV-S10K460
Cd Varistor Epcos SIOV-S10K460
Kw R
Sc 0
AR 
Op 0 A 0
T0 0 0 550 500 0 80 N V 21 N "VR"
T1 0 0 550 500 0 80 N V 21 N "Val*"
DS -2362 -1240 2362 -1240 150 21
DS 2362 -1240 2362 1240 150 21
DS 2362 1240 -2362 1240 150 21
DS -2362 1240 -2362 -1240 150 21
$PAD
Sh "1" C 550 550 0 0 0
Dr 320 0 0
At STD N 00E0FFFF
Ne 0 ""
Po -1476 610
$EndPAD
$PAD
Sh "2" C 550 550 0 0 0
Dr 320 0 0
At STD N 00E0FFFF
Ne 0 ""
Po 1476 -610
$EndPAD
$EndMODULE SIOV-S10K460
$MODULE SIOV-S10K50
Po 0 0 0 15 4A19473C 00000000 ~~
Li SIOV-S10K50
Cd Varistor Epcos SIOV-S10K50
Kw R
Sc 0
AR 
Op 0 A 0
T0 0 0 550 500 0 80 N V 21 N "VR"
T1 0 0 550 500 0 80 N V 21 N "Val*"
DS -2362 -768 2362 -768 150 21
DS 2362 -768 2362 768 150 21
DS 2362 768 -2362 768 150 21
DS -2362 768 -2362 -768 150 21
$PAD
Sh "1" C 550 550 0 0 0
Dr 320 0 0
At STD N 00E0FFFF
Ne 0 ""
Po -1476 276
$EndPAD
$PAD
Sh "2" C 550 550 0 0 0
Dr 320 0 0
At STD N 00E0FFFF
Ne 0 ""
Po 1476 -276
$EndPAD
$EndMODULE SIOV-S10K50
$MODULE SIOV-S10K510
Po 0 0 0 15 4A19473C 00000000 ~~
Li SIOV-S10K510
Cd Varistor Epcos SIOV-S10K510
Kw R
Sc 0
AR 
Op 0 A 0
T0 0 0 550 500 0 80 N V 21 N "VR"
T1 0 0 550 500 0 80 N V 21 N "Val*"
DS -2362 -1319 2362 -1319 150 21
DS 2362 -1319 2362 1319 150 21
DS 2362 1319 -2362 1319 150 21
DS -2362 1319 -2362 -1319 150 21
$PAD
Sh "1" C 550 550 0 0 0
Dr 320 0 0
At STD N 00E0FFFF
Ne 0 ""
Po -1476 669
$EndPAD
$PAD
Sh "2" C 550 550 0 0 0
Dr 320 0 0
At STD N 00E0FFFF
Ne 0 ""
Po 1476 -669
$EndPAD
$EndMODULE SIOV-S10K510
$MODULE SIOV-S10K550
Po 0 0 0 15 4A19473C 00000000 ~~
Li SIOV-S10K550
Cd Varistor Epcos SIOV-S10K550
Kw R
Sc 0
AR 
Op 0 A 0
T0 0 0 550 500 0 80 N V 21 N "VR"
T1 0 0 550 500 0 80 N V 21 N "Val*"
DS -2362 -1398 2362 -1398 150 21
DS 2362 -1398 2362 1398 150 21
DS 2362 1398 -2362 1398 150 21
DS -2362 1398 -2362 -1398 150 21
$PAD
Sh "1" C 550 550 0 0 0
Dr 320 0 0
At STD N 00E0FFFF
Ne 0 ""
Po -1476 728
$EndPAD
$PAD
Sh "2" C 550 550 0 0 0
Dr 320 0 0
At STD N 00E0FFFF
Ne 0 ""
Po 1476 -728
$EndPAD
$EndMODULE SIOV-S10K550
$MODULE SIOV-S10K60
Po 0 0 0 15 4A19473C 00000000 ~~
Li SIOV-S10K60
Cd Varistor Epcos SIOV-S10K60
Kw R
Sc 0
AR 
Op 0 A 0
T0 0 0 550 500 0 80 N V 21 N "VR"
T1 0 0 550 500 0 80 N V 21 N "Val*"
DS -2362 -787 2362 -787 150 21
DS 2362 -787 2362 787 150 21
DS 2362 787 -2362 787 150 21
DS -2362 787 -2362 -787 150 21
$PAD
Sh "1" C 550 550 0 0 0
Dr 320 0 0
At STD N 00E0FFFF
Ne 0 ""
Po -1476 276
$EndPAD
$PAD
Sh "2" C 550 550 0 0 0
Dr 320 0 0
At STD N 00E0FFFF
Ne 0 ""
Po 1476 -276
$EndPAD
$EndMODULE SIOV-S10K60
$MODULE SIOV-S10K625
Po 0 0 0 15 4A19473C 00000000 ~~
Li SIOV-S10K625
Cd Varistor Epcos SIOV-S10K625
Kw R
Sc 0
AR 
Op 0 A 0
T0 0 0 550 500 0 80 N V 21 N "VR"
T1 0 0 550 500 0 80 N V 21 N "Val*"
DS -2362 -1476 2362 -1476 150 21
DS 2362 -1476 2362 1476 150 21
DS 2362 1476 -2362 1476 150 21
DS -2362 1476 -2362 -1476 150 21
$PAD
Sh "1" C 550 550 0 0 0
Dr 320 0 0
At STD N 00E0FFFF
Ne 0 ""
Po -1476 787
$EndPAD
$PAD
Sh "2" C 550 550 0 0 0
Dr 320 0 0
At STD N 00E0FFFF
Ne 0 ""
Po 1476 -787
$EndPAD
$EndMODULE SIOV-S10K625
$MODULE SIOV-S10K680
Po 0 0 0 15 4A19473C 00000000 ~~
Li SIOV-S10K680
Cd Varistor Epcos SIOV-S10K680
Kw R
Sc 0
AR 
Op 0 A 0
T0 0 0 550 500 0 80 N V 21 N "VR"
T1 0 0 550 500 0 80 N V 21 N "Val*"
DS -2362 -1555 2362 -1555 150 21
DS 2362 -1555 2362 1555 150 21
DS 2362 1555 -2362 1555 150 21
DS -2362 1555 -2362 -1555 150 21
$PAD
Sh "1" C 550 550 0 0 0
Dr 320 0 0
At STD N 00E0FFFF
Ne 0 ""
Po -1476 866
$EndPAD
$PAD
Sh "2" C 550 550 0 0 0
Dr 320 0 0
At STD N 00E0FFFF
Ne 0 ""
Po 1476 -866
$EndPAD
$EndMODULE SIOV-S10K680
$MODULE SIOV-S10K75
Po 0 0 0 15 4A19473C 00000000 ~~
Li SIOV-S10K75
Cd Varistor Epcos SIOV-S10K75
Kw R
Sc 0
AR 
Op 0 A 0
T0 0 0 550 500 0 80 N V 21 N "VR"
T1 0 0 550 500 0 80 N V 21 N "Val*"
DS -2362 -827 2362 -827 150 21
DS 2362 -827 2362 827 150 21
DS 2362 827 -2362 827 150 21
DS -2362 827 -2362 -827 150 21
$PAD
Sh "1" C 550 550 0 0 0
Dr 320 0 0
At STD N 00E0FFFF
Ne 0 ""
Po -1476 295
$EndPAD
$PAD
Sh "2" C 550 550 0 0 0
Dr 320 0 0
At STD N 00E0FFFF
Ne 0 ""
Po 1476 -295
$EndPAD
$EndMODULE SIOV-S10K75
$MODULE SIOV-S10K95
Po 0 0 0 15 4A19473C 00000000 ~~
Li SIOV-S10K95
Cd Varistor Epcos SIOV-S10K95
Kw R
Sc 0
AR 
Op 0 A 0
T0 0 0 550 500 0 80 N V 21 N "VR"
T1 0 0 550 500 0 80 N V 21 N "Val*"
DS -2362 -787 2362 -787 150 21
DS 2362 -787 2362 787 150 21
DS 2362 787 -2362 787 150 21
DS -2362 787 -2362 -787 150 21
$PAD
Sh "1" C 550 550 0 0 0
Dr 320 0 0
At STD N 00E0FFFF
Ne 0 ""
Po -1476 295
$EndPAD
$PAD
Sh "2" C 550 550 0 0 0
Dr 320 0 0
At STD N 00E0FFFF
Ne 0 ""
Po 1476 -295
$EndPAD
$EndMODULE SIOV-S10K95
$MODULE SIOV-S14K10001
Po 0 0 0 15 4A19473C 00000000 ~~
Li SIOV-S14K10001
Cd Varistor Epcos SIOV-S14K10001
Kw R
Sc 0
AR 
Op 0 A 0
T0 0 0 550 500 0 80 N V 21 N "VR"
T1 0 0 550 500 0 80 N V 21 N "Val*"
DS -3051 -2165 3051 -2165 150 21
DS 3051 -2165 3051 2165 150 21
DS 3051 2165 -3051 2165 150 21
DS -3051 2165 -3051 -2165 150 21
$PAD
Sh "1" C 550 550 0 0 0
Dr 320 0 0
At STD N 00E0FFFF
Ne 0 ""
Po -1476 1319
$EndPAD
$PAD
Sh "2" C 550 550 0 0 0
Dr 320 0 0
At STD N 00E0FFFF
Ne 0 ""
Po 1476 -1319
$EndPAD
$EndMODULE SIOV-S14K10001
$MODULE SIOV-S14K11
Po 0 0 0 15 4A19473C 00000000 ~~
Li SIOV-S14K11
Cd Varistor Epcos SIOV-S14K11
Kw R
Sc 0
AR 
Op 0 A 0
T0 0 0 550 500 0 80 N V 21 N "VR"
T1 0 0 550 500 0 80 N V 21 N "Val*"
DS -3051 -787 3051 -787 150 21
DS 3051 -787 3051 787 150 21
DS 3051 787 -3051 787 150 21
DS -3051 787 -3051 -787 150 21
$PAD
Sh "1" C 550 550 0 0 0
Dr 320 0 0
At STD N 00E0FFFF
Ne 0 ""
Po -1476 276
$EndPAD
$PAD
Sh "2" C 550 550 0 0 0
Dr 320 0 0
At STD N 00E0FFFF
Ne 0 ""
Po 1476 -276
$EndPAD
$EndMODULE SIOV-S14K11
$MODULE SIOV-S14K115
Po 0 0 0 15 4A19473C 00000000 ~~
Li SIOV-S14K115
Cd Varistor Epcos SIOV-S14K115
Kw R
Sc 0
AR 
Op 0 A 0
T0 0 0 550 500 0 80 N V 21 N "VR"
T1 0 0 550 500 0 80 N V 21 N "Val*"
DS -3051 -827 3051 -827 150 21
DS 3051 -827 3051 827 150 21
DS 3051 827 -3051 827 150 21
DS -3051 827 -3051 -827 150 21
$PAD
Sh "1" C 550 550 0 0 0
Dr 320 0 0
At STD N 00E0FFFF
Ne 0 ""
Po -1476 335
$EndPAD
$PAD
Sh "2" C 550 550 0 0 0
Dr 320 0 0
At STD N 00E0FFFF
Ne 0 ""
Po 1476 -335
$EndPAD
$EndMODULE SIOV-S14K115
$MODULE SIOV-S14K130
Po 0 0 0 15 4A19473C 00000000 ~~
Li SIOV-S14K130
Cd Varistor Epcos SIOV-S14K130
Kw R
Sc 0
AR 
Op 0 A 0
T0 0 0 550 500 0 80 N V 21 N "VR"
T1 0 0 550 500 0 80 N V 21 N "Val*"
DS -3051 -827 3051 -827 150 21
DS 3051 -827 3051 827 150 21
DS 3051 827 -3051 827 150 21
DS -3051 827 -3051 -827 150 21
$PAD
Sh "1" C 550 550 0 0 0
Dr 320 0 0
At STD N 00E0FFFF
Ne 0 ""
Po -1476 374
$EndPAD
$PAD
Sh "2" C 550 550 0 0 0
Dr 320 0 0
At STD N 00E0FFFF
Ne 0 ""
Po 1476 -374
$EndPAD
$EndMODULE SIOV-S14K130
$MODULE SIOV-S14K14
Po 0 0 0 15 4A19473C 00000000 ~~
Li SIOV-S14K14
Cd Varistor Epcos SIOV-S14K14
Kw R
Sc 0
AR 
Op 0 A 0
T0 0 0 550 500 0 80 N V 21 N "VR"
T1 0 0 550 500 0 80 N V 21 N "Val*"
DS -3051 -827 3051 -827 150 21
DS 3051 -827 3051 827 150 21
DS 3051 827 -3051 827 150 21
DS -3051 827 -3051 -827 150 21
$PAD
Sh "1" C 550 550 0 0 0
Dr 320 0 0
At STD N 00E0FFFF
Ne 0 ""
Po -1476 295
$EndPAD
$PAD
Sh "2" C 550 550 0 0 0
Dr 320 0 0
At STD N 00E0FFFF
Ne 0 ""
Po 1476 -295
$EndPAD
$EndMODULE SIOV-S14K14
$MODULE SIOV-S14K140
Po 0 0 0 15 4A19473C 00000000 ~~
Li SIOV-S14K140
Cd Varistor Epcos SIOV-S14K140
Kw R
Sc 0
AR 
Op 0 A 0
T0 0 0 550 500 0 80 N V 21 N "VR"
T1 0 0 550 500 0 80 N V 21 N "Val*"
DS -3051 -846 3051 -846 150 21
DS 3051 -846 3051 846 150 21
DS 3051 846 -3051 846 150 21
DS -3051 846 -3051 -846 150 21
$PAD
Sh "1" C 550 550 0 0 0
Dr 320 0 0
At STD N 00E0FFFF
Ne 0 ""
Po -1476 394
$EndPAD
$PAD
Sh "2" C 550 550 0 0 0
Dr 320 0 0
At STD N 00E0FFFF
Ne 0 ""
Po 1476 -394
$EndPAD
$EndMODULE SIOV-S14K140
$MODULE SIOV-S14K150
Po 0 0 0 15 4A19473C 00000000 ~~
Li SIOV-S14K150
Cd Varistor Epcos SIOV-S14K150
Kw R
Sc 0
AR 
Op 0 A 0
T0 0 0 550 500 0 80 N V 21 N "VR"
T1 0 0 550 500 0 80 N V 21 N "Val*"
DS -3051 -866 3051 -866 150 21
DS 3051 -866 3051 866 150 21
DS 3051 866 -3051 866 150 21
DS -3051 866 -3051 -866 150 21
$PAD
Sh "1" C 550 550 0 0 0
Dr 320 0 0
At STD N 00E0FFFF
Ne 0 ""
Po -1476 413
$EndPAD
$PAD
Sh "2" C 550 550 0 0 0
Dr 320 0 0
At STD N 00E0FFFF
Ne 0 ""
Po 1476 -413
$EndPAD
$EndMODULE SIOV-S14K150
$MODULE SIOV-S14K17
Po 0 0 0 15 4A19473C 00000000 ~~
Li SIOV-S14K17
Cd Varistor Epcos SIOV-S14K17
Kw R
Sc 0
AR 
Op 0 A 0
T0 0 0 550 500 0 80 N V 21 N "VR"
T1 0 0 550 500 0 80 N V 21 N "Val*"
DS -3051 -866 3051 -866 150 21
DS 3051 -866 3051 866 150 21
DS 3051 866 -3051 866 150 21
DS -3051 866 -3051 -866 150 21
$PAD
Sh "1" C 550 550 0 0 0
Dr 320 0 0
At STD N 00E0FFFF
Ne 0 ""
Po -1476 335
$EndPAD
$PAD
Sh "2" C 550 550 0 0 0
Dr 320 0 0
At STD N 00E0FFFF
Ne 0 ""
Po 1476 -335
$EndPAD
$EndMODULE SIOV-S14K17
$MODULE SIOV-S14K175
Po 0 0 0 15 4A19473C 00000000 ~~
Li SIOV-S14K175
Cd Varistor Epcos SIOV-S14K175
Kw R
Sc 0
AR 
Op 0 A 0
T0 0 0 550 500 0 80 N V 21 N "VR"
T1 0 0 550 500 0 80 N V 21 N "Val*"
DS -3051 -906 3051 -906 150 21
DS 3051 -906 3051 906 150 21
DS 3051 906 -3051 906 150 21
DS -3051 906 -3051 -906 150 21
$PAD
Sh "1" C 550 550 0 0 0
Dr 320 0 0
At STD N 00E0FFFF
Ne 0 ""
Po -1476 433
$EndPAD
$PAD
Sh "2" C 550 550 0 0 0
Dr 320 0 0
At STD N 00E0FFFF
Ne 0 ""
Po 1476 -433
$EndPAD
$EndMODULE SIOV-S14K175
$MODULE SIOV-S14K20
Po 0 0 0 15 4A19473C 00000000 ~~
Li SIOV-S14K20
Cd Varistor Epcos SIOV-S14K20
Kw R
Sc 0
AR 
Op 0 A 0
T0 0 0 550 500 0 80 N V 21 N "VR"
T1 0 0 550 500 0 80 N V 21 N "Val*"
DS -3051 -906 3051 -906 150 21
DS 3051 -906 3051 906 150 21
DS 3051 906 -3051 906 150 21
DS -3051 906 -3051 -906 150 21
$PAD
Sh "1" C 550 550 0 0 0
Dr 320 0 0
At STD N 00E0FFFF
Ne 0 ""
Po -1476 374
$EndPAD
$PAD
Sh "2" C 550 550 0 0 0
Dr 320 0 0
At STD N 00E0FFFF
Ne 0 ""
Po 1476 -374
$EndPAD
$EndMODULE SIOV-S14K20
$MODULE SIOV-S14K230
Po 0 0 0 15 4A19473C 00000000 ~~
Li SIOV-S14K230
Cd Varistor Epcos SIOV-S14K230
Kw R
Sc 0
AR 
Op 0 A 0
T0 0 0 550 500 0 80 N V 21 N "VR"
T1 0 0 550 500 0 80 N V 21 N "Val*"
DS -3051 -925 3051 -925 150 21
DS 3051 -925 3051 925 150 21
DS 3051 925 -3051 925 150 21
DS -3051 925 -3051 -925 150 21
$PAD
Sh "1" C 550 550 0 0 0
Dr 320 0 0
At STD N 00E0FFFF
Ne 0 ""
Po -1476 394
$EndPAD
$PAD
Sh "2" C 550 550 0 0 0
Dr 320 0 0
At STD N 00E0FFFF
Ne 0 ""
Po 1476 -394
$EndPAD
$EndMODULE SIOV-S14K230
$MODULE SIOV-S14K25
Po 0 0 0 15 4A19473C 00000000 ~~
Li SIOV-S14K25
Cd Varistor Epcos SIOV-S14K25
Kw R
Sc 0
AR 
Op 0 A 0
T0 0 0 550 500 0 80 N V 21 N "VR"
T1 0 0 550 500 0 80 N V 21 N "Val*"
DS -3051 -827 3051 -827 150 21
DS 3051 -827 3051 827 150 21
DS 3051 827 -3051 827 150 21
DS -3051 827 -3051 -827 150 21
$PAD
Sh "1" C 550 550 0 0 0
Dr 320 0 0
At STD N 00E0FFFF
Ne 0 ""
Po -1476 335
$EndPAD
$PAD
Sh "2" C 550 550 0 0 0
Dr 320 0 0
At STD N 00E0FFFF
Ne 0 ""
Po 1476 -335
$EndPAD
$EndMODULE SIOV-S14K25
$MODULE SIOV-S14K250
Po 0 0 0 15 4A19473C 00000000 ~~
Li SIOV-S14K250
Cd Varistor Epcos SIOV-S14K250
Kw R
Sc 0
AR 
Op 0 A 0
T0 0 0 550 500 0 80 N V 21 N "VR"
T1 0 0 550 500 0 80 N V 21 N "Val*"
DS -3051 -945 3051 -945 150 21
DS 3051 -945 3051 945 150 21
DS 3051 945 -3051 945 150 21
DS -3051 945 -3051 -945 150 21
$PAD
Sh "1" C 550 550 0 0 0
Dr 320 0 0
At STD N 00E0FFFF
Ne 0 ""
Po -1476 394
$EndPAD
$PAD
Sh "2" C 550 550 0 0 0
Dr 320 0 0
At STD N 00E0FFFF
Ne 0 ""
Po 1476 -394
$EndPAD
$EndMODULE SIOV-S14K250
$MODULE SIOV-S14K275
Po 0 0 0 15 4A19473C 00000000 ~~
Li SIOV-S14K275
Cd Varistor Epcos SIOV-S14K275
Kw R
Sc 0
AR 
Op 0 A 0
T0 0 0 550 500 0 80 N V 21 N "VR"
T1 0 0 550 500 0 80 N V 21 N "Val*"
DS -3051 -984 3051 -984 150 21
DS 3051 -984 3051 984 150 21
DS 3051 984 -3051 984 150 21
DS -3051 984 -3051 -984 150 21
$PAD
Sh "1" C 550 550 0 0 0
Dr 320 0 0
At STD N 00E0FFFF
Ne 0 ""
Po -1476 433
$EndPAD
$PAD
Sh "2" C 550 550 0 0 0
Dr 320 0 0
At STD N 00E0FFFF
Ne 0 ""
Po 1476 -433
$EndPAD
$EndMODULE SIOV-S14K275
$MODULE SIOV-S14K30
Po 0 0 0 15 4A19473C 00000000 ~~
Li SIOV-S14K30
Cd Varistor Epcos SIOV-S14K30
Kw R
Sc 0
AR 
Op 0 A 0
T0 0 0 550 500 0 80 N V 21 N "VR"
T1 0 0 550 500 0 80 N V 21 N "Val*"
DS -3051 -866 3051 -866 150 21
DS 3051 -866 3051 866 150 21
DS 3051 866 -3051 866 150 21
DS -3051 866 -3051 -866 150 21
$PAD
Sh "1" C 550 550 0 0 0
Dr 320 0 0
At STD N 00E0FFFF
Ne 0 ""
Po -1476 354
$EndPAD
$PAD
Sh "2" C 550 550 0 0 0
Dr 320 0 0
At STD N 00E0FFFF
Ne 0 ""
Po 1476 -354
$EndPAD
$EndMODULE SIOV-S14K30
$MODULE SIOV-S14K300
Po 0 0 0 15 4A19473C 00000000 ~~
Li SIOV-S14K300
Cd Varistor Epcos SIOV-S14K300
Kw R
Sc 0
AR 
Op 0 A 0
T0 0 0 550 500 0 80 N V 21 N "VR"
T1 0 0 550 500 0 80 N V 21 N "Val*"
DS -3051 -1024 3051 -1024 150 21
DS 3051 -1024 3051 1024 150 21
DS 3051 1024 -3051 1024 150 21
DS -3051 1024 -3051 -1024 150 21
$PAD
Sh "1" C 550 550 0 0 0
Dr 320 0 0
At STD N 00E0FFFF
Ne 0 ""
Po -1476 453
$EndPAD
$PAD
Sh "2" C 550 550 0 0 0
Dr 320 0 0
At STD N 00E0FFFF
Ne 0 ""
Po 1476 -453
$EndPAD
$EndMODULE SIOV-S14K300
$MODULE SIOV-S14K320
Po 0 0 0 15 4A19473C 00000000 ~~
Li SIOV-S14K320
Cd Varistor Epcos SIOV-S14K320
Kw R
Sc 0
AR 
Op 0 A 0
T0 0 0 550 500 0 80 N V 21 N "VR"
T1 0 0 550 500 0 80 N V 21 N "Val*"
DS -3051 -1063 3051 -1063 150 21
DS 3051 -1063 3051 1063 150 21
DS 3051 1063 -3051 1063 150 21
DS -3051 1063 -3051 -1063 150 21
$PAD
Sh "1" C 550 550 0 0 0
Dr 320 0 0
At STD N 00E0FFFF
Ne 0 ""
Po -1476 472
$EndPAD
$PAD
Sh "2" C 550 550 0 0 0
Dr 320 0 0
At STD N 00E0FFFF
Ne 0 ""
Po 1476 -472
$EndPAD
$EndMODULE SIOV-S14K320
$MODULE SIOV-S14K35
Po 0 0 0 15 4A19473C 00000000 ~~
Li SIOV-S14K35
Cd Varistor Epcos SIOV-S14K35
Kw R
Sc 0
AR 
Op 0 A 0
T0 0 0 550 500 0 80 N V 21 N "VR"
T1 0 0 550 500 0 80 N V 21 N "Val*"
DS -3051 -886 3051 -886 150 21
DS 3051 -886 3051 886 150 21
DS 3051 886 -3051 886 150 21
DS -3051 886 -3051 -886 150 21
$PAD
Sh "1" C 550 550 0 0 0
Dr 320 0 0
At STD N 00E0FFFF
Ne 0 ""
Po -1476 394
$EndPAD
$PAD
Sh "2" C 550 550 0 0 0
Dr 320 0 0
At STD N 00E0FFFF
Ne 0 ""
Po 1476 -394
$EndPAD
$EndMODULE SIOV-S14K35
$MODULE SIOV-S14K385
Po 0 0 0 15 4A19473C 00000000 ~~
Li SIOV-S14K385
Cd Varistor Epcos SIOV-S14K385
Kw R
Sc 0
AR 
Op 0 A 0
T0 0 0 550 500 0 80 N V 21 N "VR"
T1 0 0 550 500 0 80 N V 21 N "Val*"
DS -3051 -1161 3051 -1161 150 21
DS 3051 -1161 3051 1161 150 21
DS 3051 1161 -3051 1161 150 21
DS -3051 1161 -3051 -1161 150 21
$PAD
Sh "1" C 550 550 0 0 0
Dr 320 0 0
At STD N 00E0FFFF
Ne 0 ""
Po -1476 531
$EndPAD
$PAD
Sh "2" C 550 550 0 0 0
Dr 320 0 0
At STD N 00E0FFFF
Ne 0 ""
Po 1476 -531
$EndPAD
$EndMODULE SIOV-S14K385
$MODULE SIOV-S14K40
Po 0 0 0 15 4A19473C 00000000 ~~
Li SIOV-S14K40
Cd Varistor Epcos SIOV-S14K40
Kw R
Sc 0
AR 
Op 0 A 0
T0 0 0 550 500 0 80 N V 21 N "VR"
T1 0 0 550 500 0 80 N V 21 N "Val*"
DS -3051 -965 3051 -965 150 21
DS 3051 -965 3051 965 150 21
DS 3051 965 -3051 965 150 21
DS -3051 965 -3051 -965 150 21
$PAD
Sh "1" C 550 550 0 0 0
Dr 320 0 0
At STD N 00E0FFFF
Ne 0 ""
Po -1476 433
$EndPAD
$PAD
Sh "2" C 550 550 0 0 0
Dr 320 0 0
At STD N 00E0FFFF
Ne 0 ""
Po 1476 -433
$EndPAD
$EndMODULE SIOV-S14K40
$MODULE SIOV-S14K420
Po 0 0 0 15 4A19473C 00000000 ~~
Li SIOV-S14K420
Cd Varistor Epcos SIOV-S14K420
Kw R
Sc 0
AR 
Op 0 A 0
T0 0 0 550 500 0 80 N V 21 N "VR"
T1 0 0 550 500 0 80 N V 21 N "Val*"
DS -3051 -1201 3051 -1201 150 21
DS 3051 -1201 3051 1201 150 21
DS 3051 1201 -3051 1201 150 21
DS -3051 1201 -3051 -1201 150 21
$PAD
Sh "1" C 550 550 0 0 0
Dr 320 0 0
At STD N 00E0FFFF
Ne 0 ""
Po -1476 571
$EndPAD
$PAD
Sh "2" C 550 550 0 0 0
Dr 320 0 0
At STD N 00E0FFFF
Ne 0 ""
Po 1476 -571
$EndPAD
$EndMODULE SIOV-S14K420
$MODULE SIOV-S14K440
Po 0 0 0 15 4A19473C 00000000 ~~
Li SIOV-S14K440
Cd Varistor Epcos SIOV-S14K440
Kw R
Sc 0
AR 
Op 0 A 0
T0 0 0 550 500 0 80 N V 21 N "VR"
T1 0 0 550 500 0 80 N V 21 N "Val*"
DS -3051 -1240 3051 -1240 150 21
DS 3051 -1240 3051 1240 150 21
DS 3051 1240 -3051 1240 150 21
DS -3051 1240 -3051 -1240 150 21
$PAD
Sh "1" C 550 550 0 0 0
Dr 320 0 0
At STD N 00E0FFFF
Ne 0 ""
Po -1476 591
$EndPAD
$PAD
Sh "2" C 550 550 0 0 0
Dr 320 0 0
At STD N 00E0FFFF
Ne 0 ""
Po 1476 -591
$EndPAD
$EndMODULE SIOV-S14K440
$MODULE SIOV-S14K460
Po 0 0 0 15 4A19473C 00000000 ~~
Li SIOV-S14K460
Cd Varistor Epcos SIOV-S14K460
Kw R
Sc 0
AR 
Op 0 A 0
T0 0 0 550 500 0 80 N V 21 N "VR"
T1 0 0 550 500 0 80 N V 21 N "Val*"
DS -3051 -1260 3051 -1260 150 21
DS 3051 -1260 3051 1260 150 21
DS 3051 1260 -3051 1260 150 21
DS -3051 1260 -3051 -1260 150 21
$PAD
Sh "1" C 550 550 0 0 0
Dr 320 0 0
At STD N 00E0FFFF
Ne 0 ""
Po -1476 610
$EndPAD
$PAD
Sh "2" C 550 550 0 0 0
Dr 320 0 0
At STD N 00E0FFFF
Ne 0 ""
Po 1476 -610
$EndPAD
$EndMODULE SIOV-S14K460
$MODULE SIOV-S14K50
Po 0 0 0 15 4A19473C 00000000 ~~
Li SIOV-S14K50
Cd Varistor Epcos SIOV-S14K50
Kw R
Sc 0
AR 
Op 0 A 0
T0 0 0 550 500 0 80 N V 21 N "VR"
T1 0 0 550 500 0 80 N V 21 N "Val*"
DS -3051 -768 3051 -768 150 21
DS 3051 -768 3051 768 150 21
DS 3051 768 -3051 768 150 21
DS -3051 768 -3051 -768 150 21
$PAD
Sh "1" C 550 550 0 0 0
Dr 320 0 0
At STD N 00E0FFFF
Ne 0 ""
Po -1476 276
$EndPAD
$PAD
Sh "2" C 550 550 0 0 0
Dr 320 0 0
At STD N 00E0FFFF
Ne 0 ""
Po 1476 -276
$EndPAD
$EndMODULE SIOV-S14K50
$MODULE SIOV-S14K510
Po 0 0 0 15 4A19473C 00000000 ~~
Li SIOV-S14K510
Cd Varistor Epcos SIOV-S14K510
Kw R
Sc 0
AR 
Op 0 A 0
T0 0 0 550 500 0 80 N V 21 N "VR"
T1 0 0 550 500 0 80 N V 21 N "Val*"
DS -3051 -1339 3051 -1339 150 21
DS 3051 -1339 3051 1339 150 21
DS 3051 1339 -3051 1339 150 21
DS -3051 1339 -3051 -1339 150 21
$PAD
Sh "1" C 550 550 0 0 0
Dr 320 0 0
At STD N 00E0FFFF
Ne 0 ""
Po -1476 669
$EndPAD
$PAD
Sh "2" C 550 550 0 0 0
Dr 320 0 0
At STD N 00E0FFFF
Ne 0 ""
Po 1476 -669
$EndPAD
$EndMODULE SIOV-S14K510
$MODULE SIOV-S14K550
Po 0 0 0 15 4A19473C 00000000 ~~
Li SIOV-S14K550
Cd Varistor Epcos SIOV-S14K550
Kw R
Sc 0
AR 
Op 0 A 0
T0 0 0 550 500 0 80 N V 21 N "VR"
T1 0 0 550 500 0 80 N V 21 N "Val*"
DS -3051 -1417 3051 -1417 150 21
DS 3051 -1417 3051 1417 150 21
DS 3051 1417 -3051 1417 150 21
DS -3051 1417 -3051 -1417 150 21
$PAD
Sh "1" C 550 550 0 0 0
Dr 320 0 0
At STD N 00E0FFFF
Ne 0 ""
Po -1476 728
$EndPAD
$PAD
Sh "2" C 550 550 0 0 0
Dr 320 0 0
At STD N 00E0FFFF
Ne 0 ""
Po 1476 -728
$EndPAD
$EndMODULE SIOV-S14K550
$MODULE SIOV-S14K60
Po 0 0 0 15 4A19473C 00000000 ~~
Li SIOV-S14K60
Cd Varistor Epcos SIOV-S14K60
Kw R
Sc 0
AR 
Op 0 A 0
T0 0 0 550 500 0 80 N V 21 N "VR"
T1 0 0 550 500 0 80 N V 21 N "Val*"
DS -3051 -787 3051 -787 150 21
DS 3051 -787 3051 787 150 21
DS 3051 787 -3051 787 150 21
DS -3051 787 -3051 -787 150 21
$PAD
Sh "1" C 550 550 0 0 0
Dr 320 0 0
At STD N 00E0FFFF
Ne 0 ""
Po -1476 295
$EndPAD
$PAD
Sh "2" C 550 550 0 0 0
Dr 320 0 0
At STD N 00E0FFFF
Ne 0 ""
Po 1476 -295
$EndPAD
$EndMODULE SIOV-S14K60
$MODULE SIOV-S14K625
Po 0 0 0 15 4A19473C 00000000 ~~
Li SIOV-S14K625
Cd Varistor Epcos SIOV-S14K625
Kw R
Sc 0
AR 
Op 0 A 0
T0 0 0 550 500 0 80 N V 21 N "VR"
T1 0 0 550 500 0 80 N V 21 N "Val*"
DS -3051 -1476 3051 -1476 150 21
DS 3051 -1476 3051 1476 150 21
DS 3051 1476 -3051 1476 150 21
DS -3051 1476 -3051 -1476 150 21
$PAD
Sh "1" C 550 550 0 0 0
Dr 320 0 0
At STD N 00E0FFFF
Ne 0 ""
Po -1476 787
$EndPAD
$PAD
Sh "2" C 550 550 0 0 0
Dr 320 0 0
At STD N 00E0FFFF
Ne 0 ""
Po 1476 -787
$EndPAD
$EndMODULE SIOV-S14K625
$MODULE SIOV-S14K680
Po 0 0 0 15 4A19473C 00000000 ~~
Li SIOV-S14K680
Cd Varistor Epcos SIOV-S14K680
Kw R
Sc 0
AR 
Op 0 A 0
T0 0 0 550 500 0 80 N V 21 N "VR"
T1 0 0 550 500 0 80 N V 21 N "Val*"
DS -3051 -1575 3051 -1575 150 21
DS 3051 -1575 3051 1575 150 21
DS 3051 1575 -3051 1575 150 21
DS -3051 1575 -3051 -1575 150 21
$PAD
Sh "1" C 550 550 0 0 0
Dr 320 0 0
At STD N 00E0FFFF
Ne 0 ""
Po -1476 866
$EndPAD
$PAD
Sh "2" C 550 550 0 0 0
Dr 320 0 0
At STD N 00E0FFFF
Ne 0 ""
Po 1476 -866
$EndPAD
$EndMODULE SIOV-S14K680
$MODULE SIOV-S14K75
Po 0 0 0 15 4A19473C 00000000 ~~
Li SIOV-S14K75
Cd Varistor Epcos SIOV-S14K75
Kw R
Sc 0
AR 
Op 0 A 0
T0 0 0 550 500 0 80 N V 21 N "VR"
T1 0 0 550 500 0 80 N V 21 N "Val*"
DS -3051 -827 3051 -827 150 21
DS 3051 -827 3051 827 150 21
DS 3051 827 -3051 827 150 21
DS -3051 827 -3051 -827 150 21
$PAD
Sh "1" C 550 550 0 0 0
Dr 320 0 0
At STD N 00E0FFFF
Ne 0 ""
Po -1476 295
$EndPAD
$PAD
Sh "2" C 550 550 0 0 0
Dr 320 0 0
At STD N 00E0FFFF
Ne 0 ""
Po 1476 -295
$EndPAD
$EndMODULE SIOV-S14K75
$MODULE SIOV-S14K95
Po 0 0 0 15 4A19473C 00000000 ~~
Li SIOV-S14K95
Cd Varistor Epcos SIOV-S14K95
Kw R
Sc 0
AR 
Op 0 A 0
T0 0 0 550 500 0 80 N V 21 N "VR"
T1 0 0 550 500 0 80 N V 21 N "Val*"
DS -3051 -787 3051 -787 150 21
DS 3051 -787 3051 787 150 21
DS 3051 787 -3051 787 150 21
DS -3051 787 -3051 -787 150 21
$PAD
Sh "1" C 550 550 0 0 0
Dr 320 0 0
At STD N 00E0FFFF
Ne 0 ""
Po -1476 295
$EndPAD
$PAD
Sh "2" C 550 550 0 0 0
Dr 320 0 0
At STD N 00E0FFFF
Ne 0 ""
Po 1476 -295
$EndPAD
$EndMODULE SIOV-S14K95
$MODULE SIOV-S20K10001
Po 0 0 0 15 4A19473C 00000000 ~~
Li SIOV-S20K10001
Cd Varistor Epcos SIOV-S20K10001
Kw R
Sc 0
AR 
Op 0 A 0
T0 0 0 550 500 0 80 N V 21 N "VR"
T1 0 0 550 500 0 80 N V 21 N "Val*"
DS -4232 -2244 4232 -2244 150 21
DS 4232 -2244 4232 2244 150 21
DS 4232 2244 -4232 2244 150 21
DS -4232 2244 -4232 -2244 150 21
$PAD
Sh "1" C 550 550 0 0 0
Dr 320 0 0
At STD N 00E0FFFF
Ne 0 ""
Po -1969 1358
$EndPAD
$PAD
Sh "2" C 550 550 0 0 0
Dr 320 0 0
At STD N 00E0FFFF
Ne 0 ""
Po 1969 -1358
$EndPAD
$EndMODULE SIOV-S20K10001
$MODULE SIOV-S20K11
Po 0 0 0 15 4A19473C 00000000 ~~
Li SIOV-S20K11
Cd Varistor Epcos SIOV-S20K11
Kw R
Sc 0
AR 
Op 0 A 0
T0 0 0 550 500 0 80 N V 21 N "VR"
T1 0 0 550 500 0 80 N V 21 N "Val*"
DS -4232 -886 4232 -886 150 21
DS 4232 -886 4232 886 150 21
DS 4232 886 -4232 886 150 21
DS -4232 886 -4232 -886 150 21
$PAD
Sh "1" C 550 550 0 0 0
Dr 320 0 0
At STD N 00E0FFFF
Ne 0 ""
Po -1969 295
$EndPAD
$PAD
Sh "2" C 550 550 0 0 0
Dr 320 0 0
At STD N 00E0FFFF
Ne 0 ""
Po 1969 -295
$EndPAD
$EndMODULE SIOV-S20K11
$MODULE SIOV-S20K115
Po 0 0 0 15 4A19473C 00000000 ~~
Li SIOV-S20K115
Cd Varistor Epcos SIOV-S20K115
Kw R
Sc 0
AR 
Op 0 A 0
T0 0 0 550 500 0 80 N V 21 N "VR"
T1 0 0 550 500 0 80 N V 21 N "Val*"
DS -4232 -906 4232 -906 150 21
DS 4232 -906 4232 906 150 21
DS 4232 906 -4232 906 150 21
DS -4232 906 -4232 -906 150 21
$PAD
Sh "1" C 550 550 0 0 0
Dr 320 0 0
At STD N 00E0FFFF
Ne 0 ""
Po -1969 354
$EndPAD
$PAD
Sh "2" C 550 550 0 0 0
Dr 320 0 0
At STD N 00E0FFFF
Ne 0 ""
Po 1969 -354
$EndPAD
$EndMODULE SIOV-S20K115
$MODULE SIOV-S20K130
Po 0 0 0 15 4A19473C 00000000 ~~
Li SIOV-S20K130
Cd Varistor Epcos SIOV-S20K130
Kw R
Sc 0
AR 
Op 0 A 0
T0 0 0 550 500 0 80 N V 21 N "VR"
T1 0 0 550 500 0 80 N V 21 N "Val*"
DS -4232 -925 4232 -925 150 21
DS 4232 -925 4232 925 150 21
DS 4232 925 -4232 925 150 21
DS -4232 925 -4232 -925 150 21
$PAD
Sh "1" C 550 550 0 0 0
Dr 320 0 0
At STD N 00E0FFFF
Ne 0 ""
Po -1969 394
$EndPAD
$PAD
Sh "2" C 550 550 0 0 0
Dr 320 0 0
At STD N 00E0FFFF
Ne 0 ""
Po 1969 -394
$EndPAD
$EndMODULE SIOV-S20K130
$MODULE SIOV-S20K14
Po 0 0 0 15 4A19473C 00000000 ~~
Li SIOV-S20K14
Cd Varistor Epcos SIOV-S20K14
Kw R
Sc 0
AR 
Op 0 A 0
T0 0 0 550 500 0 80 N V 21 N "VR"
T1 0 0 550 500 0 80 N V 21 N "Val*"
DS -4232 -906 4232 -906 150 21
DS 4232 -906 4232 906 150 21
DS 4232 906 -4232 906 150 21
DS -4232 906 -4232 -906 150 21
$PAD
Sh "1" C 550 550 0 0 0
Dr 320 0 0
At STD N 00E0FFFF
Ne 0 ""
Po -1969 315
$EndPAD
$PAD
Sh "2" C 550 550 0 0 0
Dr 320 0 0
At STD N 00E0FFFF
Ne 0 ""
Po 1969 -315
$EndPAD
$EndMODULE SIOV-S20K14
$MODULE SIOV-S20K140
Po 0 0 0 15 4A19473C 00000000 ~~
Li SIOV-S20K140
Cd Varistor Epcos SIOV-S20K140
Kw R
Sc 0
AR 
Op 0 A 0
T0 0 0 550 500 0 80 N V 21 N "VR"
T1 0 0 550 500 0 80 N V 21 N "Val*"
DS -4232 -945 4232 -945 150 21
DS 4232 -945 4232 945 150 21
DS 4232 945 -4232 945 150 21
DS -4232 945 -4232 -945 150 21
$PAD
Sh "1" C 550 550 0 0 0
Dr 320 0 0
At STD N 00E0FFFF
Ne 0 ""
Po -1969 413
$EndPAD
$PAD
Sh "2" C 550 550 0 0 0
Dr 320 0 0
At STD N 00E0FFFF
Ne 0 ""
Po 1969 -413
$EndPAD
$EndMODULE SIOV-S20K140
$MODULE SIOV-S20K150
Po 0 0 0 15 4A19473C 00000000 ~~
Li SIOV-S20K150
Cd Varistor Epcos SIOV-S20K150
Kw R
Sc 0
AR 
Op 0 A 0
T0 0 0 550 500 0 80 N V 21 N "VR"
T1 0 0 550 500 0 80 N V 21 N "Val*"
DS -4232 -965 4232 -965 150 21
DS 4232 -965 4232 965 150 21
DS 4232 965 -4232 965 150 21
DS -4232 965 -4232 -965 150 21
$PAD
Sh "1" C 550 550 0 0 0
Dr 320 0 0
At STD N 00E0FFFF
Ne 0 ""
Po -1969 433
$EndPAD
$PAD
Sh "2" C 550 550 0 0 0
Dr 320 0 0
At STD N 00E0FFFF
Ne 0 ""
Po 1969 -433
$EndPAD
$EndMODULE SIOV-S20K150
$MODULE SIOV-S20K17
Po 0 0 0 15 4A19473C 00000000 ~~
Li SIOV-S20K17
Cd Varistor Epcos SIOV-S20K17
Kw R
Sc 0
AR 
Op 0 A 0
T0 0 0 550 500 0 80 N V 21 N "VR"
T1 0 0 550 500 0 80 N V 21 N "Val*"
DS -4232 -945 4232 -945 150 21
DS 4232 -945 4232 945 150 21
DS 4232 945 -4232 945 150 21
DS -4232 945 -4232 -945 150 21
$PAD
Sh "1" C 550 550 0 0 0
Dr 320 0 0
At STD N 00E0FFFF
Ne 0 ""
Po -1969 354
$EndPAD
$PAD
Sh "2" C 550 550 0 0 0
Dr 320 0 0
At STD N 00E0FFFF
Ne 0 ""
Po 1969 -354
$EndPAD
$EndMODULE SIOV-S20K17
$MODULE SIOV-S20K175
Po 0 0 0 15 4A19473C 00000000 ~~
Li SIOV-S20K175
Cd Varistor Epcos SIOV-S20K175
Kw R
Sc 0
AR 
Op 0 A 0
T0 0 0 550 500 0 80 N V 21 N "VR"
T1 0 0 550 500 0 80 N V 21 N "Val*"
DS -4232 -984 4232 -984 150 21
DS 4232 -984 4232 984 150 21
DS 4232 984 -4232 984 150 21
DS -4232 984 -4232 -984 150 21
$PAD
Sh "1" C 550 550 0 0 0
Dr 320 0 0
At STD N 00E0FFFF
Ne 0 ""
Po -1969 453
$EndPAD
$PAD
Sh "2" C 550 550 0 0 0
Dr 320 0 0
At STD N 00E0FFFF
Ne 0 ""
Po 1969 -453
$EndPAD
$EndMODULE SIOV-S20K175
$MODULE SIOV-S20K20
Po 0 0 0 15 4A19473C 00000000 ~~
Li SIOV-S20K20
Cd Varistor Epcos SIOV-S20K20
Kw R
Sc 0
AR 
Op 0 A 0
T0 0 0 550 500 0 80 N V 21 N "VR"
T1 0 0 550 500 0 80 N V 21 N "Val*"
DS -4232 -1004 4232 -1004 150 21
DS 4232 -1004 4232 1004 150 21
DS 4232 1004 -4232 1004 150 21
DS -4232 1004 -4232 -1004 150 21
$PAD
Sh "1" C 550 550 0 0 0
Dr 320 0 0
At STD N 00E0FFFF
Ne 0 ""
Po -1969 413
$EndPAD
$PAD
Sh "2" C 550 550 0 0 0
Dr 320 0 0
At STD N 00E0FFFF
Ne 0 ""
Po 1969 -413
$EndPAD
$EndMODULE SIOV-S20K20
$MODULE SIOV-S20K230
Po 0 0 0 15 4A19473C 00000000 ~~
Li SIOV-S20K230
Cd Varistor Epcos SIOV-S20K230
Kw R
Sc 0
AR 
Op 0 A 0
T0 0 0 550 500 0 80 N V 21 N "VR"
T1 0 0 550 500 0 80 N V 21 N "Val*"
DS -4232 -1004 4232 -1004 150 21
DS 4232 -1004 4232 1004 150 21
DS 4232 1004 -4232 1004 150 21
DS -4232 1004 -4232 -1004 150 21
$PAD
Sh "1" C 550 550 0 0 0
Dr 320 0 0
At STD N 00E0FFFF
Ne 0 ""
Po -1969 413
$EndPAD
$PAD
Sh "2" C 550 550 0 0 0
Dr 320 0 0
At STD N 00E0FFFF
Ne 0 ""
Po 1969 -413
$EndPAD
$EndMODULE SIOV-S20K230
$MODULE SIOV-S20K25
Po 0 0 0 15 4A19473C 00000000 ~~
Li SIOV-S20K25
Cd Varistor Epcos SIOV-S20K25
Kw R
Sc 0
AR 
Op 0 A 0
T0 0 0 550 500 0 80 N V 21 N "VR"
T1 0 0 550 500 0 80 N V 21 N "Val*"
DS -4232 -925 4232 -925 150 21
DS 4232 -925 4232 925 150 21
DS 4232 925 -4232 925 150 21
DS -4232 925 -4232 -925 150 21
$PAD
Sh "1" C 550 550 0 0 0
Dr 320 0 0
At STD N 00E0FFFF
Ne 0 ""
Po -1969 354
$EndPAD
$PAD
Sh "2" C 550 550 0 0 0
Dr 320 0 0
At STD N 00E0FFFF
Ne 0 ""
Po 1969 -354
$EndPAD
$EndMODULE SIOV-S20K25
$MODULE SIOV-S20K250
Po 0 0 0 15 4A19473C 00000000 ~~
Li SIOV-S20K250
Cd Varistor Epcos SIOV-S20K250
Kw R
Sc 0
AR 
Op 0 A 0
T0 0 0 550 500 0 80 N V 21 N "VR"
T1 0 0 550 500 0 80 N V 21 N "Val*"
DS -4232 -1043 4232 -1043 150 21
DS 4232 -1043 4232 1043 150 21
DS 4232 1043 -4232 1043 150 21
DS -4232 1043 -4232 -1043 150 21
$PAD
Sh "1" C 550 550 0 0 0
Dr 320 0 0
At STD N 00E0FFFF
Ne 0 ""
Po -1969 433
$EndPAD
$PAD
Sh "2" C 550 550 0 0 0
Dr 320 0 0
At STD N 00E0FFFF
Ne 0 ""
Po 1969 -433
$EndPAD
$EndMODULE SIOV-S20K250
$MODULE SIOV-S20K275
Po 0 0 0 15 4A19473C 00000000 ~~
Li SIOV-S20K275
Cd Varistor Epcos SIOV-S20K275
Kw R
Sc 0
AR 
Op 0 A 0
T0 0 0 550 500 0 80 N V 21 N "VR"
T1 0 0 550 500 0 80 N V 21 N "Val*"
DS -4232 -1063 4232 -1063 150 21
DS 4232 -1063 4232 1063 150 21
DS 4232 1063 -4232 1063 150 21
DS -4232 1063 -4232 -1063 150 21
$PAD
Sh "1" C 550 550 0 0 0
Dr 320 0 0
At STD N 00E0FFFF
Ne 0 ""
Po -1969 453
$EndPAD
$PAD
Sh "2" C 550 550 0 0 0
Dr 320 0 0
At STD N 00E0FFFF
Ne 0 ""
Po 1969 -453
$EndPAD
$EndMODULE SIOV-S20K275
$MODULE SIOV-S20K30
Po 0 0 0 15 4A19473C 00000000 ~~
Li SIOV-S20K30
Cd Varistor Epcos SIOV-S20K30
Kw R
Sc 0
AR 
Op 0 A 0
T0 0 0 550 500 0 80 N V 21 N "VR"
T1 0 0 550 500 0 80 N V 21 N "Val*"
DS -4232 -965 4232 -965 150 21
DS 4232 -965 4232 965 150 21
DS 4232 965 -4232 965 150 21
DS -4232 965 -4232 -965 150 21
$PAD
Sh "1" C 550 550 0 0 0
Dr 320 0 0
At STD N 00E0FFFF
Ne 0 ""
Po -1969 394
$EndPAD
$PAD
Sh "2" C 550 550 0 0 0
Dr 320 0 0
At STD N 00E0FFFF
Ne 0 ""
Po 1969 -394
$EndPAD
$EndMODULE SIOV-S20K30
$MODULE SIOV-S20K300
Po 0 0 0 15 4A19473C 00000000 ~~
Li SIOV-S20K300
Cd Varistor Epcos SIOV-S20K300
Kw R
Sc 0
AR 
Op 0 A 0
T0 0 0 550 500 0 80 N V 21 N "VR"
T1 0 0 550 500 0 80 N V 21 N "Val*"
DS -4232 -1102 4232 -1102 150 21
DS 4232 -1102 4232 1102 150 21
DS 4232 1102 -4232 1102 150 21
DS -4232 1102 -4232 -1102 150 21
$PAD
Sh "1" C 550 550 0 0 0
Dr 320 0 0
At STD N 00E0FFFF
Ne 0 ""
Po -1969 472
$EndPAD
$PAD
Sh "2" C 550 550 0 0 0
Dr 320 0 0
At STD N 00E0FFFF
Ne 0 ""
Po 1969 -472
$EndPAD
$EndMODULE SIOV-S20K300
$MODULE SIOV-S20K320
Po 0 0 0 15 4A19473C 00000000 ~~
Li SIOV-S20K320
Cd Varistor Epcos SIOV-S20K320
Kw R
Sc 0
AR 
Op 0 A 0
T0 0 0 550 500 0 80 N V 21 N "VR"
T1 0 0 550 500 0 80 N V 21 N "Val*"
DS -4232 -1142 4232 -1142 150 21
DS 4232 -1142 4232 1142 150 21
DS 4232 1142 -4232 1142 150 21
DS -4232 1142 -4232 -1142 150 21
$PAD
Sh "1" C 550 550 0 0 0
Dr 320 0 0
At STD N 00E0FFFF
Ne 0 ""
Po -1969 512
$EndPAD
$PAD
Sh "2" C 550 550 0 0 0
Dr 320 0 0
At STD N 00E0FFFF
Ne 0 ""
Po 1969 -512
$EndPAD
$EndMODULE SIOV-S20K320
$MODULE SIOV-S20K35
Po 0 0 0 15 4A19473C 00000000 ~~
Li SIOV-S20K35
Cd Varistor Epcos SIOV-S20K35
Kw R
Sc 0
AR 
Op 0 A 0
T0 0 0 550 500 0 80 N V 21 N "VR"
T1 0 0 550 500 0 80 N V 21 N "Val*"
DS -4232 -1004 4232 -1004 150 21
DS 4232 -1004 4232 1004 150 21
DS 4232 1004 -4232 1004 150 21
DS -4232 1004 -4232 -1004 150 21
$PAD
Sh "1" C 550 550 0 0 0
Dr 320 0 0
At STD N 00E0FFFF
Ne 0 ""
Po -1969 433
$EndPAD
$PAD
Sh "2" C 550 550 0 0 0
Dr 320 0 0
At STD N 00E0FFFF
Ne 0 ""
Po 1969 -433
$EndPAD
$EndMODULE SIOV-S20K35
$MODULE SIOV-S20K385
Po 0 0 0 15 4A19473C 00000000 ~~
Li SIOV-S20K385
Cd Varistor Epcos SIOV-S20K385
Kw R
Sc 0
AR 
Op 0 A 0
T0 0 0 550 500 0 80 N V 21 N "VR"
T1 0 0 550 500 0 80 N V 21 N "Val*"
DS -4232 -1240 4232 -1240 150 21
DS 4232 -1240 4232 1240 150 21
DS 4232 1240 -4232 1240 150 21
DS -4232 1240 -4232 -1240 150 21
$PAD
Sh "1" C 550 550 0 0 0
Dr 320 0 0
At STD N 00E0FFFF
Ne 0 ""
Po -1969 551
$EndPAD
$PAD
Sh "2" C 550 550 0 0 0
Dr 320 0 0
At STD N 00E0FFFF
Ne 0 ""
Po 1969 -551
$EndPAD
$EndMODULE SIOV-S20K385
$MODULE SIOV-S20K40
Po 0 0 0 15 4A19473C 00000000 ~~
Li SIOV-S20K40
Cd Varistor Epcos SIOV-S20K40
Kw R
Sc 0
AR 
Op 0 A 0
T0 0 0 550 500 0 80 N V 21 N "VR"
T1 0 0 550 500 0 80 N V 21 N "Val*"
DS -4232 -1063 4232 -1063 150 21
DS 4232 -1063 4232 1063 150 21
DS 4232 1063 -4232 1063 150 21
DS -4232 1063 -4232 -1063 150 21
$PAD
Sh "1" C 550 550 0 0 0
Dr 320 0 0
At STD N 00E0FFFF
Ne 0 ""
Po -1969 472
$EndPAD
$PAD
Sh "2" C 550 550 0 0 0
Dr 320 0 0
At STD N 00E0FFFF
Ne 0 ""
Po 1969 -472
$EndPAD
$EndMODULE SIOV-S20K40
$MODULE SIOV-S20K420
Po 0 0 0 15 4A19473C 00000000 ~~
Li SIOV-S20K420
Cd Varistor Epcos SIOV-S20K420
Kw R
Sc 0
AR 
Op 0 A 0
T0 0 0 550 500 0 80 N V 21 N "VR"
T1 0 0 550 500 0 80 N V 21 N "Val*"
DS -4232 -1280 4232 -1280 150 21
DS 4232 -1280 4232 1280 150 21
DS 4232 1280 -4232 1280 150 21
DS -4232 1280 -4232 -1280 150 21
$PAD
Sh "1" C 550 550 0 0 0
Dr 320 0 0
At STD N 00E0FFFF
Ne 0 ""
Po -1969 610
$EndPAD
$PAD
Sh "2" C 550 550 0 0 0
Dr 320 0 0
At STD N 00E0FFFF
Ne 0 ""
Po 1969 -610
$EndPAD
$EndMODULE SIOV-S20K420
$MODULE SIOV-S20K440
Po 0 0 0 15 4A19473C 00000000 ~~
Li SIOV-S20K440
Cd Varistor Epcos SIOV-S20K440
Kw R
Sc 0
AR 
Op 0 A 0
T0 0 0 550 500 0 80 N V 21 N "VR"
T1 0 0 550 500 0 80 N V 21 N "Val*"
DS -4232 -1319 4232 -1319 150 21
DS 4232 -1319 4232 1319 150 21
DS 4232 1319 -4232 1319 150 21
DS -4232 1319 -4232 -1319 150 21
$PAD
Sh "1" C 550 550 0 0 0
Dr 320 0 0
At STD N 00E0FFFF
Ne 0 ""
Po -1969 610
$EndPAD
$PAD
Sh "2" C 550 550 0 0 0
Dr 320 0 0
At STD N 00E0FFFF
Ne 0 ""
Po 1969 -610
$EndPAD
$EndMODULE SIOV-S20K440
$MODULE SIOV-S20K460
Po 0 0 0 15 4A19473C 00000000 ~~
Li SIOV-S20K460
Cd Varistor Epcos SIOV-S20K460
Kw R
Sc 0
AR 
Op 0 A 0
T0 0 0 550 500 0 80 N V 21 N "VR"
T1 0 0 550 500 0 80 N V 21 N "Val*"
DS -4232 -1339 4232 -1339 150 21
DS 4232 -1339 4232 1339 150 21
DS 4232 1339 -4232 1339 150 21
DS -4232 1339 -4232 -1339 150 21
$PAD
Sh "1" C 550 550 0 0 0
Dr 320 0 0
At STD N 00E0FFFF
Ne 0 ""
Po -1969 650
$EndPAD
$PAD
Sh "2" C 550 550 0 0 0
Dr 320 0 0
At STD N 00E0FFFF
Ne 0 ""
Po 1969 -650
$EndPAD
$EndMODULE SIOV-S20K460
$MODULE SIOV-S20K50
Po 0 0 0 15 4A19473C 00000000 ~~
Li SIOV-S20K50
Cd Varistor Epcos SIOV-S20K50
Kw R
Sc 0
AR 
Op 0 A 0
T0 0 0 550 500 0 80 N V 21 N "VR"
T1 0 0 550 500 0 80 N V 21 N "Val*"
DS -4232 -846 4232 -846 150 21
DS 4232 -846 4232 846 150 21
DS 4232 846 -4232 846 150 21
DS -4232 846 -4232 -846 150 21
$PAD
Sh "1" C 550 550 0 0 0
Dr 320 0 0
At STD N 00E0FFFF
Ne 0 ""
Po -1969 295
$EndPAD
$PAD
Sh "2" C 550 550 0 0 0
Dr 320 0 0
At STD N 00E0FFFF
Ne 0 ""
Po 1969 -295
$EndPAD
$EndMODULE SIOV-S20K50
$MODULE SIOV-S20K510
Po 0 0 0 15 4A19473C 00000000 ~~
Li SIOV-S20K510
Cd Varistor Epcos SIOV-S20K510
Kw R
Sc 0
AR 
Op 0 A 0
T0 0 0 550 500 0 80 N V 21 N "VR"
T1 0 0 550 500 0 80 N V 21 N "Val*"
DS -4232 -1398 4232 -1398 150 21
DS 4232 -1398 4232 1398 150 21
DS 4232 1398 -4232 1398 150 21
DS -4232 1398 -4232 -1398 150 21
$PAD
Sh "1" C 550 550 0 0 0
Dr 320 0 0
At STD N 00E0FFFF
Ne 0 ""
Po -1969 689
$EndPAD
$PAD
Sh "2" C 550 550 0 0 0
Dr 320 0 0
At STD N 00E0FFFF
Ne 0 ""
Po 1969 -689
$EndPAD
$EndMODULE SIOV-S20K510
$MODULE SIOV-S20K550
Po 0 0 0 15 4A19473C 00000000 ~~
Li SIOV-S20K550
Cd Varistor Epcos SIOV-S20K550
Kw R
Sc 0
AR 
Op 0 A 0
T0 0 0 550 500 0 80 N V 21 N "VR"
T1 0 0 550 500 0 80 N V 21 N "Val*"
DS -4232 -1476 4232 -1476 150 21
DS 4232 -1476 4232 1476 150 21
DS 4232 1476 -4232 1476 150 21
DS -4232 1476 -4232 -1476 150 21
$PAD
Sh "1" C 550 550 0 0 0
Dr 320 0 0
At STD N 00E0FFFF
Ne 0 ""
Po -1969 768
$EndPAD
$PAD
Sh "2" C 550 550 0 0 0
Dr 320 0 0
At STD N 00E0FFFF
Ne 0 ""
Po 1969 -768
$EndPAD
$EndMODULE SIOV-S20K550
$MODULE SIOV-S20K60
Po 0 0 0 15 4A19473C 00000000 ~~
Li SIOV-S20K60
Cd Varistor Epcos SIOV-S20K60
Kw R
Sc 0
AR 
Op 0 A 0
T0 0 0 550 500 0 80 N V 21 N "VR"
T1 0 0 550 500 0 80 N V 21 N "Val*"
DS -4232 -866 4232 -866 150 21
DS 4232 -866 4232 866 150 21
DS 4232 866 -4232 866 150 21
DS -4232 866 -4232 -866 150 21
$PAD
Sh "1" C 550 550 0 0 0
Dr 320 0 0
At STD N 00E0FFFF
Ne 0 ""
Po -1969 315
$EndPAD
$PAD
Sh "2" C 550 550 0 0 0
Dr 320 0 0
At STD N 00E0FFFF
Ne 0 ""
Po 1969 -315
$EndPAD
$EndMODULE SIOV-S20K60
$MODULE SIOV-S20K625
Po 0 0 0 15 4A19473C 00000000 ~~
Li SIOV-S20K625
Cd Varistor Epcos SIOV-S20K625
Kw R
Sc 0
AR 
Op 0 A 0
T0 0 0 550 500 0 80 N V 21 N "VR"
T1 0 0 550 500 0 80 N V 21 N "Val*"
DS -4232 -1555 4232 -1555 150 21
DS 4232 -1555 4232 1555 150 21
DS 4232 1555 -4232 1555 150 21
DS -4232 1555 -4232 -1555 150 21
$PAD
Sh "1" C 550 550 0 0 0
Dr 320 0 0
At STD N 00E0FFFF
Ne 0 ""
Po -1969 827
$EndPAD
$PAD
Sh "2" C 550 550 0 0 0
Dr 320 0 0
At STD N 00E0FFFF
Ne 0 ""
Po 1969 -827
$EndPAD
$EndMODULE SIOV-S20K625
$MODULE SIOV-S20K680
Po 0 0 0 15 4A19473C 00000000 ~~
Li SIOV-S20K680
Cd Varistor Epcos SIOV-S20K680
Kw R
Sc 0
AR 
Op 0 A 0
T0 0 0 550 500 0 80 N V 21 N "VR"
T1 0 0 550 500 0 80 N V 21 N "Val*"
DS -4232 -1654 4232 -1654 150 21
DS 4232 -1654 4232 1654 150 21
DS 4232 1654 -4232 1654 150 21
DS -4232 1654 -4232 -1654 150 21
$PAD
Sh "1" C 550 550 0 0 0
Dr 320 0 0
At STD N 00E0FFFF
Ne 0 ""
Po -1969 886
$EndPAD
$PAD
Sh "2" C 550 550 0 0 0
Dr 320 0 0
At STD N 00E0FFFF
Ne 0 ""
Po 1969 -886
$EndPAD
$EndMODULE SIOV-S20K680
$MODULE SIOV-S20K75
Po 0 0 0 15 4A19473C 00000000 ~~
Li SIOV-S20K75
Cd Varistor Epcos SIOV-S20K75
Kw R
Sc 0
AR 
Op 0 A 0
T0 0 0 550 500 0 80 N V 21 N "VR"
T1 0 0 550 500 0 80 N V 21 N "Val*"
DS -4232 -906 4232 -906 150 21
DS 4232 -906 4232 906 150 21
DS 4232 906 -4232 906 150 21
DS -4232 906 -4232 -906 150 21
$PAD
Sh "1" C 550 550 0 0 0
Dr 320 0 0
At STD N 00E0FFFF
Ne 0 ""
Po -1969 315
$EndPAD
$PAD
Sh "2" C 550 550 0 0 0
Dr 320 0 0
At STD N 00E0FFFF
Ne 0 ""
Po 1969 -315
$EndPAD
$EndMODULE SIOV-S20K75
$MODULE SIOV-S20K95
Po 0 0 0 15 4A19473C 00000000 ~~
Li SIOV-S20K95
Cd Varistor Epcos SIOV-S20K95
Kw R
Sc 0
AR 
Op 0 A 0
T0 0 0 550 500 0 80 N V 21 N "VR"
T1 0 0 550 500 0 80 N V 21 N "Val*"
DS -4232 -886 4232 -886 150 21
DS 4232 -886 4232 886 150 21
DS 4232 886 -4232 886 150 21
DS -4232 886 -4232 -886 150 21
$PAD
Sh "1" C 550 550 0 0 0
Dr 320 0 0
At STD N 00E0FFFF
Ne 0 ""
Po -1969 315
$EndPAD
$PAD
Sh "2" C 550 550 0 0 0
Dr 320 0 0
At STD N 00E0FFFF
Ne 0 ""
Po 1969 -315
$EndPAD
$EndMODULE SIOV-S20K95
$EndLIBRARY
