PCBNEW-LibModule-V1  11.5.2012 22:03:10
# encoding utf-8
$INDEX
Mini_din3
Mini_din4
Mini_din5
Mini_din6
Mini_din7
Mini_din8
$EndINDEX
$MODULE Mini_din3
Po 0 0 0 15 4FAD6F5D 00000000 ~~
Li Mini_din3
Kw MINI DIN
Sc 00000000
AR
Op 0 0 0
T0 0 -3000 600 600 0 120 N V 21 N "Mini_din3"
T1 0 2756 600 600 0 120 N I 21 N "CON*"
DS -2500 500 -2500 -2000 150 21
DS -2500 -2000 2500 -2000 150 21
DS 2500 -2000 2500 2000 150 21
DS 2500 2000 -2500 2000 150 21
DS -2500 2000 -2500 500 150 21
$PAD
Sh "1" C 540 540 0 0 0
Dr 200 0 0
At STD N 00E0FFFF
Ne 0 ""
Po 50 -1450
$EndPAD
$PAD
Sh "3" C 540 540 0 0 0
Dr 200 0 0
At STD N 00E0FFFF
Ne 0 ""
Po -1250 -500
$EndPAD
$PAD
Sh "2" C 540 540 0 0 0
Dr 200 0 0
At STD N 00E0FFFF
Ne 0 ""
Po 1250 -500
$EndPAD
$PAD
Sh "GND" R 1260 787 0 0 0
Dr 200 0 0
At STD N 00F0FFFF
Ne 0 ""
Po 0 700
$EndPAD
$PAD
Sh "GND" R 854 1260 0 0 0
Dr 200 0 0
At STD N 00F0FFFF
Ne 0 ""
Po 2750 500
$EndPAD
$PAD
Sh "GND" R 854 1260 0 0 0
Dr 276 0 0
At STD N 00F0FFFF
Ne 0 ""
Po -2750 500
$EndPAD
$SHAPE3D
Na "Connectors\\DIN\\minidin_3.wrl"
Sc 1.000000 1.000000 1.000000
Of 0.000000 0.000000 0.000000
Ro 0.000000 0.000000 0.000000
$EndSHAPE3D
$EndMODULE  Mini_din3
$MODULE Mini_din4
Po 0 0 0 15 4FAD6FB2 00000000 ~~
Li Mini_din4
Kw MINI DIN
Sc 00000000
AR
Op 0 0 0
T0 0 -2657 600 600 0 120 N V 21 N "Mini_din4"
T1 0 2756 600 600 0 120 N I 21 N "CON*"
DS -2500 500 -2500 -2000 150 21
DS -2500 -2000 2500 -2000 150 21
DS 2500 -2000 2500 2000 150 21
DS 2500 2000 -2500 2000 150 21
DS -2500 2000 -2500 500 150 21
$PAD
Sh "1" C 540 540 0 0 0
Dr 200 0 0
At STD N 00E0FFFF
Ne 0 ""
Po 1250 -1500
$EndPAD
$PAD
Sh "4" C 540 540 0 0 0
Dr 200 0 0
At STD N 00E0FFFF
Ne 0 ""
Po -1250 -1500
$EndPAD
$PAD
Sh "3" C 540 540 0 0 0
Dr 200 0 0
At STD N 00E0FFFF
Ne 0 ""
Po -1250 -500
$EndPAD
$PAD
Sh "2" C 540 540 0 0 0
Dr 200 0 0
At STD N 00E0FFFF
Ne 0 ""
Po 1250 -500
$EndPAD
$PAD
Sh "GND" R 1260 787 0 0 0
Dr 200 0 0
At STD N 00F0FFFF
Ne 0 ""
Po 0 700
$EndPAD
$PAD
Sh "GND" R 854 1260 0 0 0
Dr 200 0 0
At STD N 00F0FFFF
Ne 0 ""
Po 2750 500
$EndPAD
$PAD
Sh "GND" R 854 1260 0 0 0
Dr 276 0 0
At STD N 00F0FFFF
Ne 0 ""
Po -2750 500
$EndPAD
$SHAPE3D
Na "Connectors\\DIN\\minidin_4.wrl"
Sc 1.000000 1.000000 1.000000
Of 0.000000 0.000000 0.000000
Ro 0.000000 0.000000 0.000000
$EndSHAPE3D
$EndMODULE  Mini_din4
$MODULE Mini_din5
Po 0 0 0 15 4FAD6FDA 00000000 ~~
Li Mini_din5
Kw MINI DIN
Sc 00000000
AR
Op 0 0 0
T0 0 -2559 600 600 0 120 N V 21 N "Mini_din5"
T1 0 2756 600 600 0 120 N I 21 N "CON*"
DS -2500 500 -2500 -2000 150 21
DS -2500 -2000 2500 -2000 150 21
DS 2500 -2000 2500 2000 150 21
DS 2500 2000 -2500 2000 150 21
DS -2500 2000 -2500 500 150 21
$PAD
Sh "3" C 540 540 0 0 0
Dr 200 0 0
At STD N 00E0FFFF
Ne 0 ""
Po -400 -500
$EndPAD
$PAD
Sh "1" C 540 540 0 0 0
Dr 200 0 0
At STD N 00E0FFFF
Ne 0 ""
Po 1250 -1500
$EndPAD
$PAD
Sh "5" C 540 540 0 0 0
Dr 200 0 0
At STD N 00E0FFFF
Ne 0 ""
Po -1250 -1500
$EndPAD
$PAD
Sh "4" C 540 540 0 0 0
Dr 200 0 0
At STD N 00E0FFFF
Ne 0 ""
Po -1250 -500
$EndPAD
$PAD
Sh "2" C 540 540 0 0 0
Dr 200 0 0
At STD N 00E0FFFF
Ne 0 ""
Po 1250 -500
$EndPAD
$PAD
Sh "GND" R 1260 787 0 0 0
Dr 200 0 0
At STD N 00F0FFFF
Ne 0 ""
Po 0 700
$EndPAD
$PAD
Sh "GND" R 854 1260 0 0 0
Dr 200 0 0
At STD N 00F0FFFF
Ne 0 ""
Po 2750 500
$EndPAD
$PAD
Sh "GND" R 854 1260 0 0 0
Dr 276 0 0
At STD N 00F0FFFF
Ne 0 ""
Po -2750 500
$EndPAD
$SHAPE3D
Na "Connectors\\DIN\\minidin_5.wrl"
Sc 1.000000 1.000000 1.000000
Of 0.000000 0.000000 0.000000
Ro 0.000000 0.000000 0.000000
$EndSHAPE3D
$EndMODULE  Mini_din5
$MODULE Mini_din6
Po 0 0 0 15 4FAD7022 00000000 ~~
Li Mini_din6
Kw MINI DIN
Sc 00000000
AR
Op 0 0 0
T0 0 -3000 600 600 0 120 N V 21 N "Mini_din6"
T1 0 2756 600 600 0 120 N I 21 N "CON*"
DS -2500 500 -2500 -2000 150 21
DS -2500 -2000 2500 -2000 150 21
DS 2500 -2000 2500 2000 150 21
DS 2500 2000 -2500 2000 150 21
DS -2500 2000 -2500 500 150 21
$PAD
Sh "4" C 540 540 0 0 0
Dr 200 0 0
At STD N 00E0FFFF
Ne 0 ""
Po -400 -500
$EndPAD
$PAD
Sh "3" C 540 540 0 0 0
Dr 200 0 0
At STD N 00E0FFFF
Ne 0 ""
Po 450 -500
$EndPAD
$PAD
Sh "1" C 540 540 0 0 0
Dr 200 0 0
At STD N 00E0FFFF
Ne 0 ""
Po 1250 -1500
$EndPAD
$PAD
Sh "6" C 540 540 0 0 0
Dr 200 0 0
At STD N 00E0FFFF
Ne 0 ""
Po -1250 -1500
$EndPAD
$PAD
Sh "5" C 540 540 0 0 0
Dr 200 0 0
At STD N 00E0FFFF
Ne 0 ""
Po -1250 -500
$EndPAD
$PAD
Sh "2" C 540 540 0 0 0
Dr 200 0 0
At STD N 00E0FFFF
Ne 0 ""
Po 1250 -500
$EndPAD
$PAD
Sh "GND" R 1260 787 0 0 0
Dr 200 0 0
At STD N 00F0FFFF
Ne 0 ""
Po 0 700
$EndPAD
$PAD
Sh "GND" R 854 1260 0 0 0
Dr 200 0 0
At STD N 00F0FFFF
Ne 0 ""
Po 2750 500
$EndPAD
$PAD
Sh "GND" R 854 1260 0 0 0
Dr 276 0 0
At STD N 00F0FFFF
Ne 0 ""
Po -2750 500
$EndPAD
$SHAPE3D
Na "Connectors\\DIN\\minidin_6.wrl"
Sc 1.000000 1.000000 1.000000
Of 0.000000 0.000000 0.000000
Ro 0.000000 0.000000 0.000000
$EndSHAPE3D
$EndMODULE  Mini_din6
$MODULE Mini_din7
Po 0 0 0 15 4FAD7048 00000000 ~~
Li Mini_din7
Kw MINI DIN
Sc 00000000
AR
Op 0 0 0
T0 0 -2657 600 600 0 120 N V 21 N "Mini_din7"
T1 0 2756 600 600 0 120 N I 21 N "CON*"
DS -2500 500 -2500 -2000 150 21
DS -2500 -2000 2500 -2000 150 21
DS 2500 -2000 2500 2000 150 21
DS 2500 2000 -2500 2000 150 21
DS -2500 2000 -2500 500 150 21
$PAD
Sh "4" C 540 540 0 0 0
Dr 200 0 0
At STD N 00E0FFFF
Ne 0 ""
Po -400 -500
$EndPAD
$PAD
Sh "3" C 540 540 0 0 0
Dr 200 0 0
At STD N 00E0FFFF
Ne 0 ""
Po 450 -500
$EndPAD
$PAD
Sh "1" C 540 540 0 0 0
Dr 200 0 0
At STD N 00E0FFFF
Ne 0 ""
Po 1250 -1500
$EndPAD
$PAD
Sh "6" C 540 540 0 0 0
Dr 200 0 0
At STD N 00E0FFFF
Ne 0 ""
Po -1250 -1500
$EndPAD
$PAD
Sh "5" C 540 540 0 0 0
Dr 200 0 0
At STD N 00E0FFFF
Ne 0 ""
Po -1250 -500
$EndPAD
$PAD
Sh "2" C 540 540 0 0 0
Dr 200 0 0
At STD N 00E0FFFF
Ne 0 ""
Po 1250 -500
$EndPAD
$PAD
Sh "GND" R 1260 787 0 0 0
Dr 200 0 0
At STD N 00F0FFFF
Ne 0 ""
Po 0 700
$EndPAD
$PAD
Sh "GND" R 854 1260 0 0 0
Dr 200 0 0
At STD N 00F0FFFF
Ne 0 ""
Po 2750 500
$EndPAD
$PAD
Sh "GND" R 854 1260 0 0 0
Dr 276 0 0
At STD N 00F0FFFF
Ne 0 ""
Po -2750 500
$EndPAD
$PAD
Sh "7" C 540 540 0 0 0
Dr 200 0 0
At STD N 00E0FFFF
Ne 0 ""
Po 450 -1500
$EndPAD
$SHAPE3D
Na "Connectors\\DIN\\minidin_7.wrl"
Sc 1.000000 1.000000 1.000000
Of 0.000000 0.000000 0.000000
Ro 0.000000 0.000000 0.000000
$EndSHAPE3D
$EndMODULE  Mini_din7
$MODULE Mini_din8
Po 0 0 0 15 4FAD706A 00000000 ~~
Li Mini_din8
Kw MINI DIN
Sc 00000000
AR 
Op 0 0 0
T0 0 -2559 600 600 0 120 N V 21 N "Mini_din8"
T1 0 2756 600 600 0 120 N I 21 N "CON*"
DS -2500 500 -2500 -2000 150 21
DS -2500 -2000 2500 -2000 150 21
DS 2500 -2000 2500 2000 150 21
DS 2500 2000 -2500 2000 150 21
DS -2500 2000 -2500 500 150 21
$PAD
Sh "4" C 540 540 0 0 0
Dr 200 0 0
At STD N 00E0FFFF
Ne 0 ""
Po -400 -500
$EndPAD
$PAD
Sh "3" C 540 540 0 0 0
Dr 200 0 0
At STD N 00E0FFFF
Ne 0 ""
Po 450 -500
$EndPAD
$PAD
Sh "1" C 540 540 0 0 0
Dr 200 0 0
At STD N 00E0FFFF
Ne 0 ""
Po 1250 -1500
$EndPAD
$PAD
Sh "6" C 540 540 0 0 0
Dr 200 0 0
At STD N 00E0FFFF
Ne 0 ""
Po -1250 -1500
$EndPAD
$PAD
Sh "5" C 540 540 0 0 0
Dr 200 0 0
At STD N 00E0FFFF
Ne 0 ""
Po -1250 -500
$EndPAD
$PAD
Sh "2" C 540 540 0 0 0
Dr 200 0 0
At STD N 00E0FFFF
Ne 0 ""
Po 1250 -500
$EndPAD
$PAD
Sh "GND" R 1260 787 0 0 0
Dr 200 0 0
At STD N 00F0FFFF
Ne 0 ""
Po 0 700
$EndPAD
$PAD
Sh "GND" R 854 1260 0 0 0
Dr 200 0 0
At STD N 00F0FFFF
Ne 0 ""
Po 2750 500
$EndPAD
$PAD
Sh "GND" R 854 1260 0 0 0
Dr 276 0 0
At STD N 00F0FFFF
Ne 0 ""
Po -2750 500
$EndPAD
$PAD
Sh "8" C 540 540 0 0 0
Dr 200 0 0
At STD N 00E0FFFF
Ne 0 ""
Po 450 -1500
$EndPAD
$PAD
Sh "7" C 540 540 0 0 0
Dr 200 0 0
At STD N 00E0FFFF
Ne 0 ""
Po -400 -1500
$EndPAD
$SHAPE3D
Na "Connectors\\DIN\\minidin_8.wrl"
Sc 1.000000 1.000000 1.000000
Of 0.000000 0.000000 0.000000
Ro 0.000000 0.000000 0.000000
$EndSHAPE3D
$EndMODULE  Mini_din8
$EndLIBRARY
