PCBNEW-LibModule-V1  Čt 21. červen 2012, 21:26:29 CEST
# encoding utf-8
Units deci-mils
$INDEX
CENTRONICS_F
DB9_PCB
$EndINDEX
$MODULE CENTRONICS_F
Po 0 0 0 15 4FD0D3E1 00000000 ~~
Li CENTRONICS_F
Kw centronics pcb female
Sc 0
AR 
Op 0 0 0
T0 -6670 -3200 600 600 0 120 N V 21 N "CENTRONICS_F"
T1 7310 -3200 600 600 0 120 N V 21 N "VAL**"
DS -9650 7760 -9650 4410 150 21
DS -9650 7760 9650 7760 150 21
DS 9650 4410 9650 7760 150 21
DS 13340 4410 -13340 4410 150 21
DS -13340 -2370 -13340 4410 150 21
DS -13340 -2370 13340 -2370 150 21
DS 13340 4410 13340 -2370 150 21
$PAD
Sh "36" C 520 520 0 0 0
Dr 320 0 0
At STD N 00E0FFFF
Ne 0 ""
Po -7225 845
$EndPAD
$PAD
Sh "35" C 520 520 0 0 0
Dr 320 0 0
At STD N 00E0FFFF
Ne 0 ""
Po -6375 845
$EndPAD
$PAD
Sh "34" C 520 520 0 0 0
Dr 320 0 0
At STD N 00E0FFFF
Ne 0 ""
Po -5525 845
$EndPAD
$PAD
Sh "33" C 520 520 0 0 0
Dr 320 0 0
At STD N 00E0FFFF
Ne 0 ""
Po -4675 845
$EndPAD
$PAD
Sh "32" C 520 520 0 0 0
Dr 320 0 0
At STD N 00E0FFFF
Ne 0 ""
Po -3825 845
$EndPAD
$PAD
Sh "31" C 520 520 0 0 0
Dr 320 0 0
At STD N 00E0FFFF
Ne 0 ""
Po -2975 845
$EndPAD
$PAD
Sh "30" C 520 520 0 0 0
Dr 320 0 0
At STD N 00E0FFFF
Ne 0 ""
Po -2125 845
$EndPAD
$PAD
Sh "29" C 520 520 0 0 0
Dr 320 0 0
At STD N 00E0FFFF
Ne 0 ""
Po -1275 845
$EndPAD
$PAD
Sh "28" C 520 520 0 0 0
Dr 320 0 0
At STD N 00E0FFFF
Ne 0 ""
Po -425 845
$EndPAD
$PAD
Sh "27" C 520 520 0 0 0
Dr 320 0 0
At STD N 00E0FFFF
Ne 0 ""
Po 425 845
$EndPAD
$PAD
Sh "26" C 520 520 0 0 0
Dr 320 0 0
At STD N 00E0FFFF
Ne 0 ""
Po 1275 845
$EndPAD
$PAD
Sh "25" C 520 520 0 0 0
Dr 320 0 0
At STD N 00E0FFFF
Ne 0 ""
Po 2125 845
$EndPAD
$PAD
Sh "24" C 520 520 0 0 0
Dr 320 0 0
At STD N 00E0FFFF
Ne 0 ""
Po 2975 845
$EndPAD
$PAD
Sh "23" C 520 520 0 0 0
Dr 320 0 0
At STD N 00E0FFFF
Ne 0 ""
Po 3825 845
$EndPAD
$PAD
Sh "22" C 520 520 0 0 0
Dr 320 0 0
At STD N 00E0FFFF
Ne 0 ""
Po 4675 845
$EndPAD
$PAD
Sh "21" C 520 520 0 0 0
Dr 320 0 0
At STD N 00E0FFFF
Ne 0 ""
Po 5525 845
$EndPAD
$PAD
Sh "20" C 520 520 0 0 0
Dr 320 0 0
At STD N 00E0FFFF
Ne 0 ""
Po 6375 845
$EndPAD
$PAD
Sh "19" C 520 520 0 0 0
Dr 320 0 0
At STD N 00E0FFFF
Ne 0 ""
Po 7225 845
$EndPAD
$PAD
Sh "1" C 520 520 0 0 0
Dr 320 0 0
At STD N 00E0FFFF
Ne 0 ""
Po 7225 -845
$EndPAD
$PAD
Sh "2" C 520 520 0 0 0
Dr 320 0 0
At STD N 00E0FFFF
Ne 0 ""
Po 6375 -845
$EndPAD
$PAD
Sh "3" C 520 520 0 0 0
Dr 320 0 0
At STD N 00E0FFFF
Ne 0 ""
Po 5525 -845
$EndPAD
$PAD
Sh "4" C 520 520 0 0 0
Dr 320 0 0
At STD N 00E0FFFF
Ne 0 ""
Po 4675 -845
$EndPAD
$PAD
Sh "5" C 520 520 0 0 0
Dr 320 0 0
At STD N 00E0FFFF
Ne 0 ""
Po 3825 -845
$EndPAD
$PAD
Sh "6" C 520 520 0 0 0
Dr 320 0 0
At STD N 00E0FFFF
Ne 0 ""
Po 2975 -845
$EndPAD
$PAD
Sh "7" C 520 520 0 0 0
Dr 320 0 0
At STD N 00E0FFFF
Ne 0 ""
Po 2125 -845
$EndPAD
$PAD
Sh "8" C 520 520 0 0 0
Dr 320 0 0
At STD N 00E0FFFF
Ne 0 ""
Po 1275 -845
$EndPAD
$PAD
Sh "9" C 520 520 0 0 0
Dr 320 0 0
At STD N 00E0FFFF
Ne 0 ""
Po 425 -845
$EndPAD
$PAD
Sh "10" C 520 520 0 0 0
Dr 320 0 0
At STD N 00E0FFFF
Ne 0 ""
Po -425 -845
$EndPAD
$PAD
Sh "11" C 520 520 0 0 0
Dr 320 0 0
At STD N 00E0FFFF
Ne 0 ""
Po -1275 -845
$EndPAD
$PAD
Sh "12" C 520 520 0 0 0
Dr 320 0 0
At STD N 00E0FFFF
Ne 0 ""
Po -2125 -845
$EndPAD
$PAD
Sh "13" C 520 520 0 0 0
Dr 320 0 0
At STD N 00E0FFFF
Ne 0 ""
Po -2975 -845
$EndPAD
$PAD
Sh "14" C 520 520 0 0 0
Dr 320 0 0
At STD N 00E0FFFF
Ne 0 ""
Po -3825 -845
$EndPAD
$PAD
Sh "15" C 520 520 0 0 0
Dr 320 0 0
At STD N 00E0FFFF
Ne 0 ""
Po -4675 -845
$EndPAD
$PAD
Sh "16" C 520 520 0 0 0
Dr 320 0 0
At STD N 0000FFFF
Ne 0 ""
Po -5525 -845
$EndPAD
$PAD
Sh "17" C 520 520 0 0 0
Dr 320 0 0
At STD N 0000FFFF
Ne 0 ""
Po -6375 -845
$EndPAD
$PAD
Sh "18" C 520 520 0 0 0
Dr 320 0 0
At STD N 00E0FFFF
Ne 0 ""
Po -7225 -845
$EndPAD
$PAD
Sh "" C 1650 1650 0 0 0
Dr 1250 0 0
At STD N 00E0FFFF
Ne 0 ""
Po 11760 0
$EndPAD
$PAD
Sh "" C 1650 1650 0 0 0
Dr 1250 0 0
At STD N 00E0FFFF
Ne 0 ""
Po -11760 0
$EndPAD
$EndMODULE CENTRONICS_F
$MODULE DB9_PCB
Po 0 0 0 15 4FE37537 00000000 ~~
Li DB9_PCB
Sc 0
AR 
Op 0 0 0
T0 0 -1890 472 472 0 100 N V 21 N "DB9_PCB"
T1 0 2250 472 472 0 100 N I 21 N "VAL**"
DS -6339 -1339 -6339 3701 100 21
DS -6339 3701 6339 3701 100 21
DS 6339 3701 6339 -1339 100 21
DS 6339 -1339 -6339 -1339 100 21
DS -6339 -1339 -6339 3701 100 25
DS -6339 3701 6339 3701 100 25
DS 6339 3701 6339 -1339 100 25
DS 6339 -1339 -6339 -1339 100 25
DS 4134 3740 4134 6102 150 25
DS 4134 6102 5709 6102 150 25
DS 5709 6102 5709 3740 150 25
DS -5709 3740 -5709 6102 150 25
DS -5709 6102 -4134 6102 150 25
DS -4134 6102 -4134 3740 150 25
DS -3268 3740 -3268 6102 150 25
DS -3268 6102 3268 6102 150 25
DS 3268 6102 3268 3740 150 25
DS -6142 -1142 -6142 3740 150 25
DS -6142 3740 6142 3740 150 25
DS 6142 3740 6142 -1142 150 25
DS 6142 -1142 -6142 -1142 150 25
$PAD
Sh "1" C 630 630 0 0 0
Dr 432 0 0
At STD N 00E0FFFF
Ne 0 ""
Po 2180 -559
$EndPAD
$PAD
Sh "2" C 630 630 0 0 0
Dr 432 0 0
At STD N 00E0FFFF
Ne 0 ""
Po 1091 -559
$EndPAD
$PAD
Sh "3" C 630 630 0 0 0
Dr 432 0 0
At STD N 00E0FFFF
Ne 0 ""
Po 0 -559
$EndPAD
$PAD
Sh "4" C 630 630 0 0 0
Dr 432 0 0
At STD N 00E0FFFF
Ne 0 ""
Po -1091 -559
$EndPAD
$PAD
Sh "5" C 630 630 0 0 0
Dr 432 0 0
At STD N 00E0FFFF
Ne 0 ""
Po -2181 -559
$EndPAD
$PAD
Sh "6" C 630 630 0 0 0
Dr 432 0 0
At STD N 00E0FFFF
Ne 0 ""
Po 1636 559
$EndPAD
$PAD
Sh "7" C 630 630 0 0 0
Dr 432 0 0
At STD N 00E0FFFF
Ne 0 ""
Po 545 559
$EndPAD
$PAD
Sh "8" C 630 630 0 0 0
Dr 432 0 0
At STD N 00E0FFFF
Ne 0 ""
Po -545 559
$EndPAD
$PAD
Sh "9" C 630 630 0 0 0
Dr 432 0 0
At STD N 00E0FFFF
Ne 0 ""
Po -1636 559
$EndPAD
$PAD
Sh "SH1" C 1967 1967 0 0 0
Dr 1260 0 0
At STD N 00E0FFFF
Ne 0 ""
Po -4919 0
$EndPAD
$PAD
Sh "SH2" C 1967 1967 0 0 0
Dr 1260 0 0
At STD N 00E0FFFF
Ne 0 ""
Po 4919 0
$EndPAD
$SHAPE3D
Na "connectors/DB/db9_male_pin90deg.wrl"
Sc 1 1 1
Of 0 0 0
Ro 0 0 180
$EndSHAPE3D
$EndMODULE DB9_PCB
$EndLIBRARY
