PCBNEW-LibModule-V1  St 20. červen 2012, 18:56:22 CEST
# encoding utf-8
Units deci-mils
$INDEX
to92-1
to92-2
to92-3
$EndINDEX
$MODULE to92-1
Po 0 0 0 15 4FE20016 00000000 ~~
Li to92-1
Kw TO92
Sc 0
AR /4890C9CE
Op 0 0 0
T0 0 -1000 393 393 0 78 N V 21 N "TO92-1"
T1 0 1000 392 392 0 77 N I 21 N "Value"
DS -900 250 -900 550 150 21
DS -900 550 1000 550 150 21
DS 1000 550 1000 300 150 21
DA 0 350 -50 -650 900 150 21
DA 0 250 -900 250 900 150 21
$PAD
Sh "1" R 550 550 0 0 0
Dr 320 0 0
At STD N 00E0FFFF
Ne 2 "N-000026"
Po -1000 0
$EndPAD
$PAD
Sh "2" C 550 550 0 0 0
Dr 320 0 0
At STD N 00E0FFFF
Ne 1 "N-000017"
Po 0 0
$EndPAD
$PAD
Sh "3" C 550 550 0 0 0
Dr 320 0 0
At STD N 00E0FFFF
Ne 3 "N-000027"
Po 1000 0
$EndPAD
$SHAPE3D
Na "to-xxx-packages/to92_1.wrl"
Sc 1 1 1
Of 0 0 0
Ro 0 0 0
$EndSHAPE3D
$EndMODULE to92-1
$MODULE to92-2
Po 0 0 0 15 4FE2006E 00000000 ~~
Li to92-2
Kw TO-92
Sc 0
AR /4890C9CE
Op 0 0 0
T0 0 -3500 393 393 0 78 N V 21 N "TO92-2"
T1 0 750 393 393 0 78 N I 21 N "Value"
DA 0 -1900 -800 -2700 900 150 21
DS 0 0 0 -950 150 21
DS 1000 0 1000 -450 150 21
DS 1000 -450 450 -950 150 21
DS -1000 0 -1000 -500 150 21
DS -1000 -500 -500 -950 150 21
DS -800 -950 800 -950 150 21
DS 800 -950 800 -2650 150 21
DS 800 -2650 -800 -2650 150 21
DS -800 -2650 -800 -950 150 21
$PAD
Sh "1" R 550 550 0 0 0
Dr 320 0 0
At STD N 00E0FFFF
Ne 2 "N-000026"
Po -1000 0
$EndPAD
$PAD
Sh "2" C 550 550 0 0 0
Dr 320 0 0
At STD N 00E0FFFF
Ne 1 "N-000017"
Po 0 0
$EndPAD
$PAD
Sh "3" C 550 550 0 0 0
Dr 320 0 0
At STD N 00E0FFFF
Ne 3 "N-000027"
Po 1000 0
$EndPAD
$SHAPE3D
Na "to-xxx-packages/to92_2.wrl"
Sc 1 1 1
Of 0 0 0
Ro 0 0 0
$EndSHAPE3D
$EndMODULE to92-2
$MODULE to92-3
Po 0 0 0 15 4FE200A1 00000000 ~~
Li to92-3
Kw TO92
Sc 0
AR /4890C9CE
Op 0 0 0
T0 0 -1000 393 393 0 78 N V 21 N "TO92-3"
T1 0 3250 392 392 0 77 N I 21 N "Value"
DS 0 0 0 550 150 21
DS -1000 500 -700 800 150 21
DS 1000 500 650 800 150 21
DA 0 1700 -800 900 900 150 21
DA 0 3250 -700 2550 900 150 21
DS -1000 0 -1000 500 150 21
DS 1000 0 1000 500 150 21
DS 800 950 800 2650 150 21
DS 800 2650 -800 2650 150 21
DS -800 2650 -800 950 150 21
$PAD
Sh "1" R 550 550 0 0 0
Dr 320 0 0
At STD N 00E0FFFF
Ne 2 "N-000026"
Po -1000 0
$EndPAD
$PAD
Sh "2" C 550 550 0 0 0
Dr 320 0 0
At STD N 00E0FFFF
Ne 1 "N-000017"
Po 0 0
$EndPAD
$PAD
Sh "3" C 550 550 0 0 0
Dr 320 0 0
At STD N 00E0FFFF
Ne 3 "N-000027"
Po 1000 0
$EndPAD
$SHAPE3D
Na "to-xxx-packages/to92_3.wrl"
Sc 1 1 1
Of 0 0 0
Ro 0 0 0
$EndSHAPE3D
$EndMODULE to92-3
$EndLIBRARY
