PCBNEW-LibModule-V1  St 20. červen 2012, 19:12:40 CEST
# encoding utf-8
Units deci-mils
$INDEX
AFF-2x7SEG
ELD-426x
HDSP-48xx
HDSP-78xx
LTS-69xx
$EndINDEX
$MODULE AFF-2x7SEG
Po 0 0 0 15 4FE2042E 00000000 ~~
Li AFF-2x7SEG
Cd Afficheur 7 segments
Kw AFFICHEUR
Sc 0
AR 
Op 0 0 0
T0 0 -4250 393 393 0 78 N V 21 N "AFF-2x7SEG"
T1 0 4250 393 393 0 78 N I 21 N "Value"
DS -2500 -2250 -750 -2250 150 25
DS -1000 -250 -500 -2250 150 25
DS -3250 -250 -2750 -2250 150 25
DS -3500 2250 -1750 2250 150 25
DS -3250 250 -3750 2250 150 25
DS -1000 250 -1500 2250 150 25
DC 3500 2000 3750 2000 150 25
DS 1500 -2250 3250 -2250 150 25
DS 500 2250 2250 2250 150 25
DS 3000 250 2500 2250 150 25
DS 250 2250 750 250 150 25
DS 3000 -250 3500 -2250 150 25
DS 750 -250 1250 -2250 150 25
DS 1000 0 2750 0 150 25
DS 500 -3750 4500 -3750 150 21
DS 4500 -3750 4500 3750 150 21
DS 4500 3750 500 3750 150 21
DS -2900 0 -1300 0 150 25
DC -500 2000 -250 2000 150 25
DS -4000 -3750 -4500 -3750 150 21
DS -4500 -3750 -4500 3750 150 21
DS -4500 3750 -4000 3750 150 21
DS 0 3750 500 3750 150 21
DS 500 -3750 0 -3750 150 21
DS -4000 3750 0 3750 150 21
DS 0 -3750 -4000 -3750 150 21
DS -2950 0 -1250 0 150 25
$PAD
Sh "1" R 800 800 0 0 0
Dr 360 0 0
At STD N 00E0FFFF
Ne 0 ""
Po -3500 3000
$EndPAD
$PAD
Sh "2" C 800 800 0 0 0
Dr 360 0 0
At STD N 00E0FFFF
Ne 0 ""
Po -2500 3000
$EndPAD
$PAD
Sh "3" C 800 800 0 0 0
Dr 360 0 0
At STD N 00E0FFFF
Ne 0 ""
Po -1500 3000
$EndPAD
$PAD
Sh "4" C 800 800 0 0 0
Dr 360 0 0
At STD N 00E0FFFF
Ne 0 ""
Po -500 3000
$EndPAD
$PAD
Sh "13" C 800 800 0 0 0
Dr 360 0 0
At STD N 00E0FFFF
Ne 0 ""
Po -500 -3000
$EndPAD
$PAD
Sh "14" C 800 800 0 0 0
Dr 360 0 0
At STD N 00E0FFFF
Ne 0 ""
Po -1500 -3000
$EndPAD
$PAD
Sh "15" C 800 800 0 0 0
Dr 360 0 0
At STD N 00E0FFFF
Ne 0 ""
Po -2500 -3000
$EndPAD
$PAD
Sh "16" C 800 800 0 0 0
Dr 360 0 0
At STD N 00E0FFFF
Ne 0 ""
Po -3500 -3000
$EndPAD
$PAD
Sh "5" C 800 800 0 0 0
Dr 360 0 0
At STD N 00E0FFFF
Ne 0 ""
Po 500 3000
$EndPAD
$PAD
Sh "6" C 800 800 0 0 0
Dr 360 0 0
At STD N 00E0FFFF
Ne 0 ""
Po 1500 3000
$EndPAD
$PAD
Sh "7" C 800 800 0 0 0
Dr 360 0 0
At STD N 00E0FFFF
Ne 0 ""
Po 2500 3000
$EndPAD
$PAD
Sh "8" C 800 800 0 0 0
Dr 360 0 0
At STD N 00E0FFFF
Ne 0 ""
Po 3500 3000
$EndPAD
$PAD
Sh "12" C 800 800 0 0 0
Dr 360 0 0
At STD N 00E0FFFF
Ne 0 ""
Po 500 -3000
$EndPAD
$PAD
Sh "11" C 800 800 0 0 0
Dr 360 0 0
At STD N 00E0FFFF
Ne 0 ""
Po 1500 -3000
$EndPAD
$PAD
Sh "10" C 800 800 0 0 0
Dr 360 0 0
At STD N 00E0FFFF
Ne 0 ""
Po 2500 -3000
$EndPAD
$PAD
Sh "9" C 800 800 0 0 0
Dr 360 0 0
At STD N 00E0FFFF
Ne 0 ""
Po 3500 -3000
$EndPAD
$EndMODULE AFF-2x7SEG
$MODULE ELD-426x
Po 0 0 0 15 4FE202D0 00000000 ~~
Li ELD-426x
Cd Afficheur 7 segments
Kw AFFICHEUR
Sc 0
AR 
Op 0 0 0
T0 0 -3800 393 393 0 78 N V 21 N "ELD-426x"
T1 0 4000 393 393 0 78 N I 21 N "Value"
DS -4000 3200 -4000 -3200 120 21
DS 4000 -3200 4000 3200 120 21
DS -4000 -3200 4000 -3200 120 21
DS -4000 3200 4000 3200 120 21
DS -2500 -2250 -750 -2250 150 25
DS -1000 -250 -500 -2250 150 25
DS -3250 -250 -2750 -2250 150 25
DS -3500 2250 -1750 2250 150 25
DS -3250 250 -3750 2250 150 25
DS -1000 250 -1500 2250 150 25
DC 3500 2000 3750 2000 150 25
DS 1500 -2250 3250 -2250 150 25
DS 500 2250 2250 2250 150 25
DS 3000 250 2500 2250 150 25
DS 250 2250 750 250 150 25
DS 3000 -250 3500 -2250 150 25
DS 750 -250 1250 -2250 150 25
DS 1000 0 2750 0 150 25
DS -2900 0 -1300 0 150 25
DC -500 2000 -250 2000 150 25
DS -2950 0 -1250 0 150 25
$PAD
Sh "1" R 800 800 0 0 0
Dr 360 0 0
At STD N 00E0FFFF
Ne 0 ""
Po -2000 2500
$EndPAD
$PAD
Sh "2" C 800 800 0 0 0
Dr 360 0 0
At STD N 00E0FFFF
Ne 0 ""
Po -1000 2500
$EndPAD
$PAD
Sh "3" C 800 800 0 0 0
Dr 360 0 0
At STD N 00E0FFFF
Ne 0 ""
Po 0 2500
$EndPAD
$PAD
Sh "4" C 800 800 0 0 0
Dr 360 0 0
At STD N 00E0FFFF
Ne 0 ""
Po 1000 2500
$EndPAD
$PAD
Sh "9" C 800 800 0 0 0
Dr 360 0 0
At STD N 00E0FFFF
Ne 0 ""
Po -1000 -2500
$EndPAD
$PAD
Sh "10" C 800 800 0 0 0
Dr 360 0 0
At STD N 00E0FFFF
Ne 0 ""
Po -2000 -2500
$EndPAD
$PAD
Sh "5" C 800 800 0 0 0
Dr 360 0 0
At STD N 00E0FFFF
Ne 0 ""
Po 2000 2500
$EndPAD
$PAD
Sh "7" C 800 800 0 0 0
Dr 360 0 0
At STD N 00E0FFFF
Ne 0 ""
Po 1000 -2500
$EndPAD
$PAD
Sh "6" C 800 800 0 0 0
Dr 360 0 0
At STD N 00E0FFFF
Ne 0 ""
Po 2000 -2500
$EndPAD
$PAD
Sh "8" C 800 800 0 0 0
Dr 360 0 0
At STD N 00E0FFFF
Ne 0 ""
Po 0 -2500
$EndPAD
$EndMODULE ELD-426x
$MODULE HDSP-48xx
Po 0 0 0 15 429C5022 00000000 ~~
Li HDSP-48xx
Cd Barre 10 points
Kw BAR GRAPH
Sc 0
AR 
Op 0 0 0
T0 0 -3000 700 450 0 120 N V 21 N "BAR***"
T1 0 2800 700 400 0 120 N V 21 N "HDSP-48xx"
DS 4200 -1000 4800 -1000 120 21
DS 4800 -1000 4800 800 120 21
DS 4800 800 4200 800 120 21
DS 4200 800 4200 -1000 120 21
DS 3200 -1000 3800 -1000 120 21
DS 3800 -1000 3800 800 120 21
DS 3800 800 3200 800 120 21
DS 3200 800 3200 -1000 120 21
DS 2200 -1000 2800 -1000 120 21
DS 2800 -1000 2800 800 120 21
DS 2800 800 2200 800 120 21
DS 2200 800 2200 -1000 120 21
DS 1200 -1000 1800 -1000 120 21
DS 1800 -1000 1800 800 120 21
DS 1800 800 1200 800 120 21
DS 1200 800 1200 -1000 120 21
DS 200 -1000 800 -1000 120 21
DS 800 -1000 800 800 120 21
DS 800 800 200 800 120 21
DS 200 800 200 -1000 120 21
DS -800 -1000 -200 -1000 120 21
DS -200 -1000 -200 800 120 21
DS -200 800 -800 800 120 21
DS -800 800 -800 -1000 120 21
DS -1800 800 -1200 800 120 21
DS -1200 800 -1200 -1000 120 21
DS -1200 -1000 -1800 -1000 120 21
DS -1800 -1000 -1800 800 120 21
DS -2800 -1000 -2200 -1000 120 21
DS -2200 -1000 -2200 800 120 21
DS -2200 800 -2800 800 120 21
DS -2800 800 -2800 -1000 120 21
DS -3800 800 -3800 -1000 120 21
DS -3800 -1000 -3200 -1000 120 21
DS -3200 -1000 -3200 800 120 21
DS -3200 800 -3800 800 120 21
DS -4800 800 -4800 -1000 120 21
DS -4800 -1000 -4200 -1000 120 21
DS -4200 -1000 -4200 800 120 21
DS -4200 800 -4800 800 120 21
DS 4400 800 4600 800 120 21
DS 4600 -1000 4400 -1000 120 21
DS 3400 800 3600 800 120 21
DS 3600 -1000 3400 -1000 120 21
DS 2400 800 2600 800 120 21
DS 2600 -1000 2400 -1000 120 21
DS 1400 800 1600 800 120 21
DS 1600 -1000 1400 -1000 120 21
DS 400 800 600 800 120 21
DS 600 -1000 400 -1000 120 21
DS -600 800 -400 800 120 21
DS -400 -1000 -600 -1000 120 21
DS -1400 -1000 -1600 -1000 120 21
DS -1600 800 -1400 800 120 21
DS -2600 800 -2400 800 120 21
DS -2400 -1000 -2600 -1000 120 21
DS -3600 800 -3400 800 120 21
DS -3400 -1000 -3600 -1000 120 21
DS -4600 -1000 -4400 -1000 120 21
DS -4400 800 -4600 800 120 21
DS 5000 -2000 5000 2000 120 21
DS 5000 2000 -5000 2000 120 21
DS -5000 2000 -5000 -2000 120 21
DS -5000 -2000 5000 -2000 120 21
$PAD
Sh "1" R 800 800 0 0 0
Dr 360 0 0
At STD N 00E0FFFF
Ne 0 ""
Po -4500 1500
$EndPAD
$PAD
Sh "2" C 800 800 0 0 0
Dr 360 0 0
At STD N 00E0FFFF
Ne 0 ""
Po -3500 1500
$EndPAD
$PAD
Sh "3" C 800 800 0 0 0
Dr 360 0 0
At STD N 00E0FFFF
Ne 0 ""
Po -2500 1500
$EndPAD
$PAD
Sh "4" C 800 800 0 0 0
Dr 360 0 0
At STD N 00E0FFFF
Ne 0 ""
Po -1500 1500
$EndPAD
$PAD
Sh "13" C 800 800 0 0 0
Dr 360 0 0
At STD N 00E0FFFF
Ne 0 ""
Po 2500 -1500
$EndPAD
$PAD
Sh "14" C 800 800 0 0 0
Dr 360 0 0
At STD N 00E0FFFF
Ne 0 ""
Po 1500 -1500
$EndPAD
$PAD
Sh "15" C 800 800 0 0 0
Dr 360 0 0
At STD N 00E0FFFF
Ne 0 ""
Po 500 -1500
$EndPAD
$PAD
Sh "16" C 800 800 0 0 0
Dr 360 0 0
At STD N 00E0FFFF
Ne 0 ""
Po -500 -1500
$EndPAD
$PAD
Sh "5" C 800 800 0 0 0
Dr 360 0 0
At STD N 00E0FFFF
Ne 0 ""
Po -500 1500
$EndPAD
$PAD
Sh "6" C 800 800 0 0 0
Dr 360 0 0
At STD N 00E0FFFF
Ne 0 ""
Po 500 1500
$EndPAD
$PAD
Sh "7" C 800 800 0 0 0
Dr 360 0 0
At STD N 00E0FFFF
Ne 0 ""
Po 1500 1500
$EndPAD
$PAD
Sh "8" C 800 800 0 0 0
Dr 360 0 0
At STD N 00E0FFFF
Ne 0 ""
Po 2500 1500
$EndPAD
$PAD
Sh "12" C 800 800 0 0 0
Dr 360 0 0
At STD N 00E0FFFF
Ne 0 ""
Po 3500 -1500
$EndPAD
$PAD
Sh "11" C 800 800 0 0 0
Dr 360 0 0
At STD N 00E0FFFF
Ne 0 ""
Po 4500 -1500
$EndPAD
$PAD
Sh "10" C 800 800 0 0 0
Dr 360 0 0
At STD N 00E0FFFF
Ne 0 ""
Po 4500 1500
$EndPAD
$PAD
Sh "9" C 800 800 0 0 0
Dr 360 0 0
At STD N 00E0FFFF
Ne 0 ""
Po 3500 1500
$EndPAD
$PAD
Sh "17" C 800 800 0 0 0
Dr 360 0 0
At STD N 00E0FFFF
Ne 0 ""
Po -1500 -1500
$EndPAD
$PAD
Sh "18" C 800 800 0 0 0
Dr 360 0 0
At STD N 00E0FFFF
Ne 0 ""
Po -2500 -1500
$EndPAD
$PAD
Sh "19" C 800 800 0 0 0
Dr 360 0 0
At STD N 00E0FFFF
Ne 0 ""
Po -3500 -1500
$EndPAD
$PAD
Sh "20" C 800 800 0 0 0
Dr 360 0 0
At STD N 00E0FFFF
Ne 0 ""
Po -4500 -1500
$EndPAD
$EndMODULE HDSP-48xx
$MODULE HDSP-78xx
Po 0 0 0 15 4FE20362 00000000 ~~
Li HDSP-78xx
Cd Afficheur 7 segments
Kw AFFICHEUR
Sc 0
AR 
Op 0 0 0
T0 0 -3000 393 393 0 78 N V 21 N "HDSP-78xx"
T1 0 3000 392 392 0 77 N I 21 N "Value"
DS -1500 -2000 -1000 -2500 120 21
DC -950 -1450 -850 -1350 120 25
DC 900 1450 1000 1550 120 25
DS -950 1300 -700 200 120 25
DS 350 1300 600 200 120 25
DS 650 -150 900 -1300 120 25
DS -650 -150 -400 -1300 120 25
DS -850 1500 200 1500 120 25
DS -250 -1500 800 -1500 120 25
DS -550 0 500 0 120 25
DS -1500 -2300 -1300 -2500 120 21
DS -1500 -2150 -1150 -2500 120 21
DS 1500 -2500 -1500 -2500 120 21
DS -1500 -2500 -1500 2500 120 21
DS -1500 2500 1500 2500 120 21
DS 1500 2500 1500 -2500 120 21
$PAD
Sh "1" R 748 748 0 0 0
Dr 276 0 0
At STD N 00E0FFFF
Ne 0 ""
Po -1000 -2000
$EndPAD
$PAD
Sh "2" C 748 748 0 0 0
Dr 276 0 0
At STD N 00E0FFFF
Ne 0 ""
Po -1000 -1000
$EndPAD
$PAD
Sh "3" C 748 748 0 0 0
Dr 276 0 0
At STD N 00E0FFFF
Ne 0 ""
Po -1000 0
$EndPAD
$PAD
Sh "4" C 748 748 0 0 0
Dr 276 0 0
At STD N 00E0FFFF
Ne 0 ""
Po -1000 1000
$EndPAD
$PAD
Sh "5" C 748 748 0 0 0
Dr 276 0 0
At STD N 00E0FFFF
Ne 0 ""
Po -1000 2000
$EndPAD
$PAD
Sh "6" C 748 748 0 0 0
Dr 276 0 0
At STD N 00E0FFFF
Ne 0 ""
Po 1000 2000
$EndPAD
$PAD
Sh "7" C 748 748 0 0 0
Dr 276 0 0
At STD N 00E0FFFF
Ne 0 ""
Po 1000 1000
$EndPAD
$PAD
Sh "8" C 800 800 0 0 0
Dr 276 0 0
At STD N 00E0FFFF
Ne 0 ""
Po 1000 0
$EndPAD
$PAD
Sh "9" C 748 748 0 0 0
Dr 276 0 0
At STD N 00E0FFFF
Ne 0 ""
Po 1000 -1000
$EndPAD
$PAD
Sh "10" C 748 748 0 0 0
Dr 276 0 0
At STD N 00E0FFFF
Ne 0 ""
Po 1000 -2000
$EndPAD
$PAD
Sh "" C 550 550 0 0 0
Dr 320 0 0
At STD N 00E0FFFF
Ne 0 ""
Po -1000 -1000
$EndPAD
$EndMODULE HDSP-78xx
$MODULE LTS-69xx
Po 0 0 0 15 4FE203DE 00000000 ~~
Li LTS-69xx
Cd Afficheur 7 segments
Kw AFFICHEUR
Sc 0
AR 
Op 0 0 0
T0 0 -4250 393 393 0 78 N I 21 N "LTS-69xx"
T1 0 4250 393 393 0 78 N I 21 N "Value"
DS 1200 300 700 2200 200 25
DS -1500 2200 200 2200 200 25
DS -1500 200 -2000 2200 200 25
DS -800 -2200 -1400 -200 200 25
DS -300 -2200 1200 -2200 200 25
DS -900 0 700 0 200 25
DS 1700 -2100 1300 -100 200 25
DC 1750 2250 2000 2250 200 25
DS -1500 2250 250 2250 120 25
DS -2000 -3750 -2500 -3750 120 21
DS -2500 -3750 -2500 3750 120 21
DS -2500 3750 -2000 3750 120 21
DS 2000 3750 2500 3750 120 21
DS 2500 3750 2500 -3750 120 21
DS 2500 -3750 2000 -3750 120 21
DS -2000 3750 2000 3750 120 21
DS 2000 -3750 -2000 -3750 120 21
DS -950 0 750 0 120 25
DS 1350 -200 1700 -2150 120 25
DS -350 -2200 1200 -2200 120 25
DS -1400 -250 -850 -2200 120 25
DS -1500 200 -2000 2250 120 25
$PAD
Sh "1" R 800 800 0 0 0
Dr 360 0 0
At STD N 00E0FFFF
Ne 0 ""
Po -1500 3000
$EndPAD
$PAD
Sh "2" C 800 800 0 0 0
Dr 360 0 0
At STD N 00E0FFFF
Ne 0 ""
Po -500 3000
$EndPAD
$PAD
Sh "3" C 800 800 0 0 0
Dr 360 0 0
At STD N 00E0FFFF
Ne 0 ""
Po 500 3000
$EndPAD
$PAD
Sh "4" C 800 800 0 0 0
Dr 360 0 0
At STD N 00E0FFFF
Ne 0 ""
Po 1500 3000
$EndPAD
$PAD
Sh "5" C 800 800 0 0 0
Dr 360 0 0
At STD N 00E0FFFF
Ne 0 ""
Po 1500 -3000
$EndPAD
$PAD
Sh "6" C 800 800 0 0 0
Dr 360 0 0
At STD N 00E0FFFF
Ne 0 ""
Po 500 -3000
$EndPAD
$PAD
Sh "7" C 800 800 0 0 0
Dr 360 0 0
At STD N 00E0FFFF
Ne 0 ""
Po -500 -3000
$EndPAD
$PAD
Sh "8" C 800 800 0 0 0
Dr 360 0 0
At STD N 00E0FFFF
Ne 0 ""
Po -1500 -3000
$EndPAD
$EndMODULE LTS-69xx
$EndLIBRARY
