PCBNEW-LibModule-V1  mer 17 ago 2011 14:29:30 CEST
$INDEX
to220_11cw
to220_14cw
to92_3
to220
to220-2
to220-2_11cw
to220-2_14cw
to220-5
to3-2
to3-4
to18
to18-4
to225
top3
to247
ipak
sot82
to220-horiz
to220-2-horiz
to220-5-horiz
to220-15
Multiwatt11
$EndINDEX
$MODULE sot82
Po 0 0 0 15 4B90E28E 00000000 ~~
Li sot82
Cd SOT82
Sc 00000000
AR
Op 0 0 0
T0 0 950 512 512 0 106 N V 21 N"SOT82"
T1 0 -1050 512 512 0 106 N V 21 N"Q***"
DS -906 -591 -906 -472 120 21
DS -906 -472 906 -472 120 21
DS 906 -472 906 -591 120 21
DS 1535 -591 -1535 -591 120 21
DS -1535 -591 -1535 512 120 21
DS -1535 512 1535 512 120 21
DS 1535 512 1535 -591 120 21
$PAD
Sh "1" C 787 787 0 0 0
Dr 492 0 0
At STD N 00E0FFFF
Ne 0 ""
Po 1050 0
$EndPAD
$PAD
Sh "2" C 787 787 0 0 0
Dr 492 0 0
At STD N 00E0FFFF
Ne 0 ""
Po 0 0
$EndPAD
$PAD
Sh "3" C 787 787 0 0 0
Dr 492 0 0
At STD N 00E0FFFF
Ne 0 ""
Po -1050 0
$EndPAD
$SHAPE3D
Na "walter\to\sot82.wrl"
Sc 1.000000 1.000000 1.000000
Of 0.000000 0.000000 0.000000
Ro 0.000000 0.000000 0.000000
$EndSHAPE3D
$EndMODULE  sot82
$MODULE to220
Po 0 0 0 15 4B90E2C7 00000000 ~~
Li to220
Cd TO220
Sc 00000000
AR
Op 0 0 0
T0 0 1700 600 600 0 120 N V 21 N"TO220"
T1 0 -1700 600 600 0 120 N V 21 N"Q***"
DS -2000 -800 2000 -800 100 21
DS -2000 -500 -2000 1000 100 21
DS -2000 1000 2000 1000 100 21
DS 2000 1000 2000 -1000 100 21
DS 2000 -1000 -2000 -1000 100 21
DS -2000 -1000 -2000 -500 100 21
$PAD
Sh "1" C 984 984 0 0 0
Dr 492 0 0
At STD N 00E0FFFF
Ne 0 ""
Po 1500 0
$EndPAD
$PAD
Sh "2" C 984 984 0 0 0
Dr 492 0 0
At STD N 00E0FFFF
Ne 0 ""
Po 0 0
$EndPAD
$PAD
Sh "3" C 984 984 0 0 0
Dr 492 0 0
At STD N 00E0FFFF
Ne 0 ""
Po -1500 0
$EndPAD
$SHAPE3D
Na "walter\to\to220.wrl"
Sc 1.000000 1.000000 1.000000
Of 0.000000 0.000000 0.000000
Ro 0.000000 0.000000 0.000000
$EndSHAPE3D
$EndMODULE  to220
$MODULE to220-5
Po 0 0 0 15 4B90E341 00000000 ~~
Li to220-5
Cd TO220, 5pins
Sc 00000000
AR
Op 0 0 0
T0 0 1700 600 600 0 120 N V 21 N"TO220-5"
T1 0 -1700 600 600 0 120 N V 21 N"Q***"
DS -2000 -800 2000 -800 100 21
DS -2000 -500 -2000 1000 100 21
DS -2000 1000 2000 1000 100 21
DS 2000 1000 2000 -1000 100 21
DS 2000 -1000 -2000 -1000 100 21
DS -2000 -1000 -2000 -500 100 21
$PAD
Sh "1" O 512 984 0 0 0
Dr 394 0 0
At STD N 00E0FFFF
Ne 0 ""
Po 1340 0
$EndPAD
$PAD
Sh "2" O 512 984 0 0 0
Dr 394 0 0
At STD N 00E0FFFF
Ne 0 ""
Po 670 0
$EndPAD
$PAD
Sh "3" O 512 984 0 0 0
Dr 394 0 0
At STD N 00E0FFFF
Ne 0 ""
Po 0 0
$EndPAD
$PAD
Sh "4" O 512 984 0 0 0
Dr 394 0 0
At STD N 00E0FFFF
Ne 0 ""
Po -670 0
$EndPAD
$PAD
Sh "5" O 512 984 0 0 0
Dr 394 0 0
At STD N 00E0FFFF
Ne 0 ""
Po -1340 0
$EndPAD
$SHAPE3D
Na "walter\to\to220-5.wrl"
Sc 1.000000 1.000000 1.000000
Of 0.000000 0.000000 0.000000
Ro 0.000000 0.000000 0.000000
$EndSHAPE3D
$EndMODULE  to220-5
$MODULE to220-2
Po 0 0 0 15 4B90E37F 00000000 ~~
Li to220-2
Cd TO220, 2 pins
Sc 00000000
AR
Op 0 0 0
T0 0 1700 600 600 0 120 N V 21 N"TO220-2"
T1 0 -1700 600 600 0 120 N V 21 N"Q***"
DS -2000 -800 2000 -800 100 21
DS -2000 -500 -2000 1000 100 21
DS -2000 1000 2000 1000 100 21
DS 2000 1000 2000 -1000 100 21
DS 2000 -1000 -2000 -1000 100 21
DS -2000 -1000 -2000 -500 100 21
$PAD
Sh "1" C 984 984 0 0 0
Dr 492 0 0
At STD N 00E0FFFF
Ne 0 ""
Po 1000 0
$EndPAD
$PAD
Sh "2" C 984 984 0 0 0
Dr 492 0 0
At STD N 00E0FFFF
Ne 0 ""
Po -1000 0
$EndPAD
$SHAPE3D
Na "walter\to\to220-2.wrl"
Sc 1.000000 1.000000 1.000000
Of 0.000000 0.000000 0.000000
Ro 0.000000 0.000000 0.000000
$EndSHAPE3D
$EndMODULE  to220-2
$MODULE to225
Po 0 0 0 15 4B90E390 00000000 ~~
Li to225
Cd TO225
Sc 00000000
AR
Op 0 0 0
T0 0 900 600 600 0 120 N V 21 N"TO225"
T1 0 -1100 600 600 0 120 N V 21 N"Q***"
DS 1500 300 -1500 300 150 21
DS -1500 300 -1500 -600 150 21
DS -1500 -600 1500 -600 150 21
DS 1500 -600 1500 300 150 21
$PAD
Sh "1" C 984 984 0 0 0
Dr 492 0 0
At STD N 00E0FFFF
Ne 0 ""
Po 1440 0
$EndPAD
$PAD
Sh "2" C 984 984 0 0 0
Dr 492 0 0
At STD N 00E0FFFF
Ne 0 ""
Po 0 0
$EndPAD
$PAD
Sh "3" C 984 984 0 0 0
Dr 492 0 0
At STD N 00E0FFFF
Ne 0 ""
Po -1440 0
$EndPAD
$SHAPE3D
Na "walter\to\to225.wrl"
Sc 1.000000 1.000000 1.000000
Of 0.000000 0.000000 0.000000
Ro 0.000000 0.000000 0.000000
$EndSHAPE3D
$EndMODULE  to225
$MODULE to247
Po 0 0 0 15 4B90E3A1 00000000 ~~
Li to247
Cd TO247
Sc 00000000
AR
Op 0 0 0
T0 0 1450 600 600 0 120 N V 21 N"TO247"
T1 0 -1600 600 600 0 120 N V 21 N"Q***"
DS 3100 -350 -3100 -350 120 21
DS 3100 850 3100 -1150 120 21
DS 3100 -1150 -3100 -1150 120 21
DS -3100 -1150 -3100 850 120 21
DS -3100 850 3100 850 120 21
$PAD
Sh "1" C 1378 1378 0 0 0
Dr 591 0 0
At STD N 00E0FFFF
Ne 0 ""
Po 2150 0
$EndPAD
$PAD
Sh "2" C 1378 1378 0 0 0
Dr 591 0 0
At STD N 00E0FFFF
Ne 0 ""
Po 0 0
$EndPAD
$PAD
Sh "3" C 1378 1378 0 0 0
Dr 591 0 0
At STD N 00E0FFFF
Ne 0 ""
Po -2150 0
$EndPAD
$SHAPE3D
Na "walter\to\to247.wrl"
Sc 1.000000 1.000000 1.000000
Of 0.000000 0.000000 0.000000
Ro 0.000000 0.000000 0.000000
$EndSHAPE3D
$EndMODULE  to247
$MODULE top3
Po 0 0 0 15 4B90E3AC 00000000 ~~
Li top3
Cd TOP3
Sc 00000000
AR
Op 0 0 0
T0 0 1200 600 600 0 120 N V 21 N"TOP3"
T1 0 -1700 600 600 0 120 N V 21 N"Q***"
DS -3000 -900 3000 -900 120 21
DS -3000 600 3000 600 120 21
DS 3000 600 3000 -1200 120 21
DS 3000 -1200 -3000 -1200 120 21
DS -3000 -1200 -3000 600 120 21
$PAD
Sh "1" C 1378 1378 0 0 0
Dr 591 0 0
At STD N 00E0FFFF
Ne 0 ""
Po 2175 0
$EndPAD
$PAD
Sh "2" C 1378 1378 0 0 0
Dr 591 0 0
At STD N 00E0FFFF
Ne 0 ""
Po 0 0
$EndPAD
$PAD
Sh "3" C 1378 1378 0 0 0
Dr 591 0 0
At STD N 00E0FFFF
Ne 0 ""
Po -2175 0
$EndPAD
$SHAPE3D
Na "walter\to\top3.wrl"
Sc 1.000000 1.000000 1.000000
Of 0.000000 0.000000 0.000000
Ro 0.000000 0.000000 0.000000
$EndSHAPE3D
$EndMODULE  top3
$MODULE to220-15
Po 0 0 0 15 4DEBCF32 00000000 ~~
Li to220-15
Cd TO220, 15pins
Sc 00000000
AR
Op 0 0 0
T0 0 -3071 600 600 0 120 N V 21 N "U***"
T1 0 -2165 600 600 0 120 N V 21 N "TO220-15"
DS -2992 0 -2992 -787 120 21
DS -2008 0 -2008 -787 120 21
DS -1024 0 -1024 -787 120 21
DS 0 0 0 -787 120 21
DS 1024 0 1024 -748 120 21
DS 1024 -748 1024 -787 120 21
DS 2008 0 2008 -787 120 21
DS 3031 0 3031 -787 120 21
DS 3504 2008 3504 -787 120 21
DS 2520 2008 2520 -787 120 21
DS 1496 2008 1496 -787 120 21
DS 512 2008 512 -787 120 21
DS -512 2008 -512 -787 120 21
DS -512 -787 -512 -748 120 21
DS -1496 2008 -1496 -787 120 21
DS -2480 2008 -2480 -787 120 21
DS -3504 2008 -3504 -787 120 21
DS 748 -1693 748 -1102 120 21
DS -748 -1102 -748 -1693 120 21
DS 3976 -1102 -3976 -1102 120 21
DS 3976 -1693 -3976 -1693 120 21
DS -3976 -1693 -3976 118 120 21
DS -3976 118 3976 118 120 21
DS 3976 118 3976 -1693 120 21
$PAD
Sh "15" O 512 984 0 0 0
Dr 394 0 0
At STD N 00E0FFFF
Ne 0 ""
Po 3500 2000
$EndPAD
$PAD
Sh "1" O 512 984 0 0 0
Dr 394 0 0
At STD N 00E0FFFF
Ne 0 ""
Po -3500 2000
$EndPAD
$PAD
Sh "2" O 512 984 0 0 0
Dr 394 0 0
At STD N 00E0FFFF
Ne 0 ""
Po -3000 0
$EndPAD
$PAD
Sh "3" O 512 984 0 0 0
Dr 394 0 0
At STD N 00E0FFFF
Ne 0 ""
Po -2500 2000
$EndPAD
$PAD
Sh "4" O 512 984 0 0 0
Dr 394 0 0
At STD N 00E0FFFF
Ne 0 ""
Po -2000 0
$EndPAD
$PAD
Sh "5" O 512 984 0 0 0
Dr 394 0 0
At STD N 00E0FFFF
Ne 0 ""
Po -1500 2000
$EndPAD
$PAD
Sh "6" O 512 984 0 0 0
Dr 394 0 0
At STD N 00E0FFFF
Ne 0 ""
Po -1000 0
$EndPAD
$PAD
Sh "7" O 512 984 0 0 0
Dr 394 0 0
At STD N 00E0FFFF
Ne 0 ""
Po -500 2000
$EndPAD
$PAD
Sh "8" O 512 984 0 0 0
Dr 394 0 0
At STD N 00E0FFFF
Ne 0 ""
Po 0 0
$EndPAD
$PAD
Sh "9" O 512 984 0 0 0
Dr 394 0 0
At STD N 00E0FFFF
Ne 0 ""
Po 500 2000
$EndPAD
$PAD
Sh "10" O 512 984 0 0 0
Dr 394 0 0
At STD N 00E0FFFF
Ne 0 ""
Po 1000 0
$EndPAD
$PAD
Sh "11" O 512 984 0 0 0
Dr 394 0 0
At STD N 00E0FFFF
Ne 0 ""
Po 1500 2000
$EndPAD
$PAD
Sh "12" O 512 984 0 0 0
Dr 394 0 0
At STD N 00E0FFFF
Ne 0 ""
Po 2000 0
$EndPAD
$PAD
Sh "13" O 512 984 0 0 0
Dr 394 0 0
At STD N 00E0FFFF
Ne 0 ""
Po 2500 2000
$EndPAD
$PAD
Sh "14" O 512 984 0 0 0
Dr 394 0 0
At STD N 00E0FFFF
Ne 0 ""
Po 3000 0
$EndPAD
$SHAPE3D
Na "walter\to\to220-15.wrl"
Sc 1.000000 1.000000 1.000000
Of 0.000000 0.000000 0.000000
Ro 0.000000 0.000000 0.000000
$EndSHAPE3D
$EndMODULE  to220-15
$MODULE Multiwatt11
Po 0 0 0 15 4E4BB0F0 00000000 ~~
Li Multiwatt11
Cd MultiWatt 11 pins
Sc 00000000
AR
Op 0 0 0
T0 0 -3071 600 600 0 120 N V 21 N"U***"
T1 0 -2165 600 600 0 120 N V 21 N"Multiwatt11"
DS 3976 -1811 3976 157 120 21
DS -3976 -1811 -3976 157 120 21
DS -2677 0 -2677 -787 120 21
DS -1339 0 -1339 -787 120 21
DS 0 0 0 -787 120 21
DS 1339 0 1339 -787 120 21
DS 2677 0 2677 -748 120 21
DS 3346 2008 3346 -787 120 21
DS 2008 2008 2008 -787 120 21
DS 669 2008 669 -787 120 21
DS -669 2008 -669 -787 120 21
DS -2008 2008 -2008 -787 120 21
DS -3346 2008 -3346 -787 120 21
DS 748 -1772 748 -1181 120 21
DS -748 -1180 -748 -1771 120 21
DS 3976 -1181 -3976 -1181 120 21
DS 3976 -1811 -3976 -1811 120 21
DS -3976 158 3976 158 120 21
$PAD
Sh "1" O 709 1063 0 0 0
Dr 492 0 0
At STD N 00E0FFFF
Ne 0 ""
Po -3346 2000
$EndPAD
$PAD
Sh "2" O 709 1063 0 0 0
Dr 492 0 0
At STD N 00E0FFFF
Ne 0 ""
Po -2677 0
$EndPAD
$PAD
Sh "3" O 709 1063 0 0 0
Dr 492 0 0
At STD N 00E0FFFF
Ne 0 ""
Po -2008 2000
$EndPAD
$PAD
Sh "4" O 709 1063 0 0 0
Dr 492 0 0
At STD N 00E0FFFF
Ne 0 ""
Po -1339 0
$EndPAD
$PAD
Sh "5" O 709 1063 0 0 0
Dr 492 0 0
At STD N 00E0FFFF
Ne 0 ""
Po -669 2000
$EndPAD
$PAD
Sh "6" O 709 1063 0 0 0
Dr 492 0 0
At STD N 00E0FFFF
Ne 0 ""
Po 0 0
$EndPAD
$PAD
Sh "7" O 709 1063 0 0 0
Dr 492 0 0
At STD N 00E0FFFF
Ne 0 ""
Po 669 2000
$EndPAD
$PAD
Sh "8" O 709 1063 0 0 0
Dr 492 0 0
At STD N 00E0FFFF
Ne 0 ""
Po 1339 0
$EndPAD
$PAD
Sh "9" O 709 1063 0 0 0
Dr 492 0 0
At STD N 00E0FFFF
Ne 0 ""
Po 2008 2000
$EndPAD
$PAD
Sh "10" O 709 1063 0 0 0
Dr 492 0 0
At STD N 00E0FFFF
Ne 0 ""
Po 2677 0
$EndPAD
$PAD
Sh "11" O 709 1063 0 0 0
Dr 492 0 0
At STD N 00E0FFFF
Ne 0 ""
Po 3346 2000
$EndPAD
$SHAPE3D
Na "walter\to\multiwatt11.wrl"
Sc 1.000000 1.000000 1.000000
Of 0.000000 0.000000 0.000000
Ro 0.000000 0.000000 0.000000
$EndSHAPE3D
$EndMODULE  Multiwatt11
$MODULE to220-2_14cw
Po 0 0 0 15 4E4BB1DB 00000000 ~~
Li to220-2_14cw
Cd TO220, 2 pins, with 14°C/W heat sink
Sc 00000000
AR to220-2_14cw
Op 0 0 0
T0 0 2000 600 600 0 120 N V 21 N"TO220-2_14°C/W"
T1 0 -4500 600 600 0 120 N V 21 N"Q***"
DS 6900 -3900 3100 -3900 120 21
DS -3100 -3900 -6900 -3900 120 21
DS 3100 -1600 -3100 -1600 120 21
DS -3100 -3900 -3100 -1600 120 21
DS 3100 -3900 3100 -1600 120 21
DS -3100 -1100 -3100 1200 120 21
DS 3100 1200 3100 -1100 120 21
DS -3100 -1100 3100 -1100 120 21
DS 3100 1200 6900 1200 120 21
DS -6900 1200 -3100 1200 120 21
DS 6900 -3900 6900 1200 120 21
DS -6900 -3900 -6900 1200 120 21
DS -2000 -500 -2000 1000 120 21
DS -2000 1000 2000 1000 120 21
DS 2000 1000 2000 -1000 120 21
DS 2000 -1000 -2000 -1000 120 21
DS -2000 -1000 -2000 -500 120 21
$PAD
Sh "1" C 984 984 0 0 0
Dr 472 0 0
At STD N 00E0FFFF
Ne 0 ""
Po 1000 0
$EndPAD
$PAD
Sh "2" C 984 984 0 0 0
Dr 472 0 0
At STD N 00E0FFFF
Ne 0 ""
Po -1000 0
$EndPAD
$PAD
Sh "3" C 1575 1575 0 0 0
Dr 1083 0 0
At STD N 00E0FFFF
Ne 0 ""
Po 5000 -1375
$EndPAD
$PAD
Sh "4" C 1575 1575 0 0 0
Dr 1083 0 0
At STD N 00E0FFFF
Ne 0 ""
Po -5000 -1375
$EndPAD
$SHAPE3D
Na "walter\to\to220-2_14cw.wrl"
Sc 1.000000 1.000000 1.000000
Of 0.000000 0.000000 0.000000
Ro 0.000000 0.000000 0.000000
$EndSHAPE3D
$EndMODULE  to220-2_14cw
$MODULE to220-2_11cw
Po 0 0 0 15 4E4BB209 00000000 ~~
Li to220-2_11cw
Cd TO220, 2 pins, with 11°C/W heat sink
Sc 00000000
AR to220-2_11cw
Op 0 0 0
T0 0 2000 600 600 0 120 N V 21 N"TO220-2_11°C/W"
T1 0 -4500 600 600 0 120 N V 21 N"Q***"
DS 6900 -3900 3100 -3900 120 21
DS -3100 -3900 -6900 -3900 120 21
DS 3100 -1600 -3100 -1600 120 21
DS -3100 -3900 -3100 -1600 120 21
DS 3100 -3900 3100 -1600 120 21
DS -3100 -1100 -3100 1200 120 21
DS 3100 1200 3100 -1100 120 21
DS -3100 -1100 3100 -1100 120 21
DS 3100 1200 6900 1200 120 21
DS -6900 1200 -3100 1200 120 21
DS 6900 -3900 6900 1200 120 21
DS -6900 -3900 -6900 1200 120 21
DS -2000 -500 -2000 1000 120 21
DS -2000 1000 2000 1000 120 21
DS 2000 1000 2000 -1000 120 21
DS 2000 -1000 -2000 -1000 120 21
DS -2000 -1000 -2000 -500 120 21
$PAD
Sh "1" C 984 984 0 0 0
Dr 472 0 0
At STD N 00E0FFFF
Ne 0 ""
Po 1000 0
$EndPAD
$PAD
Sh "2" C 984 984 0 0 0
Dr 472 0 0
At STD N 00E0FFFF
Ne 0 ""
Po -1000 0
$EndPAD
$PAD
Sh "3" C 1575 1575 0 0 0
Dr 1083 0 0
At STD N 00E0FFFF
Ne 0 ""
Po 5000 -1375
$EndPAD
$PAD
Sh "4" C 1575 1575 0 0 0
Dr 1083 0 0
At STD N 00E0FFFF
Ne 0 ""
Po -5000 -1375
$EndPAD
$SHAPE3D
Na "walter\to\to220-2_11cw.wrl"
Sc 1.000000 1.000000 1.000000
Of 0.000000 0.000000 0.000000
Ro 0.000000 0.000000 0.000000
$EndSHAPE3D
$EndMODULE  to220-2_11cw
$MODULE to220_14cw
Po 0 0 0 15 4E4BB236 00000000 ~~
Li to220_14cw
Cd TO220 with 14°C/W heat sink
Sc 00000000
AR to220_14cw
Op 0 0 0
T0 0 2000 600 600 0 120 N V 21 N"TO220_14°C/W"
T1 0 -4500 600 600 0 120 N V 21 N"Q***"
DS 6900 -3900 3100 -3900 120 21
DS -3100 -3900 -6900 -3900 120 21
DS 3100 -1600 -3100 -1600 120 21
DS -3100 -3900 -3100 -1600 120 21
DS 3100 -3900 3100 -1600 120 21
DS -3100 -1100 -3100 1200 120 21
DS 3100 1200 3100 -1100 120 21
DS -3100 -1100 3100 -1100 120 21
DS 3100 1200 6900 1200 120 21
DS -6900 1200 -3100 1200 120 21
DS 6900 -3900 6900 1200 120 21
DS -6900 -3900 -6900 1200 120 21
DS -2000 -500 -2000 1000 120 21
DS -2000 1000 2000 1000 120 21
DS 2000 1000 2000 -1000 120 21
DS 2000 -1000 -2000 -1000 120 21
DS -2000 -1000 -2000 -500 120 21
$PAD
Sh "1" C 984 984 0 0 0
Dr 472 0 0
At STD N 00E0FFFF
Ne 0 ""
Po 1500 0
$EndPAD
$PAD
Sh "2" C 984 984 0 0 0
Dr 472 0 0
At STD N 00E0FFFF
Ne 0 ""
Po 0 0
$EndPAD
$PAD
Sh "3" C 984 984 0 0 0
Dr 472 0 0
At STD N 00E0FFFF
Ne 0 ""
Po -1500 0
$EndPAD
$PAD
Sh "4" C 1575 1575 0 0 0
Dr 1083 0 0
At STD N 00E0FFFF
Ne 0 ""
Po 5000 -1375
$EndPAD
$PAD
Sh "5" C 1575 1575 0 0 0
Dr 1083 0 0
At STD N 00E0FFFF
Ne 0 ""
Po -5000 -1375
$EndPAD
$SHAPE3D
Na "walter\to\to220_14cw.wrl"
Sc 1.000000 1.000000 1.000000
Of 0.000000 0.000000 0.000000
Ro 0.000000 0.000000 0.000000
$EndSHAPE3D
$EndMODULE  to220_14cw
$MODULE to220_11cw
Po 0 0 0 15 4E4BB262 00000000 ~~
Li to220_11cw
Cd TO220 with 11°C/W heat sink
Sc 00000000
AR to220_11cw
Op 0 0 0
T0 0 2000 600 600 0 120 N V 21 N"TO220_11°C/W"
T1 0 -4500 600 600 0 120 N V 21 N"Q***"
DS 6900 -3900 3100 -3900 120 21
DS -3100 -3900 -6900 -3900 120 21
DS 3100 -1600 -3100 -1600 120 21
DS -3100 -3900 -3100 -1600 120 21
DS 3100 -3900 3100 -1600 120 21
DS -3100 -1100 -3100 1200 120 21
DS 3100 1200 3100 -1100 120 21
DS -3100 -1100 3100 -1100 120 21
DS 3100 1200 6900 1200 120 21
DS -6900 1200 -3100 1200 120 21
DS 6900 -3900 6900 1200 120 21
DS -6900 -3900 -6900 1200 120 21
DS -2000 -500 -2000 1000 120 21
DS -2000 1000 2000 1000 120 21
DS 2000 1000 2000 -1000 120 21
DS 2000 -1000 -2000 -1000 120 21
DS -2000 -1000 -2000 -500 120 21
$PAD
Sh "1" C 984 984 0 0 0
Dr 472 0 0
At STD N 00E0FFFF
Ne 0 ""
Po 1500 0
$EndPAD
$PAD
Sh "2" C 984 984 0 0 0
Dr 472 0 0
At STD N 00E0FFFF
Ne 0 ""
Po 0 0
$EndPAD
$PAD
Sh "3" C 984 984 0 0 0
Dr 472 0 0
At STD N 00E0FFFF
Ne 0 ""
Po -1500 0
$EndPAD
$PAD
Sh "4" C 1575 1575 0 0 0
Dr 1083 0 0
At STD N 00E0FFFF
Ne 0 ""
Po 5000 -1375
$EndPAD
$PAD
Sh "5" C 1575 1575 0 0 0
Dr 1083 0 0
At STD N 00E0FFFF
Ne 0 ""
Po -5000 -1375
$EndPAD
$SHAPE3D
Na "walter\to\to220_11cw.wrl"
Sc 1.000000 1.000000 1.000000
Of 0.000000 0.000000 0.000000
Ro 0.000000 0.000000 0.000000
$EndSHAPE3D
$EndMODULE  to220_11cw
$MODULE to220-horiz
Po 0 0 0 15 4E4BB287 00000000 ~~
Li to220-horiz
Cd TO220, horizontal
Sc 00000000
AR to220-horiz
Op 0 0 0
T0 0 -6400 600 600 0 120 N V 21 N"TO220-horiz"
T1 0 -5450 600 600 0 120 N V 21 N"Q***"
DS 0 1650 0 4300 120 21
DS 1000 3300 1000 1650 120 21
DS -1000 3300 -1000 1650 120 21
DS -2000 1650 2000 1650 120 21
DS 2000 -4400 -2000 -4400 120 21
DS 2000 1650 2000 -4400 120 21
DS -2000 -4400 -2000 1650 120 21
DS 2000 -1850 -2000 -1850 100 21
$PAD
Sh "1" C 984 984 0 0 0
Dr 472 0 0
At STD N 00E0FFFF
Ne 0 ""
Po 1000 3280
$EndPAD
$PAD
Sh "3" C 984 984 0 0 0
Dr 472 0 0
At STD N 00E0FFFF
Ne 0 ""
Po -1000 3280
$EndPAD
$PAD
Sh "4" R 5000 7000 0 0 0
Dr 1575 0 1620
At STD N 00A08000
Ne 0 ""
Po 0 -3120
$EndPAD
$PAD
Sh "2" C 984 984 0 0 0
Dr 472 0 0
At STD N 00E0FFFF
Ne 0 ""
Po 0 4280
$EndPAD
$SHAPE3D
Na "walter\to\to220_horiz.wrl"
Sc 1.000000 1.000000 1.000000
Of 0.000000 0.000000 0.000000
Ro 0.000000 0.000000 0.000000
$EndSHAPE3D
$EndMODULE  to220-horiz
$MODULE to220-5-horiz
Po 0 0 0 15 4E4BB2BA 00000000 ~~
Li to220-5-horiz
Cd TO220, 5 pins, horizontal
Sc 00000000
AR to220-5-horiz
Op 0 0 0
T0 0 -6300 600 600 0 120 N V 21 N"TO220-5-horiz"
T1 0 -5350 600 600 0 120 N V 21 N"Q***"
DS 650 4150 650 1750 120 21
DS -650 4150 -650 1750 120 21
DS 1350 3150 1350 1750 120 21
DS 0 3150 0 1750 120 21
DS -1350 3150 -1350 1750 120 21
DS -2000 1750 2000 1750 120 21
DS 2000 -4300 -2000 -4300 120 21
DS 2000 1750 2000 -4300 120 21
DS -2000 -4300 -2000 1750 120 21
DS 2000 -1750 -2000 -1750 100 21
$PAD
Sh "1" C 886 886 0 0 0
Dr 472 0 0
At STD N 00E0FFFF
Ne 0 ""
Po 1340 3150
$EndPAD
$PAD
Sh "5" C 886 886 0 0 0
Dr 472 0 0
At STD N 00E0FFFF
Ne 0 ""
Po -1340 3150
$EndPAD
$PAD
Sh "6" R 5000 7000 0 0 0
Dr 1575 0 1620
At STD N 00A08000
Ne 0 ""
Po 0 -3013
$EndPAD
$PAD
Sh "2" C 886 886 0 0 0
Dr 472 0 0
At STD N 00E0FFFF
Ne 0 ""
Po 670 4150
$EndPAD
$PAD
Sh "3" C 886 886 0 0 0
Dr 472 0 0
At STD N 00E0FFFF
Ne 0 ""
Po 0 3150
$EndPAD
$PAD
Sh "4" C 886 886 0 0 0
Dr 472 0 0
At STD N 00E0FFFF
Ne 0 ""
Po -670 4150
$EndPAD
$SHAPE3D
Na "walter\to\to220-5_horiz.wrl"
Sc 1.000000 1.000000 1.000000
Of 0.000000 0.000000 0.000000
Ro 0.000000 0.000000 0.000000
$EndSHAPE3D
$EndMODULE  to220-5-horiz
$MODULE to220-2-horiz
Po 0 0 0 15 4E4BB2E9 00000000 ~~
Li to220-2-horiz
Cd TO220, 2 pins, horizontal
Sc 00000000
AR to220-2-horiz
Op 0 0 0
T0 0 -5900 600 600 0 120 N V 21 N"TO220-2-horiz"
T1 0 -4950 600 600 0 120 N V 21 N"Q***"
DS 1000 3800 1000 2150 120 21
DS -1000 3800 -1000 2150 120 21
DS -2000 2150 2000 2150 120 21
DS 2000 -3900 -2000 -3900 120 21
DS 2000 2150 2000 -3900 120 21
DS -2000 -3900 -2000 2150 120 21
DS 2000 -1350 -2000 -1350 100 21
$PAD
Sh "1" C 984 984 0 0 0
Dr 472 0 0
At STD N 00E0FFFF
Ne 0 ""
Po 1000 3780
$EndPAD
$PAD
Sh "2" C 984 984 0 0 0
Dr 472 0 0
At STD N 00E0FFFF
Ne 0 ""
Po -1000 3780
$EndPAD
$PAD
Sh "3" R 5000 7000 0 0 0
Dr 1575 0 1620
At STD N 00A08000
Ne 0 ""
Po 0 -2620
$EndPAD
$SHAPE3D
Na "walter\to\to220-2_horiz.wrl"
Sc 1.000000 1.000000 1.000000
Of 0.000000 0.000000 0.000000
Ro 0.000000 0.000000 0.000000
$EndSHAPE3D
$EndMODULE  to220-2-horiz
$MODULE to92_3
Po 0 0 0 15 4E4BB32A 00000000 ~~
Li to92_3
Cd TO92
Sc 00000000
AR to92_3
Op 0 0 0
T0 0 1250 600 600 0 120 N V 21 N"TO92_3"
T1 0 -1750 600 600 0 120 N V 21 N"Q***"
DS 1000 0 -1000 0 150 21
DS 1000 0 750 500 150 21
DS 750 500 -750 500 150 21
DS -750 500 -1000 0 150 21
DA 0 0 0 -1000 900 150 21
DA 0 0 -1000 0 900 150 21
$PAD
Sh "1" C 689 689 0 0 0
Dr 315 0 0
At STD N 00E0FFFF
Ne 0 ""
Po 750 250
$EndPAD
$PAD
Sh "2" C 689 689 0 0 0
Dr 315 0 0
At STD N 00E0FFFF
Ne 0 ""
Po 0 -750
$EndPAD
$PAD
Sh "3" C 689 689 0 0 0
Dr 315 0 0
At STD N 00E0FFFF
Ne 0 ""
Po -750 250
$EndPAD
$SHAPE3D
Na "walter\to\to92_3.wrl"
Sc 1.000000 1.000000 1.000000
Of 0.000000 0.000000 0.000000
Ro 0.000000 0.000000 0.000000
$EndSHAPE3D
$EndMODULE  to92_3
$MODULE to18-4
Po 0 0 0 15 4E4BB342 00000000 ~~
Li to18-4
Cd TO18, 4 pins
Sc 00000000
AR to18-4
Op 0 0 0
T0 0 1250 600 600 0 120 N V 21 N"TO18-4"
T1 0 -1750 600 600 0 120 N V 21 N"Q***"
DS -850 550 -1100 800 127 21
DS -1100 800 -800 1100 127 21
DS -800 1100 -550 850 127 21
DC 0 0 -1000 0 127 21
$PAD
Sh "1" C 689 689 0 0 0
Dr 315 0 0
At STD N 00E0FFFF
Ne 0 ""
Po 600 0
$EndPAD
$PAD
Sh "2" C 689 689 0 0 0
Dr 315 0 0
At STD N 00E0FFFF
Ne 0 ""
Po 0 -600
$EndPAD
$PAD
Sh "3" C 689 689 0 0 0
Dr 315 0 0
At STD N 00E0FFFF
Ne 0 ""
Po -600 0
$EndPAD
$PAD
Sh "4" C 689 689 0 0 0
Dr 315 0 0
At STD N 00E0FFFF
Ne 0 ""
Po 0 600
$EndPAD
$SHAPE3D
Na "walter\to\to18-4.wrl"
Sc 1.000000 1.000000 1.000000
Of 0.000000 0.000000 0.000000
Ro 0.000000 0.000000 0.000000
$EndSHAPE3D
$EndMODULE  to18-4
$MODULE to18
Po 0 0 0 15 4E4BB365 00000000 ~~
Li to18
Cd TO18 package
Sc 00000000
AR to18
Op 0 0 0
T0 0 1250 600 600 0 120 N V 21 N"TO18"
T1 0 -1750 600 600 0 120 N V 21 N"Q***"
DS -850 550 -1100 800 127 21
DS -1100 800 -800 1100 127 21
DS -800 1100 -550 850 127 21
DC 0 0 -1000 0 127 21
$PAD
Sh "1" C 689 689 0 0 0
Dr 315 0 0
At STD N 00E0FFFF
Ne 0 ""
Po 600 0
$EndPAD
$PAD
Sh "2" C 689 689 0 0 0
Dr 315 0 0
At STD N 00E0FFFF
Ne 0 ""
Po 0 -600
$EndPAD
$PAD
Sh "3" C 689 689 0 0 0
Dr 315 0 0
At STD N 00E0FFFF
Ne 0 ""
Po -600 0
$EndPAD
$SHAPE3D
Na "walter\to\to18.wrl"
Sc 1.000000 1.000000 1.000000
Of 0.000000 0.000000 0.000000
Ro 0.000000 0.000000 0.000000
$EndSHAPE3D
$EndMODULE  to18
$MODULE ipak
Po 0 0 0 15 4E4BB391 00000000 ~~
Li ipak
Cd IPAK
Sc 00000000
AR ipak
Op 0 0 0
T0 0 950 512 512 0 106 N V 21 N"IPAK"
T1 0 -1050 512 512 0 106 N V 21 N"Q***"
DS -1100 -600 -1100 -450 120 21
DS -1100 -450 1100 -450 120 21
DS 1100 -450 1100 -600 120 21
DS 1300 -600 1300 350 120 21
DS 1300 350 -1300 350 120 21
DS -1300 350 -1300 -600 120 21
DS -1300 -600 1300 -600 120 21
$PAD
Sh "1" C 787 787 0 0 0
Dr 472 0 0
At STD N 00E0FFFF
Ne 0 ""
Po 1050 0
$EndPAD
$PAD
Sh "2" C 787 787 0 0 0
Dr 472 0 0
At STD N 00E0FFFF
Ne 0 ""
Po 0 0
$EndPAD
$PAD
Sh "3" C 787 787 0 0 0
Dr 472 0 0
At STD N 00E0FFFF
Ne 0 ""
Po -1050 0
$EndPAD
$SHAPE3D
Na "walter\to\ipak.wrl"
Sc 1.000000 1.000000 1.000000
Of 0.000000 0.000000 0.000000
Ro 0.000000 0.000000 0.000000
$EndSHAPE3D
$EndMODULE  ipak
$MODULE to3-2
Po 0 0 0 15 4E4BB40F 00000000 ~~
Li to3-2
Cd TO3, 2 pins
Sc 00000000
AR to3-2
Op 0 0 0
T0 0 1250 600 600 0 120 N V 21 N"TO3-2"
T1 0 -1750 600 600 0 120 N V 21 N"Q***"
DC 0 0 -4500 0 127 21
DC 0 0 -3850 0 127 21
DS -7110 1300 -2770 4170 127 21
DS 7240 1170 2770 4170 127 21
DS 7100 -1310 2770 -4170 127 21
DS -7230 -1180 -2770 -4170 127 21
DA 5935 0 7108 -1304 900 127 21
DA -5935 0 -7108 1304 900 127 21
DC 0 0 -5000 200 127 21
$PAD
Sh "1" C 1181 1181 0 0 0
Dr 492 0 0
At STD N 00E0FFFF
Ne 0 ""
Po -715 -2150
$EndPAD
$PAD
Sh "2" C 1181 1181 0 0 0
Dr 492 0 0
At STD N 00E0FFFF
Ne 0 ""
Po -715 2150
$EndPAD
$PAD
Sh "3" C 2350 2350 0 0 0
Dr 1063 0 0
At STD N 00E0FFFF
Ne 0 ""
Po -5935 0
$EndPAD
$PAD
Sh "3" C 2350 2350 0 0 0
Dr 1063 0 0
At STD N 00E0FFFF
Ne 0 ""
Po 5935 0
$EndPAD
$SHAPE3D
Na "walter\to\to3-2.wrl"
Sc 1.000000 1.000000 1.000000
Of 0.000000 0.000000 0.000000
Ro 0.000000 0.000000 0.000000
$EndSHAPE3D
$EndMODULE  to3-2
$MODULE to3-4
Po 0 0 0 15 4E4BB424 00000000 ~~
Li to3-4
Cd TO3, 4 pins
Sc 00000000
AR to3-4
Op 0 0 0
T0 0 1250 600 600 0 120 N V 21 N"TO3-4"
T1 0 -1750 600 600 0 120 N V 21 N"Q***"
DC 0 0 -4500 0 127 21
DC 0 0 -3850 0 127 21
DS -7110 1300 -2770 4170 127 21
DS 7240 1170 2770 4170 127 21
DS 7100 -1310 2770 -4170 127 21
DS -7230 -1180 -2770 -4170 127 21
DA 5935 0 7108 -1304 900 127 21
DA -5935 0 -7108 1304 900 127 21
DC 0 0 -5000 200 127 21
$PAD
Sh "4" C 1181 1181 0 0 0
Dr 394 0 0
At STD N 00E0FFFF
Ne 0 ""
Po -773 -2378
$EndPAD
$PAD
Sh "1" C 1181 1181 0 0 0
Dr 394 0 0
At STD N 00E0FFFF
Ne 0 ""
Po -773 2378
$EndPAD
$PAD
Sh "5" C 2350 2350 0 0 0
Dr 1063 0 0
At STD N 00E0FFFF
Ne 0 ""
Po -5935 0
$EndPAD
$PAD
Sh "5" C 2350 2350 0 0 0
Dr 1063 0 0
At STD N 00E0FFFF
Ne 0 ""
Po 5935 0
$EndPAD
$PAD
Sh "2" C 1181 1181 0 0 0
Dr 394 0 0
At STD N 00E0FFFF
Ne 0 ""
Po 2023 1469
$EndPAD
$PAD
Sh "3" C 1181 1181 0 0 0
Dr 394 0 0
At STD N 00E0FFFF
Ne 0 ""
Po 2023 -1469
$EndPAD
$SHAPE3D
Na "walter\to\to3-4.wrl"
Sc 1.000000 1.000000 1.000000
Of 0.000000 0.000000 0.000000
Ro 0.000000 0.000000 0.000000
$EndSHAPE3D
$EndMODULE  to3-4
$EndLIBRARY
