PCBNEW-LibModule-V1  Út 30. duben 2013, 08:19:46 CEST
# encoding utf-8
Units mm
$INDEX
ZL262-10DG
ZL262-10DG-INV
ZL262-16DG
ZL262-16DG-INV
ZL262-20DG
ZL262-20DG-INV
ZL262-26DG
ZL262-26DG-INV
ZL262-32DG
ZL262-32DG-INV
ZL262-40DG
ZL262-40DG-INV
ZL262-50DG
ZL262-50DG-INV
ZL262-80DG
ZL262-80DG-INV
$EndINDEX
$MODULE ZL262-10DG
Po 0 0 0 15 517F5A79 00000000 ~~
Li ZL262-10DG
Sc 0
AR 
Op 0 0 0
T0 0 -3.81 1 1 0 0.15 N V 21 N "ZL262-10DG"
T1 0 3.81 1 1 0 0.15 N I 21 N "VAL**"
DS -6.35 0 -3.81 0 0.15 21
DS -3.81 0 -3.81 2.5 0.15 21
DS -6.35 -2.5 -6.35 2.5 0.15 21
DS -6.35 2.5 6.35 2.5 0.15 21
DS 6.35 2.5 6.35 -2.5 0.15 21
DS 6.35 -2.5 -6.35 -2.5 0.15 21
$PAD
Sh "1" R 1.5 1.5 0 0 0
Dr 0.8 0 0
At STD N 00E0FFFF
Ne 0 ""
Po -5.08 1.27
$EndPAD
$PAD
Sh "2" C 1.5 1.5 0 0 0
Dr 0.8 0 0
At STD N 00E0FFFF
Ne 0 ""
Po -5.08 -1.27
$EndPAD
$PAD
Sh "3" C 1.5 1.5 0 0 0
Dr 0.8 0 0
At STD N 00E0FFFF
Ne 0 ""
Po -2.54 1.27
$EndPAD
$PAD
Sh "4" C 1.5 1.5 0 0 0
Dr 0.8 0 0
At STD N 00E0FFFF
Ne 0 ""
Po -2.54 -1.27
$EndPAD
$PAD
Sh "5" C 1.5 1.5 0 0 0
Dr 0.8 0 0
At STD N 00E0FFFF
Ne 0 ""
Po 0 1.27
$EndPAD
$PAD
Sh "6" C 1.5 1.5 0 0 0
Dr 0.8 0 0
At STD N 00E0FFFF
Ne 0 ""
Po 0 -1.27
$EndPAD
$PAD
Sh "7" C 1.5 1.5 0 0 0
Dr 0.8 0 0
At STD N 00E0FFFF
Ne 0 ""
Po 2.54 1.27
$EndPAD
$PAD
Sh "8" C 1.5 1.5 0 0 0
Dr 0.8 0 0
At STD N 00E0FFFF
Ne 0 ""
Po 2.54 -1.27
$EndPAD
$PAD
Sh "9" C 1.5 1.5 0 0 0
Dr 0.8 0 0
At STD N 00E0FFFF
Ne 0 ""
Po 5.08 1.27
$EndPAD
$PAD
Sh "10" C 1.5 1.5 0 0 0
Dr 0.8 0 0
At STD N 00E0FFFF
Ne 0 ""
Po 5.08 -1.27
$EndPAD
$EndMODULE ZL262-10DG
$MODULE ZL262-10DG-INV
Po 0 0 0 15 517F617E 00000000 ~~
Li ZL262-10DG-INV
Sc 0
AR 
Op 0 0 0
T0 0 -3.81 1 1 0 0.15 N V 21 N "ZL262-10DG-INV"
T1 0 3.81 1 1 0 0.15 N I 21 N "VAL**"
DS -6.35 0 -3.81 0 0.15 21
DS -3.81 -2.54 -3.81 -0.04 0.15 21
DS -6.35 -2.5 -6.35 2.5 0.15 21
DS -6.35 2.5 6.35 2.5 0.15 21
DS 6.35 2.5 6.35 -2.5 0.15 21
DS 6.35 -2.5 -6.35 -2.5 0.15 21
$PAD
Sh "1" R 1.5 1.5 0 0 0
Dr 0.8 0 0
At STD N 00E0FFFF
Ne 0 ""
Po -5.08 -1.27
$EndPAD
$PAD
Sh "2" C 1.5 1.5 0 0 0
Dr 0.8 0 0
At STD N 00E0FFFF
Ne 0 ""
Po -5.08 1.27
$EndPAD
$PAD
Sh "3" C 1.5 1.5 0 0 0
Dr 0.8 0 0
At STD N 00E0FFFF
Ne 0 ""
Po -2.54 -1.27
$EndPAD
$PAD
Sh "4" C 1.5 1.5 0 0 0
Dr 0.8 0 0
At STD N 00E0FFFF
Ne 0 ""
Po -2.54 1.27
$EndPAD
$PAD
Sh "5" C 1.5 1.5 0 0 0
Dr 0.8 0 0
At STD N 00E0FFFF
Ne 0 ""
Po 0 -1.27
$EndPAD
$PAD
Sh "6" C 1.5 1.5 0 0 0
Dr 0.8 0 0
At STD N 00E0FFFF
Ne 0 ""
Po 0 1.27
$EndPAD
$PAD
Sh "7" C 1.5 1.5 0 0 0
Dr 0.8 0 0
At STD N 00E0FFFF
Ne 0 ""
Po 2.54 -1.27
$EndPAD
$PAD
Sh "8" C 1.5 1.5 0 0 0
Dr 0.8 0 0
At STD N 00E0FFFF
Ne 0 ""
Po 2.54 1.27
$EndPAD
$PAD
Sh "9" C 1.5 1.5 0 0 0
Dr 0.8 0 0
At STD N 00E0FFFF
Ne 0 ""
Po 5.08 -1.27
$EndPAD
$PAD
Sh "10" C 1.5 1.5 0 0 0
Dr 0.8 0 0
At STD N 00E0FFFF
Ne 0 ""
Po 5.08 1.27
$EndPAD
$EndMODULE ZL262-10DG-INV
$MODULE ZL262-16DG
Po 0 0 0 15 517F5B79 00000000 ~~
Li ZL262-16DG
Sc 0
AR 
Op 0 0 0
T0 0 -3.81 1 1 0 0.15 N V 21 N "ZL262-16DG"
T1 0 3.81 1 1 0 0.15 N I 21 N "VAL**"
DS 10.16 -2.5 -10.16 -2.5 0.15 21
DS -10.16 2.5 10.16 2.5 0.15 21
DS -10.16 0 -7.62 0 0.15 21
DS -7.62 0 -7.62 2.5 0.15 21
DS -10.16 -2.5 -10.16 2.5 0.15 21
DS 10.16 2.5 10.16 -2.5 0.15 21
$PAD
Sh "1" R 1.5 1.5 0 0 0
Dr 0.8 0 0
At STD N 00E0FFFF
Ne 0 ""
Po -8.89 1.27
$EndPAD
$PAD
Sh "2" C 1.5 1.5 0 0 0
Dr 0.8 0 0
At STD N 00E0FFFF
Ne 0 ""
Po -8.89 -1.27
$EndPAD
$PAD
Sh "3" C 1.5 1.5 0 0 0
Dr 0.8 0 0
At STD N 00E0FFFF
Ne 0 ""
Po -6.35 1.27
$EndPAD
$PAD
Sh "4" C 1.5 1.5 0 0 0
Dr 0.8 0 0
At STD N 00E0FFFF
Ne 0 ""
Po -6.35 -1.27
$EndPAD
$PAD
Sh "5" C 1.5 1.5 0 0 0
Dr 0.8 0 0
At STD N 00E0FFFF
Ne 0 ""
Po -3.81 1.27
$EndPAD
$PAD
Sh "6" C 1.5 1.5 0 0 0
Dr 0.8 0 0
At STD N 00E0FFFF
Ne 0 ""
Po -3.81 -1.27
$EndPAD
$PAD
Sh "7" C 1.5 1.5 0 0 0
Dr 0.8 0 0
At STD N 00E0FFFF
Ne 0 ""
Po -1.27 1.27
$EndPAD
$PAD
Sh "8" C 1.5 1.5 0 0 0
Dr 0.8 0 0
At STD N 00E0FFFF
Ne 0 ""
Po -1.27 -1.27
$EndPAD
$PAD
Sh "9" C 1.5 1.5 0 0 0
Dr 0.8 0 0
At STD N 00E0FFFF
Ne 0 ""
Po 1.27 1.27
$EndPAD
$PAD
Sh "10" C 1.5 1.5 0 0 0
Dr 0.8 0 0
At STD N 00E0FFFF
Ne 0 ""
Po 1.27 -1.27
$EndPAD
$PAD
Sh "11" C 1.5 1.5 0 0 0
Dr 0.8 0 0
At STD N 00E0FFFF
Ne 0 ""
Po 3.81 1.27
$EndPAD
$PAD
Sh "12" C 1.5 1.5 0 0 0
Dr 0.8 0 0
At STD N 00E0FFFF
Ne 0 ""
Po 3.81 -1.27
$EndPAD
$PAD
Sh "13" C 1.5 1.5 0 0 0
Dr 0.8 0 0
At STD N 00E0FFFF
Ne 0 ""
Po 6.35 1.27
$EndPAD
$PAD
Sh "14" C 1.5 1.5 0 0 0
Dr 0.8 0 0
At STD N 00E0FFFF
Ne 0 ""
Po 6.35 -1.27
$EndPAD
$PAD
Sh "15" C 1.5 1.5 0 0 0
Dr 0.8 0 0
At STD N 00E0FFFF
Ne 0 ""
Po 8.89 1.27
$EndPAD
$PAD
Sh "16" C 1.5 1.5 0 0 0
Dr 0.8 0 0
At STD N 00E0FFFF
Ne 0 ""
Po 8.89 -1.27
$EndPAD
$EndMODULE ZL262-16DG
$MODULE ZL262-16DG-INV
Po 0 0 0 15 517F619C 00000000 ~~
Li ZL262-16DG-INV
Sc 0
AR 
Op 0 0 0
T0 0 -3.81 1 1 0 0.15 N V 21 N "ZL262-16DG-INV"
T1 0 3.81 1 1 0 0.15 N I 21 N "VAL**"
DS 10.16 -2.5 -10.16 -2.5 0.15 21
DS -10.16 2.5 10.16 2.5 0.15 21
DS -10.16 0 -7.62 0 0.15 21
DS -7.62 -2.54 -7.62 -0.04 0.15 21
DS -10.16 -2.5 -10.16 2.5 0.15 21
DS 10.16 2.5 10.16 -2.5 0.15 21
$PAD
Sh "1" R 1.5 1.5 0 0 0
Dr 0.8 0 0
At STD N 00E0FFFF
Ne 0 ""
Po -8.89 -1.27
$EndPAD
$PAD
Sh "2" C 1.5 1.5 0 0 0
Dr 0.8 0 0
At STD N 00E0FFFF
Ne 0 ""
Po -8.89 1.27
$EndPAD
$PAD
Sh "3" C 1.5 1.5 0 0 0
Dr 0.8 0 0
At STD N 00E0FFFF
Ne 0 ""
Po -6.35 -1.27
$EndPAD
$PAD
Sh "4" C 1.5 1.5 0 0 0
Dr 0.8 0 0
At STD N 00E0FFFF
Ne 0 ""
Po -6.35 1.27
$EndPAD
$PAD
Sh "5" C 1.5 1.5 0 0 0
Dr 0.8 0 0
At STD N 00E0FFFF
Ne 0 ""
Po -3.81 -1.27
$EndPAD
$PAD
Sh "6" C 1.5 1.5 0 0 0
Dr 0.8 0 0
At STD N 00E0FFFF
Ne 0 ""
Po -3.81 1.27
$EndPAD
$PAD
Sh "7" C 1.5 1.5 0 0 0
Dr 0.8 0 0
At STD N 00E0FFFF
Ne 0 ""
Po -1.27 -1.27
$EndPAD
$PAD
Sh "8" C 1.5 1.5 0 0 0
Dr 0.8 0 0
At STD N 00E0FFFF
Ne 0 ""
Po -1.27 1.27
$EndPAD
$PAD
Sh "9" C 1.5 1.5 0 0 0
Dr 0.8 0 0
At STD N 00E0FFFF
Ne 0 ""
Po 1.27 -1.27
$EndPAD
$PAD
Sh "10" C 1.5 1.5 0 0 0
Dr 0.8 0 0
At STD N 00E0FFFF
Ne 0 ""
Po 1.27 1.27
$EndPAD
$PAD
Sh "11" C 1.5 1.5 0 0 0
Dr 0.8 0 0
At STD N 00E0FFFF
Ne 0 ""
Po 3.81 -1.27
$EndPAD
$PAD
Sh "12" C 1.5 1.5 0 0 0
Dr 0.8 0 0
At STD N 00E0FFFF
Ne 0 ""
Po 3.81 1.27
$EndPAD
$PAD
Sh "13" C 1.5 1.5 0 0 0
Dr 0.8 0 0
At STD N 00E0FFFF
Ne 0 ""
Po 6.35 -1.27
$EndPAD
$PAD
Sh "14" C 1.5 1.5 0 0 0
Dr 0.8 0 0
At STD N 00E0FFFF
Ne 0 ""
Po 6.35 1.27
$EndPAD
$PAD
Sh "15" C 1.5 1.5 0 0 0
Dr 0.8 0 0
At STD N 00E0FFFF
Ne 0 ""
Po 8.89 -1.27
$EndPAD
$PAD
Sh "16" C 1.5 1.5 0 0 0
Dr 0.8 0 0
At STD N 00E0FFFF
Ne 0 ""
Po 8.89 1.27
$EndPAD
$EndMODULE ZL262-16DG-INV
$MODULE ZL262-20DG
Po 0 0 0 15 517F5CAA 00000000 ~~
Li ZL262-20DG
Sc 0
AR 
Op 0 0 0
T0 0 -3.81 1 1 0 0.15 N V 21 N "ZL262-20DG"
T1 0 3.81 1 1 0 0.15 N I 21 N "VAL**"
DS -12.7 2.5 12.7 2.5 0.15 21
DS 12.7 2.5 12.7 -2.5 0.15 21
DS 12.7 -2.5 -12.7 -2.5 0.15 21
DS -12.7 0 -10.16 0 0.15 21
DS -10.16 0 -10.16 2.5 0.15 21
DS -12.7 -2.5 -12.7 2.5 0.15 21
$PAD
Sh "1" R 1.5 1.5 0 0 0
Dr 0.8 0 0
At STD N 00E0FFFF
Ne 0 ""
Po -11.43 1.27
$EndPAD
$PAD
Sh "2" C 1.5 1.5 0 0 0
Dr 0.8 0 0
At STD N 00E0FFFF
Ne 0 ""
Po -11.43 -1.27
$EndPAD
$PAD
Sh "3" C 1.5 1.5 0 0 0
Dr 0.8 0 0
At STD N 00E0FFFF
Ne 0 ""
Po -8.89 1.27
$EndPAD
$PAD
Sh "4" C 1.5 1.5 0 0 0
Dr 0.8 0 0
At STD N 00E0FFFF
Ne 0 ""
Po -8.89 -1.27
$EndPAD
$PAD
Sh "5" C 1.5 1.5 0 0 0
Dr 0.8 0 0
At STD N 00E0FFFF
Ne 0 ""
Po -6.35 1.27
$EndPAD
$PAD
Sh "6" C 1.5 1.5 0 0 0
Dr 0.8 0 0
At STD N 00E0FFFF
Ne 0 ""
Po -6.35 -1.27
$EndPAD
$PAD
Sh "7" C 1.5 1.5 0 0 0
Dr 0.8 0 0
At STD N 00E0FFFF
Ne 0 ""
Po -3.81 1.27
$EndPAD
$PAD
Sh "8" C 1.5 1.5 0 0 0
Dr 0.8 0 0
At STD N 00E0FFFF
Ne 0 ""
Po -3.81 -1.27
$EndPAD
$PAD
Sh "9" C 1.5 1.5 0 0 0
Dr 0.8 0 0
At STD N 00E0FFFF
Ne 0 ""
Po -1.27 1.27
$EndPAD
$PAD
Sh "10" C 1.5 1.5 0 0 0
Dr 0.8 0 0
At STD N 00E0FFFF
Ne 0 ""
Po -1.27 -1.27
$EndPAD
$PAD
Sh "11" C 1.5 1.5 0 0 0
Dr 0.8 0 0
At STD N 00E0FFFF
Ne 0 ""
Po 1.27 1.27
$EndPAD
$PAD
Sh "12" C 1.5 1.5 0 0 0
Dr 0.8 0 0
At STD N 00E0FFFF
Ne 0 ""
Po 1.27 -1.27
$EndPAD
$PAD
Sh "13" C 1.5 1.5 0 0 0
Dr 0.8 0 0
At STD N 00E0FFFF
Ne 0 ""
Po 3.81 1.27
$EndPAD
$PAD
Sh "14" C 1.5 1.5 0 0 0
Dr 0.8 0 0
At STD N 00E0FFFF
Ne 0 ""
Po 3.81 -1.27
$EndPAD
$PAD
Sh "15" C 1.5 1.5 0 0 0
Dr 0.8 0 0
At STD N 00E0FFFF
Ne 0 ""
Po 6.35 1.27
$EndPAD
$PAD
Sh "16" C 1.5 1.5 0 0 0
Dr 0.8 0 0
At STD N 00E0FFFF
Ne 0 ""
Po 6.35 -1.27
$EndPAD
$PAD
Sh "17" C 1.5 1.5 0 0 0
Dr 0.8 0 0
At STD N 00E0FFFF
Ne 0 ""
Po 8.89 1.27
$EndPAD
$PAD
Sh "18" C 1.5 1.5 0 0 0
Dr 0.8 0 0
At STD N 00E0FFFF
Ne 0 ""
Po 8.89 -1.27
$EndPAD
$PAD
Sh "19" C 1.5 1.5 0 0 0
Dr 0.8 0 0
At STD N 00E0FFFF
Ne 0 ""
Po 11.43 1.27
$EndPAD
$PAD
Sh "20" C 1.5 1.5 0 0 0
Dr 0.8 0 0
At STD N 00E0FFFF
Ne 0 ""
Po 11.43 -1.27
$EndPAD
$EndMODULE ZL262-20DG
$MODULE ZL262-20DG-INV
Po 0 0 0 15 517F61BD 00000000 ~~
Li ZL262-20DG-INV
Sc 0
AR 
Op 0 0 0
T0 0 -3.81 1 1 0 0.15 N V 21 N "ZL262-20DG-INV"
T1 0 3.81 1 1 0 0.15 N I 21 N "VAL**"
DS -12.7 2.5 12.7 2.5 0.15 21
DS 12.7 2.5 12.7 -2.5 0.15 21
DS 12.7 -2.5 -12.7 -2.5 0.15 21
DS -12.7 0 -10.16 0 0.15 21
DS -10.16 -2.54 -10.16 -0.04 0.15 21
DS -12.7 -2.5 -12.7 2.5 0.15 21
$PAD
Sh "1" R 1.5 1.5 0 0 0
Dr 0.8 0 0
At STD N 00E0FFFF
Ne 0 ""
Po -11.43 -1.27
$EndPAD
$PAD
Sh "2" C 1.5 1.5 0 0 0
Dr 0.8 0 0
At STD N 00E0FFFF
Ne 0 ""
Po -11.43 1.27
$EndPAD
$PAD
Sh "3" C 1.5 1.5 0 0 0
Dr 0.8 0 0
At STD N 00E0FFFF
Ne 0 ""
Po -8.89 -1.27
$EndPAD
$PAD
Sh "4" C 1.5 1.5 0 0 0
Dr 0.8 0 0
At STD N 00E0FFFF
Ne 0 ""
Po -8.89 1.27
$EndPAD
$PAD
Sh "5" C 1.5 1.5 0 0 0
Dr 0.8 0 0
At STD N 00E0FFFF
Ne 0 ""
Po -6.35 -1.27
$EndPAD
$PAD
Sh "6" C 1.5 1.5 0 0 0
Dr 0.8 0 0
At STD N 00E0FFFF
Ne 0 ""
Po -6.35 1.27
$EndPAD
$PAD
Sh "7" C 1.5 1.5 0 0 0
Dr 0.8 0 0
At STD N 00E0FFFF
Ne 0 ""
Po -3.81 -1.27
$EndPAD
$PAD
Sh "8" C 1.5 1.5 0 0 0
Dr 0.8 0 0
At STD N 00E0FFFF
Ne 0 ""
Po -3.81 1.27
$EndPAD
$PAD
Sh "9" C 1.5 1.5 0 0 0
Dr 0.8 0 0
At STD N 00E0FFFF
Ne 0 ""
Po -1.27 -1.27
$EndPAD
$PAD
Sh "10" C 1.5 1.5 0 0 0
Dr 0.8 0 0
At STD N 00E0FFFF
Ne 0 ""
Po -1.27 1.27
$EndPAD
$PAD
Sh "11" C 1.5 1.5 0 0 0
Dr 0.8 0 0
At STD N 00E0FFFF
Ne 0 ""
Po 1.27 -1.27
$EndPAD
$PAD
Sh "12" C 1.5 1.5 0 0 0
Dr 0.8 0 0
At STD N 00E0FFFF
Ne 0 ""
Po 1.27 1.27
$EndPAD
$PAD
Sh "13" C 1.5 1.5 0 0 0
Dr 0.8 0 0
At STD N 00E0FFFF
Ne 0 ""
Po 3.81 -1.27
$EndPAD
$PAD
Sh "14" C 1.5 1.5 0 0 0
Dr 0.8 0 0
At STD N 00E0FFFF
Ne 0 ""
Po 3.81 1.27
$EndPAD
$PAD
Sh "15" C 1.5 1.5 0 0 0
Dr 0.8 0 0
At STD N 00E0FFFF
Ne 0 ""
Po 6.35 -1.27
$EndPAD
$PAD
Sh "16" C 1.5 1.5 0 0 0
Dr 0.8 0 0
At STD N 00E0FFFF
Ne 0 ""
Po 6.35 1.27
$EndPAD
$PAD
Sh "17" C 1.5 1.5 0 0 0
Dr 0.8 0 0
At STD N 00E0FFFF
Ne 0 ""
Po 8.89 -1.27
$EndPAD
$PAD
Sh "18" C 1.5 1.5 0 0 0
Dr 0.8 0 0
At STD N 00E0FFFF
Ne 0 ""
Po 8.89 1.27
$EndPAD
$PAD
Sh "19" C 1.5 1.5 0 0 0
Dr 0.8 0 0
At STD N 00E0FFFF
Ne 0 ""
Po 11.43 -1.27
$EndPAD
$PAD
Sh "20" C 1.5 1.5 0 0 0
Dr 0.8 0 0
At STD N 00E0FFFF
Ne 0 ""
Po 11.43 1.27
$EndPAD
$EndMODULE ZL262-20DG-INV
$MODULE ZL262-26DG
Po 0 0 0 15 517F5C58 00000000 ~~
Li ZL262-26DG
Sc 0
AR 
Op 0 0 0
T0 0 -3.81 1 1 0 0.15 N V 21 N "ZL262-26DG"
T1 0 3.81 1 1 0 0.15 N I 21 N "VAL**"
DS -16.51 2.5 16.51 2.5 0.15 21
DS 16.51 2.5 16.51 -2.5 0.15 21
DS 16.51 -2.5 -16.51 -2.5 0.15 21
DS -16.51 0 -13.97 0 0.15 21
DS -13.97 0 -13.97 2.5 0.15 21
DS -16.51 -2.5 -16.51 2.5 0.15 21
$PAD
Sh "1" R 1.5 1.5 0 0 0
Dr 0.8 0 0
At STD N 00E0FFFF
Ne 0 ""
Po -15.24 1.27
$EndPAD
$PAD
Sh "2" C 1.5 1.5 0 0 0
Dr 0.8 0 0
At STD N 00E0FFFF
Ne 0 ""
Po -15.24 -1.27
$EndPAD
$PAD
Sh "3" C 1.5 1.5 0 0 0
Dr 0.8 0 0
At STD N 00E0FFFF
Ne 0 ""
Po -12.7 1.27
$EndPAD
$PAD
Sh "4" C 1.5 1.5 0 0 0
Dr 0.8 0 0
At STD N 00E0FFFF
Ne 0 ""
Po -12.7 -1.27
$EndPAD
$PAD
Sh "5" C 1.5 1.5 0 0 0
Dr 0.8 0 0
At STD N 00E0FFFF
Ne 0 ""
Po -10.16 1.27
$EndPAD
$PAD
Sh "6" C 1.5 1.5 0 0 0
Dr 0.8 0 0
At STD N 00E0FFFF
Ne 0 ""
Po -10.16 -1.27
$EndPAD
$PAD
Sh "7" C 1.5 1.5 0 0 0
Dr 0.8 0 0
At STD N 00E0FFFF
Ne 0 ""
Po -7.62 1.27
$EndPAD
$PAD
Sh "8" C 1.5 1.5 0 0 0
Dr 0.8 0 0
At STD N 00E0FFFF
Ne 0 ""
Po -7.62 -1.27
$EndPAD
$PAD
Sh "9" C 1.5 1.5 0 0 0
Dr 0.8 0 0
At STD N 00E0FFFF
Ne 0 ""
Po -5.08 1.27
$EndPAD
$PAD
Sh "10" C 1.5 1.5 0 0 0
Dr 0.8 0 0
At STD N 00E0FFFF
Ne 0 ""
Po -5.08 -1.27
$EndPAD
$PAD
Sh "11" C 1.5 1.5 0 0 0
Dr 0.8 0 0
At STD N 00E0FFFF
Ne 0 ""
Po -2.54 1.27
$EndPAD
$PAD
Sh "12" C 1.5 1.5 0 0 0
Dr 0.8 0 0
At STD N 00E0FFFF
Ne 0 ""
Po -2.54 -1.27
$EndPAD
$PAD
Sh "13" C 1.5 1.5 0 0 0
Dr 0.8 0 0
At STD N 00E0FFFF
Ne 0 ""
Po 0 1.27
$EndPAD
$PAD
Sh "14" C 1.5 1.5 0 0 0
Dr 0.8 0 0
At STD N 00E0FFFF
Ne 0 ""
Po 0 -1.27
$EndPAD
$PAD
Sh "15" C 1.5 1.5 0 0 0
Dr 0.8 0 0
At STD N 00E0FFFF
Ne 0 ""
Po 2.54 1.27
$EndPAD
$PAD
Sh "16" C 1.5 1.5 0 0 0
Dr 0.8 0 0
At STD N 00E0FFFF
Ne 0 ""
Po 2.54 -1.27
$EndPAD
$PAD
Sh "17" C 1.5 1.5 0 0 0
Dr 0.8 0 0
At STD N 00E0FFFF
Ne 0 ""
Po 5.08 1.27
$EndPAD
$PAD
Sh "18" C 1.5 1.5 0 0 0
Dr 0.8 0 0
At STD N 00E0FFFF
Ne 0 ""
Po 5.08 -1.27
$EndPAD
$PAD
Sh "19" C 1.5 1.5 0 0 0
Dr 0.8 0 0
At STD N 00E0FFFF
Ne 0 ""
Po 7.62 1.27
$EndPAD
$PAD
Sh "20" C 1.5 1.5 0 0 0
Dr 0.8 0 0
At STD N 00E0FFFF
Ne 0 ""
Po 7.62 -1.27
$EndPAD
$PAD
Sh "21" C 1.5 1.5 0 0 0
Dr 0.8 0 0
At STD N 00E0FFFF
Ne 0 ""
Po 10.16 1.27
$EndPAD
$PAD
Sh "22" C 1.5 1.5 0 0 0
Dr 0.8 0 0
At STD N 00E0FFFF
Ne 0 ""
Po 10.16 -1.27
$EndPAD
$PAD
Sh "23" C 1.5 1.5 0 0 0
Dr 0.8 0 0
At STD N 00E0FFFF
Ne 0 ""
Po 12.7 1.27
$EndPAD
$PAD
Sh "24" C 1.5 1.5 0 0 0
Dr 0.8 0 0
At STD N 00E0FFFF
Ne 0 ""
Po 12.7 -1.27
$EndPAD
$PAD
Sh "25" C 1.5 1.5 0 0 0
Dr 0.8 0 0
At STD N 00E0FFFF
Ne 0 ""
Po 15.24 1.27
$EndPAD
$PAD
Sh "26" C 1.5 1.5 0 0 0
Dr 0.8 0 0
At STD N 00E0FFFF
Ne 0 ""
Po 15.24 -1.27
$EndPAD
$EndMODULE ZL262-26DG
$MODULE ZL262-26DG-INV
Po 0 0 0 15 517F61EE 00000000 ~~
Li ZL262-26DG-INV
Sc 0
AR 
Op 0 0 0
T0 0 -3.81 1 1 0 0.15 N V 21 N "ZL262-26DG-INV"
T1 0 3.81 1 1 0 0.15 N I 21 N "VAL**"
DS -16.51 2.5 16.51 2.5 0.15 21
DS 16.51 2.5 16.51 -2.5 0.15 21
DS 16.51 -2.5 -16.51 -2.5 0.15 21
DS -16.51 0 -13.97 0 0.15 21
DS -13.97 -2.54 -13.97 -0.04 0.15 21
DS -16.51 -2.5 -16.51 2.5 0.15 21
$PAD
Sh "1" R 1.5 1.5 0 0 0
Dr 0.8 0 0
At STD N 00E0FFFF
Ne 0 ""
Po -15.24 -1.27
$EndPAD
$PAD
Sh "2" C 1.5 1.5 0 0 0
Dr 0.8 0 0
At STD N 00E0FFFF
Ne 0 ""
Po -15.24 1.27
$EndPAD
$PAD
Sh "3" C 1.5 1.5 0 0 0
Dr 0.8 0 0
At STD N 00E0FFFF
Ne 0 ""
Po -12.7 -1.27
$EndPAD
$PAD
Sh "4" C 1.5 1.5 0 0 0
Dr 0.8 0 0
At STD N 00E0FFFF
Ne 0 ""
Po -12.7 1.27
$EndPAD
$PAD
Sh "5" C 1.5 1.5 0 0 0
Dr 0.8 0 0
At STD N 00E0FFFF
Ne 0 ""
Po -10.16 -1.27
$EndPAD
$PAD
Sh "6" C 1.5 1.5 0 0 0
Dr 0.8 0 0
At STD N 00E0FFFF
Ne 0 ""
Po -10.16 1.27
$EndPAD
$PAD
Sh "7" C 1.5 1.5 0 0 0
Dr 0.8 0 0
At STD N 00E0FFFF
Ne 0 ""
Po -7.62 -1.27
$EndPAD
$PAD
Sh "8" C 1.5 1.5 0 0 0
Dr 0.8 0 0
At STD N 00E0FFFF
Ne 0 ""
Po -7.62 1.27
$EndPAD
$PAD
Sh "9" C 1.5 1.5 0 0 0
Dr 0.8 0 0
At STD N 00E0FFFF
Ne 0 ""
Po -5.08 -1.27
$EndPAD
$PAD
Sh "10" C 1.5 1.5 0 0 0
Dr 0.8 0 0
At STD N 00E0FFFF
Ne 0 ""
Po -5.08 1.27
$EndPAD
$PAD
Sh "11" C 1.5 1.5 0 0 0
Dr 0.8 0 0
At STD N 00E0FFFF
Ne 0 ""
Po -2.54 -1.27
$EndPAD
$PAD
Sh "12" C 1.5 1.5 0 0 0
Dr 0.8 0 0
At STD N 00E0FFFF
Ne 0 ""
Po -2.54 1.27
$EndPAD
$PAD
Sh "13" C 1.5 1.5 0 0 0
Dr 0.8 0 0
At STD N 00E0FFFF
Ne 0 ""
Po 0 -1.27
$EndPAD
$PAD
Sh "14" C 1.5 1.5 0 0 0
Dr 0.8 0 0
At STD N 00E0FFFF
Ne 0 ""
Po 0 1.27
$EndPAD
$PAD
Sh "15" C 1.5 1.5 0 0 0
Dr 0.8 0 0
At STD N 00E0FFFF
Ne 0 ""
Po 2.54 -1.27
$EndPAD
$PAD
Sh "16" C 1.5 1.5 0 0 0
Dr 0.8 0 0
At STD N 00E0FFFF
Ne 0 ""
Po 2.54 1.27
$EndPAD
$PAD
Sh "17" C 1.5 1.5 0 0 0
Dr 0.8 0 0
At STD N 00E0FFFF
Ne 0 ""
Po 5.08 -1.27
$EndPAD
$PAD
Sh "18" C 1.5 1.5 0 0 0
Dr 0.8 0 0
At STD N 00E0FFFF
Ne 0 ""
Po 5.08 1.27
$EndPAD
$PAD
Sh "19" C 1.5 1.5 0 0 0
Dr 0.8 0 0
At STD N 00E0FFFF
Ne 0 ""
Po 7.62 -1.27
$EndPAD
$PAD
Sh "20" C 1.5 1.5 0 0 0
Dr 0.8 0 0
At STD N 00E0FFFF
Ne 0 ""
Po 7.62 1.27
$EndPAD
$PAD
Sh "21" C 1.5 1.5 0 0 0
Dr 0.8 0 0
At STD N 00E0FFFF
Ne 0 ""
Po 10.16 -1.27
$EndPAD
$PAD
Sh "22" C 1.5 1.5 0 0 0
Dr 0.8 0 0
At STD N 00E0FFFF
Ne 0 ""
Po 10.16 1.27
$EndPAD
$PAD
Sh "23" C 1.5 1.5 0 0 0
Dr 0.8 0 0
At STD N 00E0FFFF
Ne 0 ""
Po 12.7 -1.27
$EndPAD
$PAD
Sh "24" C 1.5 1.5 0 0 0
Dr 0.8 0 0
At STD N 00E0FFFF
Ne 0 ""
Po 12.7 1.27
$EndPAD
$PAD
Sh "25" C 1.5 1.5 0 0 0
Dr 0.8 0 0
At STD N 00E0FFFF
Ne 0 ""
Po 15.24 -1.27
$EndPAD
$PAD
Sh "26" C 1.5 1.5 0 0 0
Dr 0.8 0 0
At STD N 00E0FFFF
Ne 0 ""
Po 15.24 1.27
$EndPAD
$EndMODULE ZL262-26DG-INV
$MODULE ZL262-32DG
Po 0 0 0 15 517F5D08 00000000 ~~
Li ZL262-32DG
Sc 0
AR 
Op 0 0 0
T0 0 -3.81 1 1 0 0.15 N V 21 N "ZL262-32DG"
T1 0 3.81 1 1 0 0.15 N I 21 N "VAL**"
DS -20.32 2.5 20.32 2.5 0.15 21
DS 20.32 2.5 20.32 -2.5 0.15 21
DS 20.32 -2.5 -20.32 -2.5 0.15 21
DS -20.32 0 -17.78 0 0.15 21
DS -17.78 0 -17.78 2.5 0.15 21
DS -20.32 -2.5 -20.32 2.5 0.15 21
$PAD
Sh "1" R 1.5 1.5 0 0 0
Dr 0.8 0 0
At STD N 00E0FFFF
Ne 0 ""
Po -19.05 1.27
$EndPAD
$PAD
Sh "2" C 1.5 1.5 0 0 0
Dr 0.8 0 0
At STD N 00E0FFFF
Ne 0 ""
Po -19.05 -1.27
$EndPAD
$PAD
Sh "3" C 1.5 1.5 0 0 0
Dr 0.8 0 0
At STD N 00E0FFFF
Ne 0 ""
Po -16.51 1.27
$EndPAD
$PAD
Sh "4" C 1.5 1.5 0 0 0
Dr 0.8 0 0
At STD N 00E0FFFF
Ne 0 ""
Po -16.51 -1.27
$EndPAD
$PAD
Sh "5" C 1.5 1.5 0 0 0
Dr 0.8 0 0
At STD N 00E0FFFF
Ne 0 ""
Po -13.97 1.27
$EndPAD
$PAD
Sh "6" C 1.5 1.5 0 0 0
Dr 0.8 0 0
At STD N 00E0FFFF
Ne 0 ""
Po -13.97 -1.27
$EndPAD
$PAD
Sh "7" C 1.5 1.5 0 0 0
Dr 0.8 0 0
At STD N 00E0FFFF
Ne 0 ""
Po -11.43 1.27
$EndPAD
$PAD
Sh "8" C 1.5 1.5 0 0 0
Dr 0.8 0 0
At STD N 00E0FFFF
Ne 0 ""
Po -11.43 -1.27
$EndPAD
$PAD
Sh "9" C 1.5 1.5 0 0 0
Dr 0.8 0 0
At STD N 00E0FFFF
Ne 0 ""
Po -8.89 1.27
$EndPAD
$PAD
Sh "10" C 1.5 1.5 0 0 0
Dr 0.8 0 0
At STD N 00E0FFFF
Ne 0 ""
Po -8.89 -1.27
$EndPAD
$PAD
Sh "11" C 1.5 1.5 0 0 0
Dr 0.8 0 0
At STD N 00E0FFFF
Ne 0 ""
Po -6.35 1.27
$EndPAD
$PAD
Sh "12" C 1.5 1.5 0 0 0
Dr 0.8 0 0
At STD N 00E0FFFF
Ne 0 ""
Po -6.35 -1.27
$EndPAD
$PAD
Sh "13" C 1.5 1.5 0 0 0
Dr 0.8 0 0
At STD N 00E0FFFF
Ne 0 ""
Po -3.81 1.27
$EndPAD
$PAD
Sh "14" C 1.5 1.5 0 0 0
Dr 0.8 0 0
At STD N 00E0FFFF
Ne 0 ""
Po -3.81 -1.27
$EndPAD
$PAD
Sh "15" C 1.5 1.5 0 0 0
Dr 0.8 0 0
At STD N 00E0FFFF
Ne 0 ""
Po -1.27 1.27
$EndPAD
$PAD
Sh "16" C 1.5 1.5 0 0 0
Dr 0.8 0 0
At STD N 00E0FFFF
Ne 0 ""
Po -1.27 -1.27
$EndPAD
$PAD
Sh "17" C 1.5 1.5 0 0 0
Dr 0.8 0 0
At STD N 00E0FFFF
Ne 0 ""
Po 1.27 1.27
$EndPAD
$PAD
Sh "18" C 1.5 1.5 0 0 0
Dr 0.8 0 0
At STD N 00E0FFFF
Ne 0 ""
Po 1.27 -1.27
$EndPAD
$PAD
Sh "19" C 1.5 1.5 0 0 0
Dr 0.8 0 0
At STD N 00E0FFFF
Ne 0 ""
Po 3.81 1.27
$EndPAD
$PAD
Sh "20" C 1.5 1.5 0 0 0
Dr 0.8 0 0
At STD N 00E0FFFF
Ne 0 ""
Po 3.81 -1.27
$EndPAD
$PAD
Sh "21" C 1.5 1.5 0 0 0
Dr 0.8 0 0
At STD N 00E0FFFF
Ne 0 ""
Po 6.35 1.27
$EndPAD
$PAD
Sh "22" C 1.5 1.5 0 0 0
Dr 0.8 0 0
At STD N 00E0FFFF
Ne 0 ""
Po 6.35 -1.27
$EndPAD
$PAD
Sh "23" C 1.5 1.5 0 0 0
Dr 0.8 0 0
At STD N 00E0FFFF
Ne 0 ""
Po 8.89 1.27
$EndPAD
$PAD
Sh "24" C 1.5 1.5 0 0 0
Dr 0.8 0 0
At STD N 00E0FFFF
Ne 0 ""
Po 8.89 -1.27
$EndPAD
$PAD
Sh "25" C 1.5 1.5 0 0 0
Dr 0.8 0 0
At STD N 00E0FFFF
Ne 0 ""
Po 11.43 1.27
$EndPAD
$PAD
Sh "26" C 1.5 1.5 0 0 0
Dr 0.8 0 0
At STD N 00E0FFFF
Ne 0 ""
Po 11.43 -1.27
$EndPAD
$PAD
Sh "27" C 1.5 1.5 0 0 0
Dr 0.8 0 0
At STD N 00E0FFFF
Ne 0 ""
Po 13.97 1.27
$EndPAD
$PAD
Sh "28" C 1.5 1.5 0 0 0
Dr 0.8 0 0
At STD N 00E0FFFF
Ne 0 ""
Po 13.97 -1.27
$EndPAD
$PAD
Sh "29" C 1.5 1.5 0 0 0
Dr 0.8 0 0
At STD N 00E0FFFF
Ne 0 ""
Po 16.51 1.27
$EndPAD
$PAD
Sh "30" C 1.5 1.5 0 0 0
Dr 0.8 0 0
At STD N 00E0FFFF
Ne 0 ""
Po 16.51 -1.27
$EndPAD
$PAD
Sh "31" C 1.5 1.5 0 0 0
Dr 0.8 0 0
At STD N 00E0FFFF
Ne 0 ""
Po 19.05 1.27
$EndPAD
$PAD
Sh "32" C 1.5 1.5 0 0 0
Dr 0.8 0 0
At STD N 00E0FFFF
Ne 0 ""
Po 19.05 -1.27
$EndPAD
$EndMODULE ZL262-32DG
$MODULE ZL262-32DG-INV
Po 0 0 0 15 517F6212 00000000 ~~
Li ZL262-32DG-INV
Sc 0
AR 
Op 0 0 0
T0 0 -3.81 1 1 0 0.15 N V 21 N "ZL262-32DG-INV"
T1 0 3.81 1 1 0 0.15 N I 21 N "VAL**"
DS -20.32 2.5 20.32 2.5 0.15 21
DS 20.32 2.5 20.32 -2.5 0.15 21
DS 20.32 -2.5 -20.32 -2.5 0.15 21
DS -20.32 0 -17.78 0 0.15 21
DS -17.78 -2.54 -17.78 -0.04 0.15 21
DS -20.32 -2.5 -20.32 2.5 0.15 21
$PAD
Sh "1" R 1.5 1.5 0 0 0
Dr 0.8 0 0
At STD N 00E0FFFF
Ne 0 ""
Po -19.05 -1.27
$EndPAD
$PAD
Sh "2" C 1.5 1.5 0 0 0
Dr 0.8 0 0
At STD N 00E0FFFF
Ne 0 ""
Po -19.05 1.27
$EndPAD
$PAD
Sh "3" C 1.5 1.5 0 0 0
Dr 0.8 0 0
At STD N 00E0FFFF
Ne 0 ""
Po -16.51 -1.27
$EndPAD
$PAD
Sh "4" C 1.5 1.5 0 0 0
Dr 0.8 0 0
At STD N 00E0FFFF
Ne 0 ""
Po -16.51 1.27
$EndPAD
$PAD
Sh "5" C 1.5 1.5 0 0 0
Dr 0.8 0 0
At STD N 00E0FFFF
Ne 0 ""
Po -13.97 -1.27
$EndPAD
$PAD
Sh "6" C 1.5 1.5 0 0 0
Dr 0.8 0 0
At STD N 00E0FFFF
Ne 0 ""
Po -13.97 1.27
$EndPAD
$PAD
Sh "7" C 1.5 1.5 0 0 0
Dr 0.8 0 0
At STD N 00E0FFFF
Ne 0 ""
Po -11.43 -1.27
$EndPAD
$PAD
Sh "8" C 1.5 1.5 0 0 0
Dr 0.8 0 0
At STD N 00E0FFFF
Ne 0 ""
Po -11.43 1.27
$EndPAD
$PAD
Sh "9" C 1.5 1.5 0 0 0
Dr 0.8 0 0
At STD N 00E0FFFF
Ne 0 ""
Po -8.89 -1.27
$EndPAD
$PAD
Sh "10" C 1.5 1.5 0 0 0
Dr 0.8 0 0
At STD N 00E0FFFF
Ne 0 ""
Po -8.89 1.27
$EndPAD
$PAD
Sh "11" C 1.5 1.5 0 0 0
Dr 0.8 0 0
At STD N 00E0FFFF
Ne 0 ""
Po -6.35 -1.27
$EndPAD
$PAD
Sh "12" C 1.5 1.5 0 0 0
Dr 0.8 0 0
At STD N 00E0FFFF
Ne 0 ""
Po -6.35 1.27
$EndPAD
$PAD
Sh "13" C 1.5 1.5 0 0 0
Dr 0.8 0 0
At STD N 00E0FFFF
Ne 0 ""
Po -3.81 -1.27
$EndPAD
$PAD
Sh "14" C 1.5 1.5 0 0 0
Dr 0.8 0 0
At STD N 00E0FFFF
Ne 0 ""
Po -3.81 1.27
$EndPAD
$PAD
Sh "15" C 1.5 1.5 0 0 0
Dr 0.8 0 0
At STD N 00E0FFFF
Ne 0 ""
Po -1.27 -1.27
$EndPAD
$PAD
Sh "16" C 1.5 1.5 0 0 0
Dr 0.8 0 0
At STD N 00E0FFFF
Ne 0 ""
Po -1.27 1.27
$EndPAD
$PAD
Sh "17" C 1.5 1.5 0 0 0
Dr 0.8 0 0
At STD N 00E0FFFF
Ne 0 ""
Po 1.27 -1.27
$EndPAD
$PAD
Sh "18" C 1.5 1.5 0 0 0
Dr 0.8 0 0
At STD N 00E0FFFF
Ne 0 ""
Po 1.27 1.27
$EndPAD
$PAD
Sh "19" C 1.5 1.5 0 0 0
Dr 0.8 0 0
At STD N 00E0FFFF
Ne 0 ""
Po 3.81 -1.27
$EndPAD
$PAD
Sh "20" C 1.5 1.5 0 0 0
Dr 0.8 0 0
At STD N 00E0FFFF
Ne 0 ""
Po 3.81 1.27
$EndPAD
$PAD
Sh "21" C 1.5 1.5 0 0 0
Dr 0.8 0 0
At STD N 00E0FFFF
Ne 0 ""
Po 6.35 -1.27
$EndPAD
$PAD
Sh "22" C 1.5 1.5 0 0 0
Dr 0.8 0 0
At STD N 00E0FFFF
Ne 0 ""
Po 6.35 1.27
$EndPAD
$PAD
Sh "23" C 1.5 1.5 0 0 0
Dr 0.8 0 0
At STD N 00E0FFFF
Ne 0 ""
Po 8.89 -1.27
$EndPAD
$PAD
Sh "24" C 1.5 1.5 0 0 0
Dr 0.8 0 0
At STD N 00E0FFFF
Ne 0 ""
Po 8.89 1.27
$EndPAD
$PAD
Sh "25" C 1.5 1.5 0 0 0
Dr 0.8 0 0
At STD N 00E0FFFF
Ne 0 ""
Po 11.43 -1.27
$EndPAD
$PAD
Sh "26" C 1.5 1.5 0 0 0
Dr 0.8 0 0
At STD N 00E0FFFF
Ne 0 ""
Po 11.43 1.27
$EndPAD
$PAD
Sh "27" C 1.5 1.5 0 0 0
Dr 0.8 0 0
At STD N 00E0FFFF
Ne 0 ""
Po 13.97 -1.27
$EndPAD
$PAD
Sh "28" C 1.5 1.5 0 0 0
Dr 0.8 0 0
At STD N 00E0FFFF
Ne 0 ""
Po 13.97 1.27
$EndPAD
$PAD
Sh "29" C 1.5 1.5 0 0 0
Dr 0.8 0 0
At STD N 00E0FFFF
Ne 0 ""
Po 16.51 -1.27
$EndPAD
$PAD
Sh "30" C 1.5 1.5 0 0 0
Dr 0.8 0 0
At STD N 00E0FFFF
Ne 0 ""
Po 16.51 1.27
$EndPAD
$PAD
Sh "31" C 1.5 1.5 0 0 0
Dr 0.8 0 0
At STD N 00E0FFFF
Ne 0 ""
Po 19.05 -1.27
$EndPAD
$PAD
Sh "32" C 1.5 1.5 0 0 0
Dr 0.8 0 0
At STD N 00E0FFFF
Ne 0 ""
Po 19.05 1.27
$EndPAD
$EndMODULE ZL262-32DG-INV
$MODULE ZL262-40DG
Po 0 0 0 15 517F5DD2 00000000 ~~
Li ZL262-40DG
Sc 0
AR 
Op 0 0 0
T0 0 -3.81 1 1 0 0.15 N V 21 N "ZL262-40DG"
T1 0 3.81 1 1 0 0.15 N I 21 N "VAL**"
DS -25.4 2.5 25.4 2.5 0.15 21
DS 25.4 2.5 25.4 -2.5 0.15 21
DS 25.4 -2.5 -25.4 -2.5 0.15 21
DS -25.4 0 -22.86 0 0.15 21
DS -22.86 0 -22.86 2.5 0.15 21
DS -25.4 -2.5 -25.4 2.5 0.15 21
$PAD
Sh "1" R 1.5 1.5 0 0 0
Dr 0.8 0 0
At STD N 00E0FFFF
Ne 0 ""
Po -24.13 1.27
$EndPAD
$PAD
Sh "2" C 1.5 1.5 0 0 0
Dr 0.8 0 0
At STD N 00E0FFFF
Ne 0 ""
Po -24.13 -1.27
$EndPAD
$PAD
Sh "3" C 1.5 1.5 0 0 0
Dr 0.8 0 0
At STD N 00E0FFFF
Ne 0 ""
Po -21.59 1.27
$EndPAD
$PAD
Sh "4" C 1.5 1.5 0 0 0
Dr 0.8 0 0
At STD N 00E0FFFF
Ne 0 ""
Po -21.59 -1.27
$EndPAD
$PAD
Sh "5" C 1.5 1.5 0 0 0
Dr 0.8 0 0
At STD N 00E0FFFF
Ne 0 ""
Po -19.05 1.27
$EndPAD
$PAD
Sh "6" C 1.5 1.5 0 0 0
Dr 0.8 0 0
At STD N 00E0FFFF
Ne 0 ""
Po -19.05 -1.27
$EndPAD
$PAD
Sh "7" C 1.5 1.5 0 0 0
Dr 0.8 0 0
At STD N 00E0FFFF
Ne 0 ""
Po -16.51 1.27
$EndPAD
$PAD
Sh "8" C 1.5 1.5 0 0 0
Dr 0.8 0 0
At STD N 00E0FFFF
Ne 0 ""
Po -16.51 -1.27
$EndPAD
$PAD
Sh "9" C 1.5 1.5 0 0 0
Dr 0.8 0 0
At STD N 00E0FFFF
Ne 0 ""
Po -13.97 1.27
$EndPAD
$PAD
Sh "10" C 1.5 1.5 0 0 0
Dr 0.8 0 0
At STD N 00E0FFFF
Ne 0 ""
Po -13.97 -1.27
$EndPAD
$PAD
Sh "11" C 1.5 1.5 0 0 0
Dr 0.8 0 0
At STD N 00E0FFFF
Ne 0 ""
Po -11.43 1.27
$EndPAD
$PAD
Sh "12" C 1.5 1.5 0 0 0
Dr 0.8 0 0
At STD N 00E0FFFF
Ne 0 ""
Po -11.43 -1.27
$EndPAD
$PAD
Sh "13" C 1.5 1.5 0 0 0
Dr 0.8 0 0
At STD N 00E0FFFF
Ne 0 ""
Po -8.89 1.27
$EndPAD
$PAD
Sh "14" C 1.5 1.5 0 0 0
Dr 0.8 0 0
At STD N 00E0FFFF
Ne 0 ""
Po -8.89 -1.27
$EndPAD
$PAD
Sh "15" C 1.5 1.5 0 0 0
Dr 0.8 0 0
At STD N 00E0FFFF
Ne 0 ""
Po -6.35 1.27
$EndPAD
$PAD
Sh "16" C 1.5 1.5 0 0 0
Dr 0.8 0 0
At STD N 00E0FFFF
Ne 0 ""
Po -6.35 -1.27
$EndPAD
$PAD
Sh "17" C 1.5 1.5 0 0 0
Dr 0.8 0 0
At STD N 00E0FFFF
Ne 0 ""
Po -3.81 1.27
$EndPAD
$PAD
Sh "18" C 1.5 1.5 0 0 0
Dr 0.8 0 0
At STD N 00E0FFFF
Ne 0 ""
Po -3.81 -1.27
$EndPAD
$PAD
Sh "19" C 1.5 1.5 0 0 0
Dr 0.8 0 0
At STD N 00E0FFFF
Ne 0 ""
Po -1.27 1.27
$EndPAD
$PAD
Sh "20" C 1.5 1.5 0 0 0
Dr 0.8 0 0
At STD N 00E0FFFF
Ne 0 ""
Po -1.27 -1.27
$EndPAD
$PAD
Sh "21" C 1.5 1.5 0 0 0
Dr 0.8 0 0
At STD N 00E0FFFF
Ne 0 ""
Po 1.27 1.27
$EndPAD
$PAD
Sh "22" C 1.5 1.5 0 0 0
Dr 0.8 0 0
At STD N 00E0FFFF
Ne 0 ""
Po 1.27 -1.27
$EndPAD
$PAD
Sh "23" C 1.5 1.5 0 0 0
Dr 0.8 0 0
At STD N 00E0FFFF
Ne 0 ""
Po 3.81 1.27
$EndPAD
$PAD
Sh "24" C 1.5 1.5 0 0 0
Dr 0.8 0 0
At STD N 00E0FFFF
Ne 0 ""
Po 3.81 -1.27
$EndPAD
$PAD
Sh "25" C 1.5 1.5 0 0 0
Dr 0.8 0 0
At STD N 00E0FFFF
Ne 0 ""
Po 6.35 1.27
$EndPAD
$PAD
Sh "26" C 1.5 1.5 0 0 0
Dr 0.8 0 0
At STD N 00E0FFFF
Ne 0 ""
Po 6.35 -1.27
$EndPAD
$PAD
Sh "27" C 1.5 1.5 0 0 0
Dr 0.8 0 0
At STD N 00E0FFFF
Ne 0 ""
Po 8.89 1.27
$EndPAD
$PAD
Sh "28" C 1.5 1.5 0 0 0
Dr 0.8 0 0
At STD N 00E0FFFF
Ne 0 ""
Po 8.89 -1.27
$EndPAD
$PAD
Sh "29" C 1.5 1.5 0 0 0
Dr 0.8 0 0
At STD N 00E0FFFF
Ne 0 ""
Po 11.43 1.27
$EndPAD
$PAD
Sh "30" C 1.5 1.5 0 0 0
Dr 0.8 0 0
At STD N 00E0FFFF
Ne 0 ""
Po 11.43 -1.27
$EndPAD
$PAD
Sh "31" C 1.5 1.5 0 0 0
Dr 0.8 0 0
At STD N 00E0FFFF
Ne 0 ""
Po 13.97 1.27
$EndPAD
$PAD
Sh "32" C 1.5 1.5 0 0 0
Dr 0.8 0 0
At STD N 00E0FFFF
Ne 0 ""
Po 13.97 -1.27
$EndPAD
$PAD
Sh "33" C 1.5 1.5 0 0 0
Dr 0.8 0 0
At STD N 00E0FFFF
Ne 0 ""
Po 16.51 1.27
$EndPAD
$PAD
Sh "34" C 1.5 1.5 0 0 0
Dr 0.8 0 0
At STD N 00E0FFFF
Ne 0 ""
Po 16.51 -1.27
$EndPAD
$PAD
Sh "35" C 1.5 1.5 0 0 0
Dr 0.8 0 0
At STD N 00E0FFFF
Ne 0 ""
Po 19.05 1.27
$EndPAD
$PAD
Sh "36" C 1.5 1.5 0 0 0
Dr 0.8 0 0
At STD N 00E0FFFF
Ne 0 ""
Po 19.05 -1.27
$EndPAD
$PAD
Sh "37" C 1.5 1.5 0 0 0
Dr 0.8 0 0
At STD N 00E0FFFF
Ne 0 ""
Po 21.59 1.27
$EndPAD
$PAD
Sh "38" C 1.5 1.5 0 0 0
Dr 0.8 0 0
At STD N 00E0FFFF
Ne 0 ""
Po 21.59 -1.27
$EndPAD
$PAD
Sh "39" C 1.5 1.5 0 0 0
Dr 0.8 0 0
At STD N 00E0FFFF
Ne 0 ""
Po 24.13 1.27
$EndPAD
$PAD
Sh "40" C 1.5 1.5 0 0 0
Dr 0.8 0 0
At STD N 00E0FFFF
Ne 0 ""
Po 24.13 -1.27
$EndPAD
$EndMODULE ZL262-40DG
$MODULE ZL262-40DG-INV
Po 0 0 0 15 517F623A 00000000 ~~
Li ZL262-40DG-INV
Sc 0
AR 
Op 0 0 0
T0 0 -3.81 1 1 0 0.15 N V 21 N "ZL262-40DG-INV"
T1 0 3.81 1 1 0 0.15 N I 21 N "VAL**"
DS -25.4 2.5 25.4 2.5 0.15 21
DS 25.4 2.5 25.4 -2.5 0.15 21
DS 25.4 -2.5 -25.4 -2.5 0.15 21
DS -25.4 0 -22.86 0 0.15 21
DS -22.86 -2.54 -22.86 -0.04 0.15 21
DS -25.4 -2.5 -25.4 2.5 0.15 21
$PAD
Sh "1" R 1.5 1.5 0 0 0
Dr 0.8 0 0
At STD N 00E0FFFF
Ne 0 ""
Po -24.13 -1.27
$EndPAD
$PAD
Sh "2" C 1.5 1.5 0 0 0
Dr 0.8 0 0
At STD N 00E0FFFF
Ne 0 ""
Po -24.13 1.27
$EndPAD
$PAD
Sh "3" C 1.5 1.5 0 0 0
Dr 0.8 0 0
At STD N 00E0FFFF
Ne 0 ""
Po -21.59 -1.27
$EndPAD
$PAD
Sh "4" C 1.5 1.5 0 0 0
Dr 0.8 0 0
At STD N 00E0FFFF
Ne 0 ""
Po -21.59 1.27
$EndPAD
$PAD
Sh "5" C 1.5 1.5 0 0 0
Dr 0.8 0 0
At STD N 00E0FFFF
Ne 0 ""
Po -19.05 -1.27
$EndPAD
$PAD
Sh "6" C 1.5 1.5 0 0 0
Dr 0.8 0 0
At STD N 00E0FFFF
Ne 0 ""
Po -19.05 1.27
$EndPAD
$PAD
Sh "7" C 1.5 1.5 0 0 0
Dr 0.8 0 0
At STD N 00E0FFFF
Ne 0 ""
Po -16.51 -1.27
$EndPAD
$PAD
Sh "8" C 1.5 1.5 0 0 0
Dr 0.8 0 0
At STD N 00E0FFFF
Ne 0 ""
Po -16.51 1.27
$EndPAD
$PAD
Sh "9" C 1.5 1.5 0 0 0
Dr 0.8 0 0
At STD N 00E0FFFF
Ne 0 ""
Po -13.97 -1.27
$EndPAD
$PAD
Sh "10" C 1.5 1.5 0 0 0
Dr 0.8 0 0
At STD N 00E0FFFF
Ne 0 ""
Po -13.97 1.27
$EndPAD
$PAD
Sh "11" C 1.5 1.5 0 0 0
Dr 0.8 0 0
At STD N 00E0FFFF
Ne 0 ""
Po -11.43 -1.27
$EndPAD
$PAD
Sh "12" C 1.5 1.5 0 0 0
Dr 0.8 0 0
At STD N 00E0FFFF
Ne 0 ""
Po -11.43 1.27
$EndPAD
$PAD
Sh "13" C 1.5 1.5 0 0 0
Dr 0.8 0 0
At STD N 00E0FFFF
Ne 0 ""
Po -8.89 -1.27
$EndPAD
$PAD
Sh "14" C 1.5 1.5 0 0 0
Dr 0.8 0 0
At STD N 00E0FFFF
Ne 0 ""
Po -8.89 1.27
$EndPAD
$PAD
Sh "15" C 1.5 1.5 0 0 0
Dr 0.8 0 0
At STD N 00E0FFFF
Ne 0 ""
Po -6.35 -1.27
$EndPAD
$PAD
Sh "16" C 1.5 1.5 0 0 0
Dr 0.8 0 0
At STD N 00E0FFFF
Ne 0 ""
Po -6.35 1.27
$EndPAD
$PAD
Sh "17" C 1.5 1.5 0 0 0
Dr 0.8 0 0
At STD N 00E0FFFF
Ne 0 ""
Po -3.81 -1.27
$EndPAD
$PAD
Sh "18" C 1.5 1.5 0 0 0
Dr 0.8 0 0
At STD N 00E0FFFF
Ne 0 ""
Po -3.81 1.27
$EndPAD
$PAD
Sh "19" C 1.5 1.5 0 0 0
Dr 0.8 0 0
At STD N 00E0FFFF
Ne 0 ""
Po -1.27 -1.27
$EndPAD
$PAD
Sh "20" C 1.5 1.5 0 0 0
Dr 0.8 0 0
At STD N 00E0FFFF
Ne 0 ""
Po -1.27 1.27
$EndPAD
$PAD
Sh "21" C 1.5 1.5 0 0 0
Dr 0.8 0 0
At STD N 00E0FFFF
Ne 0 ""
Po 1.27 -1.27
$EndPAD
$PAD
Sh "22" C 1.5 1.5 0 0 0
Dr 0.8 0 0
At STD N 00E0FFFF
Ne 0 ""
Po 1.27 1.27
$EndPAD
$PAD
Sh "23" C 1.5 1.5 0 0 0
Dr 0.8 0 0
At STD N 00E0FFFF
Ne 0 ""
Po 3.81 -1.27
$EndPAD
$PAD
Sh "24" C 1.5 1.5 0 0 0
Dr 0.8 0 0
At STD N 00E0FFFF
Ne 0 ""
Po 3.81 1.27
$EndPAD
$PAD
Sh "25" C 1.5 1.5 0 0 0
Dr 0.8 0 0
At STD N 00E0FFFF
Ne 0 ""
Po 6.35 -1.27
$EndPAD
$PAD
Sh "26" C 1.5 1.5 0 0 0
Dr 0.8 0 0
At STD N 00E0FFFF
Ne 0 ""
Po 6.35 1.27
$EndPAD
$PAD
Sh "27" C 1.5 1.5 0 0 0
Dr 0.8 0 0
At STD N 00E0FFFF
Ne 0 ""
Po 8.89 -1.27
$EndPAD
$PAD
Sh "28" C 1.5 1.5 0 0 0
Dr 0.8 0 0
At STD N 00E0FFFF
Ne 0 ""
Po 8.89 1.27
$EndPAD
$PAD
Sh "29" C 1.5 1.5 0 0 0
Dr 0.8 0 0
At STD N 00E0FFFF
Ne 0 ""
Po 11.43 -1.27
$EndPAD
$PAD
Sh "30" C 1.5 1.5 0 0 0
Dr 0.8 0 0
At STD N 00E0FFFF
Ne 0 ""
Po 11.43 1.27
$EndPAD
$PAD
Sh "31" C 1.5 1.5 0 0 0
Dr 0.8 0 0
At STD N 00E0FFFF
Ne 0 ""
Po 13.97 -1.27
$EndPAD
$PAD
Sh "32" C 1.5 1.5 0 0 0
Dr 0.8 0 0
At STD N 00E0FFFF
Ne 0 ""
Po 13.97 1.27
$EndPAD
$PAD
Sh "33" C 1.5 1.5 0 0 0
Dr 0.8 0 0
At STD N 00E0FFFF
Ne 0 ""
Po 16.51 -1.27
$EndPAD
$PAD
Sh "34" C 1.5 1.5 0 0 0
Dr 0.8 0 0
At STD N 00E0FFFF
Ne 0 ""
Po 16.51 1.27
$EndPAD
$PAD
Sh "35" C 1.5 1.5 0 0 0
Dr 0.8 0 0
At STD N 00E0FFFF
Ne 0 ""
Po 19.05 -1.27
$EndPAD
$PAD
Sh "36" C 1.5 1.5 0 0 0
Dr 0.8 0 0
At STD N 00E0FFFF
Ne 0 ""
Po 19.05 1.27
$EndPAD
$PAD
Sh "37" C 1.5 1.5 0 0 0
Dr 0.8 0 0
At STD N 00E0FFFF
Ne 0 ""
Po 21.59 -1.27
$EndPAD
$PAD
Sh "38" C 1.5 1.5 0 0 0
Dr 0.8 0 0
At STD N 00E0FFFF
Ne 0 ""
Po 21.59 1.27
$EndPAD
$PAD
Sh "39" C 1.5 1.5 0 0 0
Dr 0.8 0 0
At STD N 00E0FFFF
Ne 0 ""
Po 24.13 -1.27
$EndPAD
$PAD
Sh "40" C 1.5 1.5 0 0 0
Dr 0.8 0 0
At STD N 00E0FFFF
Ne 0 ""
Po 24.13 1.27
$EndPAD
$EndMODULE ZL262-40DG-INV
$MODULE ZL262-50DG
Po 0 0 0 15 517F5E1D 00000000 ~~
Li ZL262-50DG
Sc 0
AR 
Op 0 0 0
T0 0 -3.81 1 1 0 0.15 N V 21 N "ZL262-50DG"
T1 0 3.81 1 1 0 0.15 N I 21 N "VAL**"
DS -31.75 2.5 31.75 2.5 0.15 21
DS 31.75 2.5 31.75 -2.5 0.15 21
DS 31.75 -2.5 -31.75 -2.5 0.15 21
DS -31.75 0 -29.21 0 0.15 21
DS -29.21 0 -29.21 2.5 0.15 21
DS -31.75 -2.5 -31.75 2.5 0.15 21
$PAD
Sh "1" R 1.5 1.5 0 0 0
Dr 0.8 0 0
At STD N 00E0FFFF
Ne 0 ""
Po -30.48 1.27
$EndPAD
$PAD
Sh "2" C 1.5 1.5 0 0 0
Dr 0.8 0 0
At STD N 00E0FFFF
Ne 0 ""
Po -30.48 -1.27
$EndPAD
$PAD
Sh "3" C 1.5 1.5 0 0 0
Dr 0.8 0 0
At STD N 00E0FFFF
Ne 0 ""
Po -27.94 1.27
$EndPAD
$PAD
Sh "4" C 1.5 1.5 0 0 0
Dr 0.8 0 0
At STD N 00E0FFFF
Ne 0 ""
Po -27.94 -1.27
$EndPAD
$PAD
Sh "5" C 1.5 1.5 0 0 0
Dr 0.8 0 0
At STD N 00E0FFFF
Ne 0 ""
Po -25.4 1.27
$EndPAD
$PAD
Sh "6" C 1.5 1.5 0 0 0
Dr 0.8 0 0
At STD N 00E0FFFF
Ne 0 ""
Po -25.4 -1.27
$EndPAD
$PAD
Sh "7" C 1.5 1.5 0 0 0
Dr 0.8 0 0
At STD N 00E0FFFF
Ne 0 ""
Po -22.86 1.27
$EndPAD
$PAD
Sh "8" C 1.5 1.5 0 0 0
Dr 0.8 0 0
At STD N 00E0FFFF
Ne 0 ""
Po -22.86 -1.27
$EndPAD
$PAD
Sh "9" C 1.5 1.5 0 0 0
Dr 0.8 0 0
At STD N 00E0FFFF
Ne 0 ""
Po -20.32 1.27
$EndPAD
$PAD
Sh "10" C 1.5 1.5 0 0 0
Dr 0.8 0 0
At STD N 00E0FFFF
Ne 0 ""
Po -20.32 -1.27
$EndPAD
$PAD
Sh "11" C 1.5 1.5 0 0 0
Dr 0.8 0 0
At STD N 00E0FFFF
Ne 0 ""
Po -17.78 1.27
$EndPAD
$PAD
Sh "12" C 1.5 1.5 0 0 0
Dr 0.8 0 0
At STD N 00E0FFFF
Ne 0 ""
Po -17.78 -1.27
$EndPAD
$PAD
Sh "13" C 1.5 1.5 0 0 0
Dr 0.8 0 0
At STD N 00E0FFFF
Ne 0 ""
Po -15.24 1.27
$EndPAD
$PAD
Sh "14" C 1.5 1.5 0 0 0
Dr 0.8 0 0
At STD N 00E0FFFF
Ne 0 ""
Po -15.24 -1.27
$EndPAD
$PAD
Sh "15" C 1.5 1.5 0 0 0
Dr 0.8 0 0
At STD N 00E0FFFF
Ne 0 ""
Po -12.7 1.27
$EndPAD
$PAD
Sh "16" C 1.5 1.5 0 0 0
Dr 0.8 0 0
At STD N 00E0FFFF
Ne 0 ""
Po -12.7 -1.27
$EndPAD
$PAD
Sh "17" C 1.5 1.5 0 0 0
Dr 0.8 0 0
At STD N 00E0FFFF
Ne 0 ""
Po -10.16 1.27
$EndPAD
$PAD
Sh "18" C 1.5 1.5 0 0 0
Dr 0.8 0 0
At STD N 00E0FFFF
Ne 0 ""
Po -10.16 -1.27
$EndPAD
$PAD
Sh "19" C 1.5 1.5 0 0 0
Dr 0.8 0 0
At STD N 00E0FFFF
Ne 0 ""
Po -7.62 1.27
$EndPAD
$PAD
Sh "20" C 1.5 1.5 0 0 0
Dr 0.8 0 0
At STD N 00E0FFFF
Ne 0 ""
Po -7.62 -1.27
$EndPAD
$PAD
Sh "21" C 1.5 1.5 0 0 0
Dr 0.8 0 0
At STD N 00E0FFFF
Ne 0 ""
Po -5.08 1.27
$EndPAD
$PAD
Sh "22" C 1.5 1.5 0 0 0
Dr 0.8 0 0
At STD N 00E0FFFF
Ne 0 ""
Po -5.08 -1.27
$EndPAD
$PAD
Sh "23" C 1.5 1.5 0 0 0
Dr 0.8 0 0
At STD N 00E0FFFF
Ne 0 ""
Po -2.54 1.27
$EndPAD
$PAD
Sh "24" C 1.5 1.5 0 0 0
Dr 0.8 0 0
At STD N 00E0FFFF
Ne 0 ""
Po -2.54 -1.27
$EndPAD
$PAD
Sh "25" C 1.5 1.5 0 0 0
Dr 0.8 0 0
At STD N 00E0FFFF
Ne 0 ""
Po 0 1.27
$EndPAD
$PAD
Sh "26" C 1.5 1.5 0 0 0
Dr 0.8 0 0
At STD N 00E0FFFF
Ne 0 ""
Po 0 -1.27
$EndPAD
$PAD
Sh "27" C 1.5 1.5 0 0 0
Dr 0.8 0 0
At STD N 00E0FFFF
Ne 0 ""
Po 2.54 1.27
$EndPAD
$PAD
Sh "28" C 1.5 1.5 0 0 0
Dr 0.8 0 0
At STD N 00E0FFFF
Ne 0 ""
Po 2.54 -1.27
$EndPAD
$PAD
Sh "29" C 1.5 1.5 0 0 0
Dr 0.8 0 0
At STD N 00E0FFFF
Ne 0 ""
Po 5.08 1.27
$EndPAD
$PAD
Sh "30" C 1.5 1.5 0 0 0
Dr 0.8 0 0
At STD N 00E0FFFF
Ne 0 ""
Po 5.08 -1.27
$EndPAD
$PAD
Sh "31" C 1.5 1.5 0 0 0
Dr 0.8 0 0
At STD N 00E0FFFF
Ne 0 ""
Po 7.62 1.27
$EndPAD
$PAD
Sh "32" C 1.5 1.5 0 0 0
Dr 0.8 0 0
At STD N 00E0FFFF
Ne 0 ""
Po 7.62 -1.27
$EndPAD
$PAD
Sh "33" C 1.5 1.5 0 0 0
Dr 0.8 0 0
At STD N 00E0FFFF
Ne 0 ""
Po 10.16 1.27
$EndPAD
$PAD
Sh "34" C 1.5 1.5 0 0 0
Dr 0.8 0 0
At STD N 00E0FFFF
Ne 0 ""
Po 10.16 -1.27
$EndPAD
$PAD
Sh "35" C 1.5 1.5 0 0 0
Dr 0.8 0 0
At STD N 00E0FFFF
Ne 0 ""
Po 12.7 1.27
$EndPAD
$PAD
Sh "36" C 1.5 1.5 0 0 0
Dr 0.8 0 0
At STD N 00E0FFFF
Ne 0 ""
Po 12.7 -1.27
$EndPAD
$PAD
Sh "37" C 1.5 1.5 0 0 0
Dr 0.8 0 0
At STD N 00E0FFFF
Ne 0 ""
Po 15.24 1.27
$EndPAD
$PAD
Sh "38" C 1.5 1.5 0 0 0
Dr 0.8 0 0
At STD N 00E0FFFF
Ne 0 ""
Po 15.24 -1.27
$EndPAD
$PAD
Sh "39" C 1.5 1.5 0 0 0
Dr 0.8 0 0
At STD N 00E0FFFF
Ne 0 ""
Po 17.78 1.27
$EndPAD
$PAD
Sh "40" C 1.5 1.5 0 0 0
Dr 0.8 0 0
At STD N 00E0FFFF
Ne 0 ""
Po 17.78 -1.27
$EndPAD
$PAD
Sh "41" C 1.5 1.5 0 0 0
Dr 0.8 0 0
At STD N 00E0FFFF
Ne 0 ""
Po 20.32 1.27
$EndPAD
$PAD
Sh "42" C 1.5 1.5 0 0 0
Dr 0.8 0 0
At STD N 00E0FFFF
Ne 0 ""
Po 20.32 -1.27
$EndPAD
$PAD
Sh "43" C 1.5 1.5 0 0 0
Dr 0.8 0 0
At STD N 00E0FFFF
Ne 0 ""
Po 22.86 1.27
$EndPAD
$PAD
Sh "44" C 1.5 1.5 0 0 0
Dr 0.8 0 0
At STD N 00E0FFFF
Ne 0 ""
Po 22.86 -1.27
$EndPAD
$PAD
Sh "45" C 1.5 1.5 0 0 0
Dr 0.8 0 0
At STD N 00E0FFFF
Ne 0 ""
Po 25.4 1.27
$EndPAD
$PAD
Sh "46" C 1.5 1.5 0 0 0
Dr 0.8 0 0
At STD N 00E0FFFF
Ne 0 ""
Po 25.4 -1.27
$EndPAD
$PAD
Sh "47" C 1.5 1.5 0 0 0
Dr 0.8 0 0
At STD N 00E0FFFF
Ne 0 ""
Po 27.94 1.27
$EndPAD
$PAD
Sh "48" C 1.5 1.5 0 0 0
Dr 0.8 0 0
At STD N 00E0FFFF
Ne 0 ""
Po 27.94 -1.27
$EndPAD
$PAD
Sh "49" C 1.5 1.5 0 0 0
Dr 0.8 0 0
At STD N 00E0FFFF
Ne 0 ""
Po 30.48 1.27
$EndPAD
$PAD
Sh "50" C 1.5 1.5 0 0 0
Dr 0.8 0 0
At STD N 00E0FFFF
Ne 0 ""
Po 30.48 -1.27
$EndPAD
$EndMODULE ZL262-50DG
$MODULE ZL262-50DG-INV
Po 0 0 0 15 517F627C 00000000 ~~
Li ZL262-50DG-INV
Sc 0
AR 
Op 0 0 0
T0 0 -3.81 1 1 0 0.15 N V 21 N "ZL262-50DG-INV"
T1 0 3.81 1 1 0 0.15 N I 21 N "VAL**"
DS -31.75 2.5 31.75 2.5 0.15 21
DS 31.75 2.5 31.75 -2.5 0.15 21
DS 31.75 -2.5 -31.75 -2.5 0.15 21
DS -31.75 0 -29.21 0 0.15 21
DS -29.21 -2.54 -29.21 -0.04 0.15 21
DS -31.75 -2.5 -31.75 2.5 0.15 21
$PAD
Sh "1" R 1.5 1.5 0 0 0
Dr 0.8 0 0
At STD N 00E0FFFF
Ne 0 ""
Po -30.48 -1.27
$EndPAD
$PAD
Sh "2" C 1.5 1.5 0 0 0
Dr 0.8 0 0
At STD N 00E0FFFF
Ne 0 ""
Po -30.48 1.27
$EndPAD
$PAD
Sh "3" C 1.5 1.5 0 0 0
Dr 0.8 0 0
At STD N 00E0FFFF
Ne 0 ""
Po -27.94 -1.27
$EndPAD
$PAD
Sh "4" C 1.5 1.5 0 0 0
Dr 0.8 0 0
At STD N 00E0FFFF
Ne 0 ""
Po -27.94 1.27
$EndPAD
$PAD
Sh "5" C 1.5 1.5 0 0 0
Dr 0.8 0 0
At STD N 00E0FFFF
Ne 0 ""
Po -25.4 -1.27
$EndPAD
$PAD
Sh "6" C 1.5 1.5 0 0 0
Dr 0.8 0 0
At STD N 00E0FFFF
Ne 0 ""
Po -25.4 1.27
$EndPAD
$PAD
Sh "7" C 1.5 1.5 0 0 0
Dr 0.8 0 0
At STD N 00E0FFFF
Ne 0 ""
Po -22.86 -1.27
$EndPAD
$PAD
Sh "8" C 1.5 1.5 0 0 0
Dr 0.8 0 0
At STD N 00E0FFFF
Ne 0 ""
Po -22.86 1.27
$EndPAD
$PAD
Sh "9" C 1.5 1.5 0 0 0
Dr 0.8 0 0
At STD N 00E0FFFF
Ne 0 ""
Po -20.32 -1.27
$EndPAD
$PAD
Sh "10" C 1.5 1.5 0 0 0
Dr 0.8 0 0
At STD N 00E0FFFF
Ne 0 ""
Po -20.32 1.27
$EndPAD
$PAD
Sh "11" C 1.5 1.5 0 0 0
Dr 0.8 0 0
At STD N 00E0FFFF
Ne 0 ""
Po -17.78 -1.27
$EndPAD
$PAD
Sh "12" C 1.5 1.5 0 0 0
Dr 0.8 0 0
At STD N 00E0FFFF
Ne 0 ""
Po -17.78 1.27
$EndPAD
$PAD
Sh "13" C 1.5 1.5 0 0 0
Dr 0.8 0 0
At STD N 00E0FFFF
Ne 0 ""
Po -15.24 -1.27
$EndPAD
$PAD
Sh "14" C 1.5 1.5 0 0 0
Dr 0.8 0 0
At STD N 00E0FFFF
Ne 0 ""
Po -15.24 1.27
$EndPAD
$PAD
Sh "15" C 1.5 1.5 0 0 0
Dr 0.8 0 0
At STD N 00E0FFFF
Ne 0 ""
Po -12.7 -1.27
$EndPAD
$PAD
Sh "16" C 1.5 1.5 0 0 0
Dr 0.8 0 0
At STD N 00E0FFFF
Ne 0 ""
Po -12.7 1.27
$EndPAD
$PAD
Sh "17" C 1.5 1.5 0 0 0
Dr 0.8 0 0
At STD N 00E0FFFF
Ne 0 ""
Po -10.16 -1.27
$EndPAD
$PAD
Sh "18" C 1.5 1.5 0 0 0
Dr 0.8 0 0
At STD N 00E0FFFF
Ne 0 ""
Po -10.16 1.27
$EndPAD
$PAD
Sh "19" C 1.5 1.5 0 0 0
Dr 0.8 0 0
At STD N 00E0FFFF
Ne 0 ""
Po -7.62 -1.27
$EndPAD
$PAD
Sh "20" C 1.5 1.5 0 0 0
Dr 0.8 0 0
At STD N 00E0FFFF
Ne 0 ""
Po -7.62 1.27
$EndPAD
$PAD
Sh "21" C 1.5 1.5 0 0 0
Dr 0.8 0 0
At STD N 00E0FFFF
Ne 0 ""
Po -5.08 -1.27
$EndPAD
$PAD
Sh "22" C 1.5 1.5 0 0 0
Dr 0.8 0 0
At STD N 00E0FFFF
Ne 0 ""
Po -5.08 1.27
$EndPAD
$PAD
Sh "23" C 1.5 1.5 0 0 0
Dr 0.8 0 0
At STD N 00E0FFFF
Ne 0 ""
Po -2.54 -1.27
$EndPAD
$PAD
Sh "24" C 1.5 1.5 0 0 0
Dr 0.8 0 0
At STD N 00E0FFFF
Ne 0 ""
Po -2.54 1.27
$EndPAD
$PAD
Sh "25" C 1.5 1.5 0 0 0
Dr 0.8 0 0
At STD N 00E0FFFF
Ne 0 ""
Po 0 -1.27
$EndPAD
$PAD
Sh "26" C 1.5 1.5 0 0 0
Dr 0.8 0 0
At STD N 00E0FFFF
Ne 0 ""
Po 0 1.27
$EndPAD
$PAD
Sh "27" C 1.5 1.5 0 0 0
Dr 0.8 0 0
At STD N 00E0FFFF
Ne 0 ""
Po 2.54 -1.27
$EndPAD
$PAD
Sh "28" C 1.5 1.5 0 0 0
Dr 0.8 0 0
At STD N 00E0FFFF
Ne 0 ""
Po 2.54 1.27
$EndPAD
$PAD
Sh "29" C 1.5 1.5 0 0 0
Dr 0.8 0 0
At STD N 00E0FFFF
Ne 0 ""
Po 5.08 -1.27
$EndPAD
$PAD
Sh "30" C 1.5 1.5 0 0 0
Dr 0.8 0 0
At STD N 00E0FFFF
Ne 0 ""
Po 5.08 1.27
$EndPAD
$PAD
Sh "31" C 1.5 1.5 0 0 0
Dr 0.8 0 0
At STD N 00E0FFFF
Ne 0 ""
Po 7.62 -1.27
$EndPAD
$PAD
Sh "32" C 1.5 1.5 0 0 0
Dr 0.8 0 0
At STD N 00E0FFFF
Ne 0 ""
Po 7.62 1.27
$EndPAD
$PAD
Sh "33" C 1.5 1.5 0 0 0
Dr 0.8 0 0
At STD N 00E0FFFF
Ne 0 ""
Po 10.16 -1.27
$EndPAD
$PAD
Sh "34" C 1.5 1.5 0 0 0
Dr 0.8 0 0
At STD N 00E0FFFF
Ne 0 ""
Po 10.16 1.27
$EndPAD
$PAD
Sh "35" C 1.5 1.5 0 0 0
Dr 0.8 0 0
At STD N 00E0FFFF
Ne 0 ""
Po 12.7 -1.27
$EndPAD
$PAD
Sh "36" C 1.5 1.5 0 0 0
Dr 0.8 0 0
At STD N 00E0FFFF
Ne 0 ""
Po 12.7 1.27
$EndPAD
$PAD
Sh "37" C 1.5 1.5 0 0 0
Dr 0.8 0 0
At STD N 00E0FFFF
Ne 0 ""
Po 15.24 -1.27
$EndPAD
$PAD
Sh "38" C 1.5 1.5 0 0 0
Dr 0.8 0 0
At STD N 00E0FFFF
Ne 0 ""
Po 15.24 1.27
$EndPAD
$PAD
Sh "39" C 1.5 1.5 0 0 0
Dr 0.8 0 0
At STD N 00E0FFFF
Ne 0 ""
Po 17.78 -1.27
$EndPAD
$PAD
Sh "40" C 1.5 1.5 0 0 0
Dr 0.8 0 0
At STD N 00E0FFFF
Ne 0 ""
Po 17.78 1.27
$EndPAD
$PAD
Sh "41" C 1.5 1.5 0 0 0
Dr 0.8 0 0
At STD N 00E0FFFF
Ne 0 ""
Po 20.32 -1.27
$EndPAD
$PAD
Sh "42" C 1.5 1.5 0 0 0
Dr 0.8 0 0
At STD N 00E0FFFF
Ne 0 ""
Po 20.32 1.27
$EndPAD
$PAD
Sh "43" C 1.5 1.5 0 0 0
Dr 0.8 0 0
At STD N 00E0FFFF
Ne 0 ""
Po 22.86 -1.27
$EndPAD
$PAD
Sh "44" C 1.5 1.5 0 0 0
Dr 0.8 0 0
At STD N 00E0FFFF
Ne 0 ""
Po 22.86 1.27
$EndPAD
$PAD
Sh "45" C 1.5 1.5 0 0 0
Dr 0.8 0 0
At STD N 00E0FFFF
Ne 0 ""
Po 25.4 -1.27
$EndPAD
$PAD
Sh "46" C 1.5 1.5 0 0 0
Dr 0.8 0 0
At STD N 00E0FFFF
Ne 0 ""
Po 25.4 1.27
$EndPAD
$PAD
Sh "47" C 1.5 1.5 0 0 0
Dr 0.8 0 0
At STD N 00E0FFFF
Ne 0 ""
Po 27.94 -1.27
$EndPAD
$PAD
Sh "48" C 1.5 1.5 0 0 0
Dr 0.8 0 0
At STD N 00E0FFFF
Ne 0 ""
Po 27.94 1.27
$EndPAD
$PAD
Sh "49" C 1.5 1.5 0 0 0
Dr 0.8 0 0
At STD N 00E0FFFF
Ne 0 ""
Po 30.48 -1.27
$EndPAD
$PAD
Sh "50" C 1.5 1.5 0 0 0
Dr 0.8 0 0
At STD N 00E0FFFF
Ne 0 ""
Po 30.48 1.27
$EndPAD
$EndMODULE ZL262-50DG-INV
$MODULE ZL262-80DG
Po 0 0 0 15 517F6111 00000000 ~~
Li ZL262-80DG
Sc 0
AR 
Op 0 0 0
T0 0 -3.81 1 1 0 0.15 N V 21 N "ZL262-80DG"
T1 0 3.81 1 1 0 0.15 N I 21 N "VAL**"
DS -50.8 2.5 50.8 2.5 0.15 21
DS 50.8 2.5 50.8 -2.5 0.15 21
DS 50.8 -2.5 -50.8 -2.5 0.15 21
DS -50.8 0 -48.26 0 0.15 21
DS -48.26 0 -48.26 2.5 0.15 21
DS -50.8 -2.5 -50.8 2.5 0.15 21
$PAD
Sh "1" R 1.5 1.5 0 0 0
Dr 0.8 0 0
At STD N 00E0FFFF
Ne 0 ""
Po -49.53 1.27
$EndPAD
$PAD
Sh "2" C 1.5 1.5 0 0 0
Dr 0.8 0 0
At STD N 00E0FFFF
Ne 0 ""
Po -49.53 -1.27
$EndPAD
$PAD
Sh "3" C 1.5 1.5 0 0 0
Dr 0.8 0 0
At STD N 00E0FFFF
Ne 0 ""
Po -46.99 1.27
$EndPAD
$PAD
Sh "4" C 1.5 1.5 0 0 0
Dr 0.8 0 0
At STD N 00E0FFFF
Ne 0 ""
Po -46.99 -1.27
$EndPAD
$PAD
Sh "5" C 1.5 1.5 0 0 0
Dr 0.8 0 0
At STD N 00E0FFFF
Ne 0 ""
Po -44.45 1.27
$EndPAD
$PAD
Sh "6" C 1.5 1.5 0 0 0
Dr 0.8 0 0
At STD N 00E0FFFF
Ne 0 ""
Po -44.45 -1.27
$EndPAD
$PAD
Sh "7" C 1.5 1.5 0 0 0
Dr 0.8 0 0
At STD N 00E0FFFF
Ne 0 ""
Po -41.91 1.27
$EndPAD
$PAD
Sh "8" C 1.5 1.5 0 0 0
Dr 0.8 0 0
At STD N 00E0FFFF
Ne 0 ""
Po -41.91 -1.27
$EndPAD
$PAD
Sh "9" C 1.5 1.5 0 0 0
Dr 0.8 0 0
At STD N 00E0FFFF
Ne 0 ""
Po -39.37 1.27
$EndPAD
$PAD
Sh "10" C 1.5 1.5 0 0 0
Dr 0.8 0 0
At STD N 00E0FFFF
Ne 0 ""
Po -39.37 -1.27
$EndPAD
$PAD
Sh "11" C 1.5 1.5 0 0 0
Dr 0.8 0 0
At STD N 00E0FFFF
Ne 0 ""
Po -36.83 1.27
$EndPAD
$PAD
Sh "12" C 1.5 1.5 0 0 0
Dr 0.8 0 0
At STD N 00E0FFFF
Ne 0 ""
Po -36.83 -1.27
$EndPAD
$PAD
Sh "13" C 1.5 1.5 0 0 0
Dr 0.8 0 0
At STD N 00E0FFFF
Ne 0 ""
Po -34.29 1.27
$EndPAD
$PAD
Sh "14" C 1.5 1.5 0 0 0
Dr 0.8 0 0
At STD N 00E0FFFF
Ne 0 ""
Po -34.29 -1.27
$EndPAD
$PAD
Sh "15" C 1.5 1.5 0 0 0
Dr 0.8 0 0
At STD N 00E0FFFF
Ne 0 ""
Po -31.75 1.27
$EndPAD
$PAD
Sh "16" C 1.5 1.5 0 0 0
Dr 0.8 0 0
At STD N 00E0FFFF
Ne 0 ""
Po -31.75 -1.27
$EndPAD
$PAD
Sh "17" C 1.5 1.5 0 0 0
Dr 0.8 0 0
At STD N 00E0FFFF
Ne 0 ""
Po -29.21 1.27
$EndPAD
$PAD
Sh "18" C 1.5 1.5 0 0 0
Dr 0.8 0 0
At STD N 00E0FFFF
Ne 0 ""
Po -29.21 -1.27
$EndPAD
$PAD
Sh "19" C 1.5 1.5 0 0 0
Dr 0.8 0 0
At STD N 00E0FFFF
Ne 0 ""
Po -26.67 1.27
$EndPAD
$PAD
Sh "20" C 1.5 1.5 0 0 0
Dr 0.8 0 0
At STD N 00E0FFFF
Ne 0 ""
Po -26.67 -1.27
$EndPAD
$PAD
Sh "21" C 1.5 1.5 0 0 0
Dr 0.8 0 0
At STD N 00E0FFFF
Ne 0 ""
Po -24.13 1.27
$EndPAD
$PAD
Sh "22" C 1.5 1.5 0 0 0
Dr 0.8 0 0
At STD N 00E0FFFF
Ne 0 ""
Po -24.13 -1.27
$EndPAD
$PAD
Sh "23" C 1.5 1.5 0 0 0
Dr 0.8 0 0
At STD N 00E0FFFF
Ne 0 ""
Po -21.59 1.27
$EndPAD
$PAD
Sh "24" C 1.5 1.5 0 0 0
Dr 0.8 0 0
At STD N 00E0FFFF
Ne 0 ""
Po -21.59 -1.27
$EndPAD
$PAD
Sh "25" C 1.5 1.5 0 0 0
Dr 0.8 0 0
At STD N 00E0FFFF
Ne 0 ""
Po -19.05 1.27
$EndPAD
$PAD
Sh "26" C 1.5 1.5 0 0 0
Dr 0.8 0 0
At STD N 00E0FFFF
Ne 0 ""
Po -19.05 -1.27
$EndPAD
$PAD
Sh "27" C 1.5 1.5 0 0 0
Dr 0.8 0 0
At STD N 00E0FFFF
Ne 0 ""
Po -16.51 1.27
$EndPAD
$PAD
Sh "28" C 1.5 1.5 0 0 0
Dr 0.8 0 0
At STD N 00E0FFFF
Ne 0 ""
Po -16.51 -1.27
$EndPAD
$PAD
Sh "29" C 1.5 1.5 0 0 0
Dr 0.8 0 0
At STD N 00E0FFFF
Ne 0 ""
Po -13.97 1.27
$EndPAD
$PAD
Sh "30" C 1.5 1.5 0 0 0
Dr 0.8 0 0
At STD N 00E0FFFF
Ne 0 ""
Po -13.97 -1.27
$EndPAD
$PAD
Sh "31" C 1.5 1.5 0 0 0
Dr 0.8 0 0
At STD N 00E0FFFF
Ne 0 ""
Po -11.43 1.27
$EndPAD
$PAD
Sh "32" C 1.5 1.5 0 0 0
Dr 0.8 0 0
At STD N 00E0FFFF
Ne 0 ""
Po -11.43 -1.27
$EndPAD
$PAD
Sh "33" C 1.5 1.5 0 0 0
Dr 0.8 0 0
At STD N 00E0FFFF
Ne 0 ""
Po -8.89 1.27
$EndPAD
$PAD
Sh "34" C 1.5 1.5 0 0 0
Dr 0.8 0 0
At STD N 00E0FFFF
Ne 0 ""
Po -8.89 -1.27
$EndPAD
$PAD
Sh "35" C 1.5 1.5 0 0 0
Dr 0.8 0 0
At STD N 00E0FFFF
Ne 0 ""
Po -6.35 1.27
$EndPAD
$PAD
Sh "36" C 1.5 1.5 0 0 0
Dr 0.8 0 0
At STD N 00E0FFFF
Ne 0 ""
Po -6.35 -1.27
$EndPAD
$PAD
Sh "37" C 1.5 1.5 0 0 0
Dr 0.8 0 0
At STD N 00E0FFFF
Ne 0 ""
Po -3.81 1.27
$EndPAD
$PAD
Sh "38" C 1.5 1.5 0 0 0
Dr 0.8 0 0
At STD N 00E0FFFF
Ne 0 ""
Po -3.81 -1.27
$EndPAD
$PAD
Sh "39" C 1.5 1.5 0 0 0
Dr 0.8 0 0
At STD N 00E0FFFF
Ne 0 ""
Po -1.27 1.27
$EndPAD
$PAD
Sh "40" C 1.5 1.5 0 0 0
Dr 0.8 0 0
At STD N 00E0FFFF
Ne 0 ""
Po -1.27 -1.27
$EndPAD
$PAD
Sh "41" C 1.5 1.5 0 0 0
Dr 0.8 0 0
At STD N 00E0FFFF
Ne 0 ""
Po 1.27 1.27
$EndPAD
$PAD
Sh "42" C 1.5 1.5 0 0 0
Dr 0.8 0 0
At STD N 00E0FFFF
Ne 0 ""
Po 1.27 -1.27
$EndPAD
$PAD
Sh "43" C 1.5 1.5 0 0 0
Dr 0.8 0 0
At STD N 00E0FFFF
Ne 0 ""
Po 3.81 1.27
$EndPAD
$PAD
Sh "44" C 1.5 1.5 0 0 0
Dr 0.8 0 0
At STD N 00E0FFFF
Ne 0 ""
Po 3.81 -1.27
$EndPAD
$PAD
Sh "45" C 1.5 1.5 0 0 0
Dr 0.8 0 0
At STD N 00E0FFFF
Ne 0 ""
Po 6.35 1.27
$EndPAD
$PAD
Sh "46" C 1.5 1.5 0 0 0
Dr 0.8 0 0
At STD N 00E0FFFF
Ne 0 ""
Po 6.35 -1.27
$EndPAD
$PAD
Sh "47" C 1.5 1.5 0 0 0
Dr 0.8 0 0
At STD N 00E0FFFF
Ne 0 ""
Po 8.89 1.27
$EndPAD
$PAD
Sh "48" C 1.5 1.5 0 0 0
Dr 0.8 0 0
At STD N 00E0FFFF
Ne 0 ""
Po 8.89 -1.27
$EndPAD
$PAD
Sh "49" C 1.5 1.5 0 0 0
Dr 0.8 0 0
At STD N 00E0FFFF
Ne 0 ""
Po 11.43 1.27
$EndPAD
$PAD
Sh "50" C 1.5 1.5 0 0 0
Dr 0.8 0 0
At STD N 00E0FFFF
Ne 0 ""
Po 11.43 -1.27
$EndPAD
$PAD
Sh "51" C 1.5 1.5 0 0 0
Dr 0.8 0 0
At STD N 00E0FFFF
Ne 0 ""
Po 13.97 1.27
$EndPAD
$PAD
Sh "52" C 1.5 1.5 0 0 0
Dr 0.8 0 0
At STD N 00E0FFFF
Ne 0 ""
Po 13.97 -1.27
$EndPAD
$PAD
Sh "53" C 1.5 1.5 0 0 0
Dr 0.8 0 0
At STD N 00E0FFFF
Ne 0 ""
Po 16.51 1.27
$EndPAD
$PAD
Sh "54" C 1.5 1.5 0 0 0
Dr 0.8 0 0
At STD N 00E0FFFF
Ne 0 ""
Po 16.51 -1.27
$EndPAD
$PAD
Sh "55" C 1.5 1.5 0 0 0
Dr 0.8 0 0
At STD N 00E0FFFF
Ne 0 ""
Po 19.05 1.27
$EndPAD
$PAD
Sh "56" C 1.5 1.5 0 0 0
Dr 0.8 0 0
At STD N 00E0FFFF
Ne 0 ""
Po 19.05 -1.27
$EndPAD
$PAD
Sh "57" C 1.5 1.5 0 0 0
Dr 0.8 0 0
At STD N 00E0FFFF
Ne 0 ""
Po 21.59 1.27
$EndPAD
$PAD
Sh "58" C 1.5 1.5 0 0 0
Dr 0.8 0 0
At STD N 00E0FFFF
Ne 0 ""
Po 21.59 -1.27
$EndPAD
$PAD
Sh "59" C 1.5 1.5 0 0 0
Dr 0.8 0 0
At STD N 00E0FFFF
Ne 0 ""
Po 24.13 1.27
$EndPAD
$PAD
Sh "60" C 1.5 1.5 0 0 0
Dr 0.8 0 0
At STD N 00E0FFFF
Ne 0 ""
Po 24.13 -1.27
$EndPAD
$PAD
Sh "61" C 1.5 1.5 0 0 0
Dr 0.8 0 0
At STD N 00E0FFFF
Ne 0 ""
Po 26.67 1.27
$EndPAD
$PAD
Sh "62" C 1.5 1.5 0 0 0
Dr 0.8 0 0
At STD N 00E0FFFF
Ne 0 ""
Po 26.67 -1.27
$EndPAD
$PAD
Sh "63" C 1.5 1.5 0 0 0
Dr 0.8 0 0
At STD N 00E0FFFF
Ne 0 ""
Po 29.21 1.27
$EndPAD
$PAD
Sh "64" C 1.5 1.5 0 0 0
Dr 0.8 0 0
At STD N 00E0FFFF
Ne 0 ""
Po 29.21 -1.27
$EndPAD
$PAD
Sh "65" C 1.5 1.5 0 0 0
Dr 0.8 0 0
At STD N 00E0FFFF
Ne 0 ""
Po 31.75 1.27
$EndPAD
$PAD
Sh "66" C 1.5 1.5 0 0 0
Dr 0.8 0 0
At STD N 00E0FFFF
Ne 0 ""
Po 31.75 -1.27
$EndPAD
$PAD
Sh "67" C 1.5 1.5 0 0 0
Dr 0.8 0 0
At STD N 00E0FFFF
Ne 0 ""
Po 34.29 1.27
$EndPAD
$PAD
Sh "68" C 1.5 1.5 0 0 0
Dr 0.8 0 0
At STD N 00E0FFFF
Ne 0 ""
Po 34.29 -1.27
$EndPAD
$PAD
Sh "69" C 1.5 1.5 0 0 0
Dr 0.8 0 0
At STD N 00E0FFFF
Ne 0 ""
Po 36.83 1.27
$EndPAD
$PAD
Sh "70" C 1.5 1.5 0 0 0
Dr 0.8 0 0
At STD N 00E0FFFF
Ne 0 ""
Po 36.83 -1.27
$EndPAD
$PAD
Sh "71" C 1.5 1.5 0 0 0
Dr 0.8 0 0
At STD N 00E0FFFF
Ne 0 ""
Po 39.37 1.27
$EndPAD
$PAD
Sh "72" C 1.5 1.5 0 0 0
Dr 0.8 0 0
At STD N 00E0FFFF
Ne 0 ""
Po 39.37 -1.27
$EndPAD
$PAD
Sh "73" C 1.5 1.5 0 0 0
Dr 0.8 0 0
At STD N 00E0FFFF
Ne 0 ""
Po 41.91 1.27
$EndPAD
$PAD
Sh "74" C 1.5 1.5 0 0 0
Dr 0.8 0 0
At STD N 00E0FFFF
Ne 0 ""
Po 41.91 -1.27
$EndPAD
$PAD
Sh "75" C 1.5 1.5 0 0 0
Dr 0.8 0 0
At STD N 00E0FFFF
Ne 0 ""
Po 44.45 1.27
$EndPAD
$PAD
Sh "76" C 1.5 1.5 0 0 0
Dr 0.8 0 0
At STD N 00E0FFFF
Ne 0 ""
Po 44.45 -1.27
$EndPAD
$PAD
Sh "77" C 1.5 1.5 0 0 0
Dr 0.8 0 0
At STD N 00E0FFFF
Ne 0 ""
Po 46.99 1.27
$EndPAD
$PAD
Sh "78" C 1.5 1.5 0 0 0
Dr 0.8 0 0
At STD N 00E0FFFF
Ne 0 ""
Po 46.99 -1.27
$EndPAD
$PAD
Sh "79" C 1.5 1.5 0 0 0
Dr 0.8 0 0
At STD N 00E0FFFF
Ne 0 ""
Po 49.53 1.27
$EndPAD
$PAD
Sh "80" C 1.5 1.5 0 0 0
Dr 0.8 0 0
At STD N 00E0FFFF
Ne 0 ""
Po 49.53 -1.27
$EndPAD
$EndMODULE ZL262-80DG
$MODULE ZL262-80DG-INV
Po 0 0 0 15 517F6147 00000000 ~~
Li ZL262-80DG-INV
Sc 0
AR 
Op 0 0 0
T0 0 -3.81 1 1 0 0.15 N V 21 N "ZL262-80DG-INV"
T1 0 3.81 1 1 0 0.15 N I 21 N "VAL**"
DS -50.8 2.5 50.8 2.5 0.15 21
DS 50.8 2.5 50.8 -2.5 0.15 21
DS 50.8 -2.5 -50.8 -2.5 0.15 21
DS -50.8 0 -48.26 0 0.15 21
DS -48.26 -2.54 -48.26 -0.04 0.15 21
DS -50.8 -2.5 -50.8 2.5 0.15 21
$PAD
Sh "1" R 1.5 1.5 0 0 0
Dr 0.8 0 0
At STD N 00E0FFFF
Ne 0 ""
Po -49.53 -1.27
$EndPAD
$PAD
Sh "2" C 1.5 1.5 0 0 0
Dr 0.8 0 0
At STD N 00E0FFFF
Ne 0 ""
Po -49.53 1.27
$EndPAD
$PAD
Sh "3" C 1.5 1.5 0 0 0
Dr 0.8 0 0
At STD N 00E0FFFF
Ne 0 ""
Po -46.99 -1.27
$EndPAD
$PAD
Sh "4" C 1.5 1.5 0 0 0
Dr 0.8 0 0
At STD N 00E0FFFF
Ne 0 ""
Po -46.99 1.27
$EndPAD
$PAD
Sh "5" C 1.5 1.5 0 0 0
Dr 0.8 0 0
At STD N 00E0FFFF
Ne 0 ""
Po -44.45 -1.27
$EndPAD
$PAD
Sh "6" C 1.5 1.5 0 0 0
Dr 0.8 0 0
At STD N 00E0FFFF
Ne 0 ""
Po -44.45 1.27
$EndPAD
$PAD
Sh "7" C 1.5 1.5 0 0 0
Dr 0.8 0 0
At STD N 00E0FFFF
Ne 0 ""
Po -41.91 -1.27
$EndPAD
$PAD
Sh "8" C 1.5 1.5 0 0 0
Dr 0.8 0 0
At STD N 00E0FFFF
Ne 0 ""
Po -41.91 1.27
$EndPAD
$PAD
Sh "9" C 1.5 1.5 0 0 0
Dr 0.8 0 0
At STD N 00E0FFFF
Ne 0 ""
Po -39.37 -1.27
$EndPAD
$PAD
Sh "10" C 1.5 1.5 0 0 0
Dr 0.8 0 0
At STD N 00E0FFFF
Ne 0 ""
Po -39.37 1.27
$EndPAD
$PAD
Sh "11" C 1.5 1.5 0 0 0
Dr 0.8 0 0
At STD N 00E0FFFF
Ne 0 ""
Po -36.83 -1.27
$EndPAD
$PAD
Sh "12" C 1.5 1.5 0 0 0
Dr 0.8 0 0
At STD N 00E0FFFF
Ne 0 ""
Po -36.83 1.27
$EndPAD
$PAD
Sh "13" C 1.5 1.5 0 0 0
Dr 0.8 0 0
At STD N 00E0FFFF
Ne 0 ""
Po -34.29 -1.27
$EndPAD
$PAD
Sh "14" C 1.5 1.5 0 0 0
Dr 0.8 0 0
At STD N 00E0FFFF
Ne 0 ""
Po -34.29 1.27
$EndPAD
$PAD
Sh "15" C 1.5 1.5 0 0 0
Dr 0.8 0 0
At STD N 00E0FFFF
Ne 0 ""
Po -31.75 -1.27
$EndPAD
$PAD
Sh "16" C 1.5 1.5 0 0 0
Dr 0.8 0 0
At STD N 00E0FFFF
Ne 0 ""
Po -31.75 1.27
$EndPAD
$PAD
Sh "17" C 1.5 1.5 0 0 0
Dr 0.8 0 0
At STD N 00E0FFFF
Ne 0 ""
Po -29.21 -1.27
$EndPAD
$PAD
Sh "18" C 1.5 1.5 0 0 0
Dr 0.8 0 0
At STD N 00E0FFFF
Ne 0 ""
Po -29.21 1.27
$EndPAD
$PAD
Sh "19" C 1.5 1.5 0 0 0
Dr 0.8 0 0
At STD N 00E0FFFF
Ne 0 ""
Po -26.67 -1.27
$EndPAD
$PAD
Sh "20" C 1.5 1.5 0 0 0
Dr 0.8 0 0
At STD N 00E0FFFF
Ne 0 ""
Po -26.67 1.27
$EndPAD
$PAD
Sh "21" C 1.5 1.5 0 0 0
Dr 0.8 0 0
At STD N 00E0FFFF
Ne 0 ""
Po -24.13 -1.27
$EndPAD
$PAD
Sh "22" C 1.5 1.5 0 0 0
Dr 0.8 0 0
At STD N 00E0FFFF
Ne 0 ""
Po -24.13 1.27
$EndPAD
$PAD
Sh "23" C 1.5 1.5 0 0 0
Dr 0.8 0 0
At STD N 00E0FFFF
Ne 0 ""
Po -21.59 -1.27
$EndPAD
$PAD
Sh "24" C 1.5 1.5 0 0 0
Dr 0.8 0 0
At STD N 00E0FFFF
Ne 0 ""
Po -21.59 1.27
$EndPAD
$PAD
Sh "25" C 1.5 1.5 0 0 0
Dr 0.8 0 0
At STD N 00E0FFFF
Ne 0 ""
Po -19.05 -1.27
$EndPAD
$PAD
Sh "26" C 1.5 1.5 0 0 0
Dr 0.8 0 0
At STD N 00E0FFFF
Ne 0 ""
Po -19.05 1.27
$EndPAD
$PAD
Sh "27" C 1.5 1.5 0 0 0
Dr 0.8 0 0
At STD N 00E0FFFF
Ne 0 ""
Po -16.51 -1.27
$EndPAD
$PAD
Sh "28" C 1.5 1.5 0 0 0
Dr 0.8 0 0
At STD N 00E0FFFF
Ne 0 ""
Po -16.51 1.27
$EndPAD
$PAD
Sh "29" C 1.5 1.5 0 0 0
Dr 0.8 0 0
At STD N 00E0FFFF
Ne 0 ""
Po -13.97 -1.27
$EndPAD
$PAD
Sh "30" C 1.5 1.5 0 0 0
Dr 0.8 0 0
At STD N 00E0FFFF
Ne 0 ""
Po -13.97 1.27
$EndPAD
$PAD
Sh "31" C 1.5 1.5 0 0 0
Dr 0.8 0 0
At STD N 00E0FFFF
Ne 0 ""
Po -11.43 -1.27
$EndPAD
$PAD
Sh "32" C 1.5 1.5 0 0 0
Dr 0.8 0 0
At STD N 00E0FFFF
Ne 0 ""
Po -11.43 1.27
$EndPAD
$PAD
Sh "33" C 1.5 1.5 0 0 0
Dr 0.8 0 0
At STD N 00E0FFFF
Ne 0 ""
Po -8.89 -1.27
$EndPAD
$PAD
Sh "34" C 1.5 1.5 0 0 0
Dr 0.8 0 0
At STD N 00E0FFFF
Ne 0 ""
Po -8.89 1.27
$EndPAD
$PAD
Sh "35" C 1.5 1.5 0 0 0
Dr 0.8 0 0
At STD N 00E0FFFF
Ne 0 ""
Po -6.35 -1.27
$EndPAD
$PAD
Sh "36" C 1.5 1.5 0 0 0
Dr 0.8 0 0
At STD N 00E0FFFF
Ne 0 ""
Po -6.35 1.27
$EndPAD
$PAD
Sh "37" C 1.5 1.5 0 0 0
Dr 0.8 0 0
At STD N 00E0FFFF
Ne 0 ""
Po -3.81 -1.27
$EndPAD
$PAD
Sh "38" C 1.5 1.5 0 0 0
Dr 0.8 0 0
At STD N 00E0FFFF
Ne 0 ""
Po -3.81 1.27
$EndPAD
$PAD
Sh "39" C 1.5 1.5 0 0 0
Dr 0.8 0 0
At STD N 00E0FFFF
Ne 0 ""
Po -1.27 -1.27
$EndPAD
$PAD
Sh "40" C 1.5 1.5 0 0 0
Dr 0.8 0 0
At STD N 00E0FFFF
Ne 0 ""
Po -1.27 1.27
$EndPAD
$PAD
Sh "41" C 1.5 1.5 0 0 0
Dr 0.8 0 0
At STD N 00E0FFFF
Ne 0 ""
Po 1.27 -1.27
$EndPAD
$PAD
Sh "42" C 1.5 1.5 0 0 0
Dr 0.8 0 0
At STD N 00E0FFFF
Ne 0 ""
Po 1.27 1.27
$EndPAD
$PAD
Sh "43" C 1.5 1.5 0 0 0
Dr 0.8 0 0
At STD N 00E0FFFF
Ne 0 ""
Po 3.81 -1.27
$EndPAD
$PAD
Sh "44" C 1.5 1.5 0 0 0
Dr 0.8 0 0
At STD N 00E0FFFF
Ne 0 ""
Po 3.81 1.27
$EndPAD
$PAD
Sh "45" C 1.5 1.5 0 0 0
Dr 0.8 0 0
At STD N 00E0FFFF
Ne 0 ""
Po 6.35 -1.27
$EndPAD
$PAD
Sh "46" C 1.5 1.5 0 0 0
Dr 0.8 0 0
At STD N 00E0FFFF
Ne 0 ""
Po 6.35 1.27
$EndPAD
$PAD
Sh "47" C 1.5 1.5 0 0 0
Dr 0.8 0 0
At STD N 00E0FFFF
Ne 0 ""
Po 8.89 -1.27
$EndPAD
$PAD
Sh "48" C 1.5 1.5 0 0 0
Dr 0.8 0 0
At STD N 00E0FFFF
Ne 0 ""
Po 8.89 1.27
$EndPAD
$PAD
Sh "49" C 1.5 1.5 0 0 0
Dr 0.8 0 0
At STD N 00E0FFFF
Ne 0 ""
Po 11.43 -1.27
$EndPAD
$PAD
Sh "50" C 1.5 1.5 0 0 0
Dr 0.8 0 0
At STD N 00E0FFFF
Ne 0 ""
Po 11.43 1.27
$EndPAD
$PAD
Sh "51" C 1.5 1.5 0 0 0
Dr 0.8 0 0
At STD N 00E0FFFF
Ne 0 ""
Po 13.97 -1.27
$EndPAD
$PAD
Sh "52" C 1.5 1.5 0 0 0
Dr 0.8 0 0
At STD N 00E0FFFF
Ne 0 ""
Po 13.97 1.27
$EndPAD
$PAD
Sh "53" C 1.5 1.5 0 0 0
Dr 0.8 0 0
At STD N 00E0FFFF
Ne 0 ""
Po 16.51 -1.27
$EndPAD
$PAD
Sh "54" C 1.5 1.5 0 0 0
Dr 0.8 0 0
At STD N 00E0FFFF
Ne 0 ""
Po 16.51 1.27
$EndPAD
$PAD
Sh "55" C 1.5 1.5 0 0 0
Dr 0.8 0 0
At STD N 00E0FFFF
Ne 0 ""
Po 19.05 -1.27
$EndPAD
$PAD
Sh "56" C 1.5 1.5 0 0 0
Dr 0.8 0 0
At STD N 00E0FFFF
Ne 0 ""
Po 19.05 1.27
$EndPAD
$PAD
Sh "57" C 1.5 1.5 0 0 0
Dr 0.8 0 0
At STD N 00E0FFFF
Ne 0 ""
Po 21.59 -1.27
$EndPAD
$PAD
Sh "58" C 1.5 1.5 0 0 0
Dr 0.8 0 0
At STD N 00E0FFFF
Ne 0 ""
Po 21.59 1.27
$EndPAD
$PAD
Sh "59" C 1.5 1.5 0 0 0
Dr 0.8 0 0
At STD N 00E0FFFF
Ne 0 ""
Po 24.13 -1.27
$EndPAD
$PAD
Sh "60" C 1.5 1.5 0 0 0
Dr 0.8 0 0
At STD N 00E0FFFF
Ne 0 ""
Po 24.13 1.27
$EndPAD
$PAD
Sh "61" C 1.5 1.5 0 0 0
Dr 0.8 0 0
At STD N 00E0FFFF
Ne 0 ""
Po 26.67 -1.27
$EndPAD
$PAD
Sh "62" C 1.5 1.5 0 0 0
Dr 0.8 0 0
At STD N 00E0FFFF
Ne 0 ""
Po 26.67 1.27
$EndPAD
$PAD
Sh "63" C 1.5 1.5 0 0 0
Dr 0.8 0 0
At STD N 00E0FFFF
Ne 0 ""
Po 29.21 -1.27
$EndPAD
$PAD
Sh "64" C 1.5 1.5 0 0 0
Dr 0.8 0 0
At STD N 00E0FFFF
Ne 0 ""
Po 29.21 1.27
$EndPAD
$PAD
Sh "65" C 1.5 1.5 0 0 0
Dr 0.8 0 0
At STD N 00E0FFFF
Ne 0 ""
Po 31.75 -1.27
$EndPAD
$PAD
Sh "66" C 1.5 1.5 0 0 0
Dr 0.8 0 0
At STD N 00E0FFFF
Ne 0 ""
Po 31.75 1.27
$EndPAD
$PAD
Sh "67" C 1.5 1.5 0 0 0
Dr 0.8 0 0
At STD N 00E0FFFF
Ne 0 ""
Po 34.29 -1.27
$EndPAD
$PAD
Sh "68" C 1.5 1.5 0 0 0
Dr 0.8 0 0
At STD N 00E0FFFF
Ne 0 ""
Po 34.29 1.27
$EndPAD
$PAD
Sh "69" C 1.5 1.5 0 0 0
Dr 0.8 0 0
At STD N 00E0FFFF
Ne 0 ""
Po 36.83 -1.27
$EndPAD
$PAD
Sh "70" C 1.5 1.5 0 0 0
Dr 0.8 0 0
At STD N 00E0FFFF
Ne 0 ""
Po 36.83 1.27
$EndPAD
$PAD
Sh "71" C 1.5 1.5 0 0 0
Dr 0.8 0 0
At STD N 00E0FFFF
Ne 0 ""
Po 39.37 -1.27
$EndPAD
$PAD
Sh "72" C 1.5 1.5 0 0 0
Dr 0.8 0 0
At STD N 00E0FFFF
Ne 0 ""
Po 39.37 1.27
$EndPAD
$PAD
Sh "73" C 1.5 1.5 0 0 0
Dr 0.8 0 0
At STD N 00E0FFFF
Ne 0 ""
Po 41.91 -1.27
$EndPAD
$PAD
Sh "74" C 1.5 1.5 0 0 0
Dr 0.8 0 0
At STD N 00E0FFFF
Ne 0 ""
Po 41.91 1.27
$EndPAD
$PAD
Sh "75" C 1.5 1.5 0 0 0
Dr 0.8 0 0
At STD N 00E0FFFF
Ne 0 ""
Po 44.45 -1.27
$EndPAD
$PAD
Sh "76" C 1.5 1.5 0 0 0
Dr 0.8 0 0
At STD N 00E0FFFF
Ne 0 ""
Po 44.45 1.27
$EndPAD
$PAD
Sh "77" C 1.5 1.5 0 0 0
Dr 0.8 0 0
At STD N 00E0FFFF
Ne 0 ""
Po 46.99 -1.27
$EndPAD
$PAD
Sh "78" C 1.5 1.5 0 0 0
Dr 0.8 0 0
At STD N 00E0FFFF
Ne 0 ""
Po 46.99 1.27
$EndPAD
$PAD
Sh "79" C 1.5 1.5 0 0 0
Dr 0.8 0 0
At STD N 00E0FFFF
Ne 0 ""
Po 49.53 -1.27
$EndPAD
$PAD
Sh "80" C 1.5 1.5 0 0 0
Dr 0.8 0 0
At STD N 00E0FFFF
Ne 0 ""
Po 49.53 1.27
$EndPAD
$EndMODULE ZL262-80DG-INV
$EndLIBRARY
