PCBNEW-LibModule-V1  lun 22 ago 2011 21:38:48 CEST
# encoding utf-8
$INDEX
TQFP-144
$EndINDEX
$INDEX
LQFP-32
LQFP-44
LQFP-48
LQFP-52
LQFP-64
LQFP-128
TQFP-100
$EndINDEX
$MODULE LQFP-44
Po 0 0 0 15 49EA1F98 00000000 ~~
Li lqfp44
Cd LQFP-44
Sc 00000000
AR
Op 0 0 0
T0 0 450 295 295 0 59 N V 21 N"LQFP-44"
T1 0 -450 295 295 0 59 N V 21 N"U***"
DS 1770 1970 -1770 1970 50 21
DS 1970 1770 1970 -1770 50 21
DS -1770 -1970 1770 -1970 50 21
DS -1970 1770 -1970 -1770 50 21
DC -1570 1570 -1660 1690 50 21
DS -1770 1970 -1970 1770 50 21
DS 1970 1770 1770 1970 50 21
DS 1770 -1970 1970 -1770 50 21
DS -1970 -1770 -1770 -1970 50 21
$PAD
Sh "4" R 217 512 0 0 0
Dr 0 0 0
At SMD N 00888000
Ne 0 ""
Po -630 2264
$EndPAD
$PAD
Sh "5" R 217 512 0 0 0
Dr 0 0 0
At SMD N 00888000
Ne 0 ""
Po -315 2264
$EndPAD
$PAD
Sh "6" R 217 512 0 0 0
Dr 0 0 0
At SMD N 00888000
Ne 0 ""
Po 0 2264
$EndPAD
$PAD
Sh "7" R 217 512 0 0 0
Dr 0 0 0
At SMD N 00888000
Ne 0 ""
Po 315 2264
$EndPAD
$PAD
Sh "8" R 217 512 0 0 0
Dr 0 0 0
At SMD N 00888000
Ne 0 ""
Po 630 2264
$EndPAD
$PAD
Sh "1" R 217 512 0 0 0
Dr 0 0 0
At SMD N 00888000
Ne 0 ""
Po -1575 2264
$EndPAD
$PAD
Sh "2" R 217 512 0 0 0
Dr 0 0 0
At SMD N 00888000
Ne 0 ""
Po -1260 2264
$EndPAD
$PAD
Sh "3" R 217 512 0 0 0
Dr 0 0 0
At SMD N 00888000
Ne 0 ""
Po -945 2264
$EndPAD
$PAD
Sh "12" R 512 217 0 0 0
Dr 0 0 0
At SMD N 00888000
Ne 0 ""
Po 2264 1575
$EndPAD
$PAD
Sh "13" R 512 217 0 0 0
Dr 0 0 0
At SMD N 00888000
Ne 0 ""
Po 2264 1260
$EndPAD
$PAD
Sh "14" R 512 217 0 0 0
Dr 0 0 0
At SMD N 00888000
Ne 0 ""
Po 2264 945
$EndPAD
$PAD
Sh "15" R 512 217 0 0 0
Dr 0 0 0
At SMD N 00888000
Ne 0 ""
Po 2264 630
$EndPAD
$PAD
Sh "16" R 512 217 0 0 0
Dr 0 0 0
At SMD N 00888000
Ne 0 ""
Po 2264 315
$EndPAD
$PAD
Sh "17" R 512 217 0 0 0
Dr 0 0 0
At SMD N 00888000
Ne 0 ""
Po 2264 0
$EndPAD
$PAD
Sh "18" R 512 217 0 0 0
Dr 0 0 0
At SMD N 00888000
Ne 0 ""
Po 2264 -315
$EndPAD
$PAD
Sh "19" R 512 217 0 0 0
Dr 0 0 0
At SMD N 00888000
Ne 0 ""
Po 2264 -630
$EndPAD
$PAD
Sh "23" R 217 512 0 0 0
Dr 0 0 0
At SMD N 00888000
Ne 0 ""
Po 1575 -2264
$EndPAD
$PAD
Sh "24" R 217 512 0 0 0
Dr 0 0 0
At SMD N 00888000
Ne 0 ""
Po 1260 -2264
$EndPAD
$PAD
Sh "25" R 217 512 0 0 0
Dr 0 0 0
At SMD N 00888000
Ne 0 ""
Po 945 -2264
$EndPAD
$PAD
Sh "26" R 217 512 0 0 0
Dr 0 0 0
At SMD N 00888000
Ne 0 ""
Po 630 -2264
$EndPAD
$PAD
Sh "27" R 217 512 0 0 0
Dr 0 0 0
At SMD N 00888000
Ne 0 ""
Po 315 -2264
$EndPAD
$PAD
Sh "28" R 217 512 0 0 0
Dr 0 0 0
At SMD N 00888000
Ne 0 ""
Po 0 -2264
$EndPAD
$PAD
Sh "29" R 217 512 0 0 0
Dr 0 0 0
At SMD N 00888000
Ne 0 ""
Po -315 -2264
$EndPAD
$PAD
Sh "30" R 217 512 0 0 0
Dr 0 0 0
At SMD N 00888000
Ne 0 ""
Po -630 -2264
$EndPAD
$PAD
Sh "34" R 512 217 0 0 0
Dr 0 0 0
At SMD N 00888000
Ne 0 ""
Po -2264 -1575
$EndPAD
$PAD
Sh "35" R 512 217 0 0 0
Dr 0 0 0
At SMD N 00888000
Ne 0 ""
Po -2264 -1260
$EndPAD
$PAD
Sh "36" R 512 217 0 0 0
Dr 0 0 0
At SMD N 00888000
Ne 0 ""
Po -2264 -945
$EndPAD
$PAD
Sh "37" R 512 217 0 0 0
Dr 0 0 0
At SMD N 00888000
Ne 0 ""
Po -2264 -630
$EndPAD
$PAD
Sh "38" R 512 217 0 0 0
Dr 0 0 0
At SMD N 00888000
Ne 0 ""
Po -2264 -315
$EndPAD
$PAD
Sh "39" R 512 217 0 0 0
Dr 0 0 0
At SMD N 00888000
Ne 0 ""
Po -2264 0
$EndPAD
$PAD
Sh "40" R 512 217 0 0 0
Dr 0 0 0
At SMD N 00888000
Ne 0 ""
Po -2264 315
$EndPAD
$PAD
Sh "41" R 512 217 0 0 0
Dr 0 0 0
At SMD N 00888000
Ne 0 ""
Po -2264 630
$EndPAD
$PAD
Sh "9" R 217 512 0 0 0
Dr 0 0 0
At SMD N 00888000
Ne 0 ""
Po 945 2264
$EndPAD
$PAD
Sh "10" R 217 512 0 0 0
Dr 0 0 0
At SMD N 00888000
Ne 0 ""
Po 1260 2264
$EndPAD
$PAD
Sh "11" R 217 512 0 0 0
Dr 0 0 0
At SMD N 00888000
Ne 0 ""
Po 1575 2264
$EndPAD
$PAD
Sh "20" R 512 217 0 0 0
Dr 0 0 0
At SMD N 00888000
Ne 0 ""
Po 2264 -945
$EndPAD
$PAD
Sh "21" R 512 217 0 0 0
Dr 0 0 0
At SMD N 00888000
Ne 0 ""
Po 2264 -1260
$EndPAD
$PAD
Sh "22" R 512 217 0 0 0
Dr 0 0 0
At SMD N 00888000
Ne 0 ""
Po 2264 -1575
$EndPAD
$PAD
Sh "31" R 217 512 0 0 0
Dr 0 0 0
At SMD N 00888000
Ne 0 ""
Po -945 -2264
$EndPAD
$PAD
Sh "32" R 217 512 0 0 0
Dr 0 0 0
At SMD N 00888000
Ne 0 ""
Po -1260 -2264
$EndPAD
$PAD
Sh "33" R 217 512 0 0 0
Dr 0 0 0
At SMD N 00888000
Ne 0 ""
Po -1575 -2264
$EndPAD
$PAD
Sh "42" R 512 217 0 0 0
Dr 0 0 0
At SMD N 00888000
Ne 0 ""
Po -2264 945
$EndPAD
$PAD
Sh "43" R 512 217 0 0 0
Dr 0 0 0
At SMD N 00888000
Ne 0 ""
Po -2264 1260
$EndPAD
$PAD
Sh "44" R 512 217 0 0 0
Dr 0 0 0
At SMD N 00888000
Ne 0 ""
Po -2264 1575
$EndPAD
$SHAPE3D
Na "walter\smd_lqfp\lqfp-44.wrl"
Sc 1.000000 1.000000 1.000000
Of 0.000000 0.000000 0.000000
Ro 0.000000 0.000000 0.000000
$EndSHAPE3D
$EndMODULE  LQFP-44
$MODULE LQFP-48
Po 0 0 0 15 49EA2B32 00000000 ~~
Li lqfp48
Cd LQFP-48
Sc 00000000
AR
Op 0 0 0
T0 0 450 295 295 0 59 N V 21 N"LQFP-48"
T1 0 -450 295 295 0 59 N V 21 N"U***"
DC -950 950 -1050 1000 50 21
DS 1400 1250 1250 1400 50 21
DS 1250 1400 -1250 1400 50 21
DS -1250 1400 -1400 1250 50 21
DS -1400 1250 -1400 -1250 50 21
DS -1400 -1250 -1250 -1400 50 21
DS -1250 -1400 1250 -1400 50 21
DS 1250 -1400 1400 -1250 50 21
DS 1400 -1250 1400 1250 50 21
$PAD
Sh "4" R 118 512 0 0 0
Dr 0 0 0
At SMD N 00888000
Ne 0 ""
Po -492 1614
$EndPAD
$PAD
Sh "5" R 118 512 0 0 0
Dr 0 0 0
At SMD N 00888000
Ne 0 ""
Po -295 1614
$EndPAD
$PAD
Sh "6" R 118 512 0 0 0
Dr 0 0 0
At SMD N 00888000
Ne 0 ""
Po -98 1614
$EndPAD
$PAD
Sh "7" R 118 512 0 0 0
Dr 0 0 0
At SMD N 00888000
Ne 0 ""
Po 98 1614
$EndPAD
$PAD
Sh "8" R 118 512 0 0 0
Dr 0 0 0
At SMD N 00888000
Ne 0 ""
Po 295 1614
$EndPAD
$PAD
Sh "1" R 118 512 0 0 0
Dr 0 0 0
At SMD N 00888000
Ne 0 ""
Po -1083 1614
$EndPAD
$PAD
Sh "2" R 118 512 0 0 0
Dr 0 0 0
At SMD N 00888000
Ne 0 ""
Po -886 1614
$EndPAD
$PAD
Sh "3" R 118 512 0 0 0
Dr 0 0 0
At SMD N 00888000
Ne 0 ""
Po -689 1614
$EndPAD
$PAD
Sh "13" R 512 118 0 0 0
Dr 0 0 0
At SMD N 00888000
Ne 0 ""
Po 1614 1083
$EndPAD
$PAD
Sh "14" R 512 118 0 0 0
Dr 0 0 0
At SMD N 00888000
Ne 0 ""
Po 1614 886
$EndPAD
$PAD
Sh "15" R 512 118 0 0 0
Dr 0 0 0
At SMD N 00888000
Ne 0 ""
Po 1614 689
$EndPAD
$PAD
Sh "16" R 512 118 0 0 0
Dr 0 0 0
At SMD N 00888000
Ne 0 ""
Po 1614 492
$EndPAD
$PAD
Sh "17" R 512 118 0 0 0
Dr 0 0 0
At SMD N 00888000
Ne 0 ""
Po 1614 295
$EndPAD
$PAD
Sh "18" R 512 118 0 0 0
Dr 0 0 0
At SMD N 00888000
Ne 0 ""
Po 1614 98
$EndPAD
$PAD
Sh "19" R 512 118 0 0 0
Dr 0 0 0
At SMD N 00888000
Ne 0 ""
Po 1614 -98
$EndPAD
$PAD
Sh "20" R 512 118 0 0 0
Dr 0 0 0
At SMD N 00888000
Ne 0 ""
Po 1614 -295
$EndPAD
$PAD
Sh "25" R 118 512 0 0 0
Dr 0 0 0
At SMD N 00888000
Ne 0 ""
Po 1083 -1614
$EndPAD
$PAD
Sh "26" R 118 512 0 0 0
Dr 0 0 0
At SMD N 00888000
Ne 0 ""
Po 886 -1614
$EndPAD
$PAD
Sh "27" R 118 512 0 0 0
Dr 0 0 0
At SMD N 00888000
Ne 0 ""
Po 689 -1614
$EndPAD
$PAD
Sh "28" R 118 512 0 0 0
Dr 0 0 0
At SMD N 00888000
Ne 0 ""
Po 492 -1614
$EndPAD
$PAD
Sh "29" R 118 512 0 0 0
Dr 0 0 0
At SMD N 00888000
Ne 0 ""
Po 295 -1614
$EndPAD
$PAD
Sh "30" R 118 512 0 0 0
Dr 0 0 0
At SMD N 00888000
Ne 0 ""
Po 98 -1614
$EndPAD
$PAD
Sh "31" R 118 512 0 0 0
Dr 0 0 0
At SMD N 00888000
Ne 0 ""
Po -98 -1614
$EndPAD
$PAD
Sh "32" R 118 512 0 0 0
Dr 0 0 0
At SMD N 00888000
Ne 0 ""
Po -295 -1614
$EndPAD
$PAD
Sh "37" R 512 118 0 0 0
Dr 0 0 0
At SMD N 00888000
Ne 0 ""
Po -1614 -1083
$EndPAD
$PAD
Sh "38" R 512 118 0 0 0
Dr 0 0 0
At SMD N 00888000
Ne 0 ""
Po -1614 -886
$EndPAD
$PAD
Sh "39" R 512 118 0 0 0
Dr 0 0 0
At SMD N 00888000
Ne 0 ""
Po -1614 -689
$EndPAD
$PAD
Sh "40" R 512 118 0 0 0
Dr 0 0 0
At SMD N 00888000
Ne 0 ""
Po -1614 -492
$EndPAD
$PAD
Sh "41" R 512 118 0 0 0
Dr 0 0 0
At SMD N 00888000
Ne 0 ""
Po -1614 -295
$EndPAD
$PAD
Sh "42" R 512 118 0 0 0
Dr 0 0 0
At SMD N 00888000
Ne 0 ""
Po -1614 -98
$EndPAD
$PAD
Sh "43" R 512 118 0 0 0
Dr 0 0 0
At SMD N 00888000
Ne 0 ""
Po -1614 98
$EndPAD
$PAD
Sh "44" R 512 118 0 0 0
Dr 0 0 0
At SMD N 00888000
Ne 0 ""
Po -1614 295
$EndPAD
$PAD
Sh "9" R 118 512 0 0 0
Dr 0 0 0
At SMD N 00888000
Ne 0 ""
Po 492 1614
$EndPAD
$PAD
Sh "10" R 118 512 0 0 0
Dr 0 0 0
At SMD N 00888000
Ne 0 ""
Po 689 1614
$EndPAD
$PAD
Sh "11" R 118 512 0 0 0
Dr 0 0 0
At SMD N 00888000
Ne 0 ""
Po 886 1614
$EndPAD
$PAD
Sh "12" R 118 512 0 0 0
Dr 0 0 0
At SMD N 00888000
Ne 0 ""
Po 1083 1614
$EndPAD
$PAD
Sh "21" R 512 118 0 0 0
Dr 0 0 0
At SMD N 00888000
Ne 0 ""
Po 1614 -492
$EndPAD
$PAD
Sh "22" R 512 118 0 0 0
Dr 0 0 0
At SMD N 00888000
Ne 0 ""
Po 1614 -689
$EndPAD
$PAD
Sh "23" R 512 118 0 0 0
Dr 0 0 0
At SMD N 00888000
Ne 0 ""
Po 1614 -886
$EndPAD
$PAD
Sh "24" R 512 118 0 0 0
Dr 0 0 0
At SMD N 00888000
Ne 0 ""
Po 1614 -1083
$EndPAD
$PAD
Sh "33" R 118 512 0 0 0
Dr 0 0 0
At SMD N 00888000
Ne 0 ""
Po -492 -1614
$EndPAD
$PAD
Sh "34" R 118 512 0 0 0
Dr 0 0 0
At SMD N 00888000
Ne 0 ""
Po -689 -1614
$EndPAD
$PAD
Sh "35" R 118 512 0 0 0
Dr 0 0 0
At SMD N 00888000
Ne 0 ""
Po -886 -1614
$EndPAD
$PAD
Sh "36" R 118 512 0 0 0
Dr 0 0 0
At SMD N 00888000
Ne 0 ""
Po -1083 -1614
$EndPAD
$PAD
Sh "45" R 512 118 0 0 0
Dr 0 0 0
At SMD N 00888000
Ne 0 ""
Po -1614 492
$EndPAD
$PAD
Sh "46" R 512 118 0 0 0
Dr 0 0 0
At SMD N 00888000
Ne 0 ""
Po -1614 689
$EndPAD
$PAD
Sh "47" R 512 118 0 0 0
Dr 0 0 0
At SMD N 00888000
Ne 0 ""
Po -1614 886
$EndPAD
$PAD
Sh "48" R 512 118 0 0 0
Dr 0 0 0
At SMD N 00888000
Ne 0 ""
Po -1614 1083
$EndPAD
$SHAPE3D
Na "walter\smd_lqfp\lqfp-48.wrl"
Sc 1.000000 1.000000 1.000000
Of 0.000000 0.000000 0.000000
Ro 0.000000 0.000000 0.000000
$EndSHAPE3D
$EndMODULE  LQFP-48
$MODULE LQFP-64
Po 0 0 0 15 49EA32F6 00000000 ~~
Li lqfp64
Cd LQFP-64
Sc 00000000
AR
Op 0 0 0
T0 0 450 295 295 0 59 N V 21 N"LQFP-64"
T1 0 -450 295 295 0 59 N V 21 N"U***"
DS 1770 1970 -1770 1970 50 21
DS 1970 1770 1970 -1770 50 21
DS -1770 -1970 1770 -1970 50 21
DS -1970 1770 -1970 -1770 50 21
DC -1570 1570 -1660 1690 50 21
DS -1770 1970 -1970 1770 50 21
DS 1970 1770 1770 1970 50 21
DS 1770 -1970 1970 -1770 50 21
DS -1970 -1770 -1770 -1970 50 21
$PAD
Sh "4" R 138 512 0 0 0
Dr 0 0 0
At SMD N 00888000
Ne 0 ""
Po -886 2264
$EndPAD
$PAD
Sh "5" R 138 512 0 0 0
Dr 0 0 0
At SMD N 00888000
Ne 0 ""
Po -689 2264
$EndPAD
$PAD
Sh "6" R 138 512 0 0 0
Dr 0 0 0
At SMD N 00888000
Ne 0 ""
Po -492 2264
$EndPAD
$PAD
Sh "7" R 138 512 0 0 0
Dr 0 0 0
At SMD N 00888000
Ne 0 ""
Po -295 2264
$EndPAD
$PAD
Sh "8" R 138 512 0 0 0
Dr 0 0 0
At SMD N 00888000
Ne 0 ""
Po -98 2264
$EndPAD
$PAD
Sh "1" R 138 512 0 0 0
Dr 0 0 0
At SMD N 00888000
Ne 0 ""
Po -1476 2264
$EndPAD
$PAD
Sh "2" R 138 512 0 0 0
Dr 0 0 0
At SMD N 00888000
Ne 0 ""
Po -1280 2264
$EndPAD
$PAD
Sh "3" R 138 512 0 0 0
Dr 0 0 0
At SMD N 00888000
Ne 0 ""
Po -1083 2264
$EndPAD
$PAD
Sh "17" R 512 138 0 0 0
Dr 0 0 0
At SMD N 00888000
Ne 0 ""
Po 2264 1476
$EndPAD
$PAD
Sh "18" R 512 138 0 0 0
Dr 0 0 0
At SMD N 00888000
Ne 0 ""
Po 2264 1280
$EndPAD
$PAD
Sh "19" R 512 138 0 0 0
Dr 0 0 0
At SMD N 00888000
Ne 0 ""
Po 2264 1083
$EndPAD
$PAD
Sh "20" R 512 138 0 0 0
Dr 0 0 0
At SMD N 00888000
Ne 0 ""
Po 2264 886
$EndPAD
$PAD
Sh "21" R 512 138 0 0 0
Dr 0 0 0
At SMD N 00888000
Ne 0 ""
Po 2264 689
$EndPAD
$PAD
Sh "22" R 512 138 0 0 0
Dr 0 0 0
At SMD N 00888000
Ne 0 ""
Po 2264 492
$EndPAD
$PAD
Sh "23" R 512 138 0 0 0
Dr 0 0 0
At SMD N 00888000
Ne 0 ""
Po 2264 295
$EndPAD
$PAD
Sh "24" R 512 138 0 0 0
Dr 0 0 0
At SMD N 00888000
Ne 0 ""
Po 2264 98
$EndPAD
$PAD
Sh "33" R 138 512 0 0 0
Dr 0 0 0
At SMD N 00888000
Ne 0 ""
Po 1476 -2264
$EndPAD
$PAD
Sh "34" R 138 512 0 0 0
Dr 0 0 0
At SMD N 00888000
Ne 0 ""
Po 1280 -2264
$EndPAD
$PAD
Sh "35" R 138 512 0 0 0
Dr 0 0 0
At SMD N 00888000
Ne 0 ""
Po 1083 -2264
$EndPAD
$PAD
Sh "36" R 138 512 0 0 0
Dr 0 0 0
At SMD N 00888000
Ne 0 ""
Po 886 -2264
$EndPAD
$PAD
Sh "37" R 138 512 0 0 0
Dr 0 0 0
At SMD N 00888000
Ne 0 ""
Po 689 -2264
$EndPAD
$PAD
Sh "38" R 138 512 0 0 0
Dr 0 0 0
At SMD N 00888000
Ne 0 ""
Po 492 -2264
$EndPAD
$PAD
Sh "39" R 138 512 0 0 0
Dr 0 0 0
At SMD N 00888000
Ne 0 ""
Po 295 -2264
$EndPAD
$PAD
Sh "40" R 138 512 0 0 0
Dr 0 0 0
At SMD N 00888000
Ne 0 ""
Po 98 -2264
$EndPAD
$PAD
Sh "49" R 512 138 0 0 0
Dr 0 0 0
At SMD N 00888000
Ne 0 ""
Po -2264 -1476
$EndPAD
$PAD
Sh "50" R 512 138 0 0 0
Dr 0 0 0
At SMD N 00888000
Ne 0 ""
Po -2264 -1280
$EndPAD
$PAD
Sh "51" R 512 138 0 0 0
Dr 0 0 0
At SMD N 00888000
Ne 0 ""
Po -2264 -1083
$EndPAD
$PAD
Sh "52" R 512 138 0 0 0
Dr 0 0 0
At SMD N 00888000
Ne 0 ""
Po -2264 -886
$EndPAD
$PAD
Sh "53" R 512 138 0 0 0
Dr 0 0 0
At SMD N 00888000
Ne 0 ""
Po -2264 -689
$EndPAD
$PAD
Sh "54" R 512 138 0 0 0
Dr 0 0 0
At SMD N 00888000
Ne 0 ""
Po -2264 -492
$EndPAD
$PAD
Sh "55" R 512 138 0 0 0
Dr 0 0 0
At SMD N 00888000
Ne 0 ""
Po -2264 -295
$EndPAD
$PAD
Sh "56" R 512 138 0 0 0
Dr 0 0 0
At SMD N 00888000
Ne 0 ""
Po -2264 -98
$EndPAD
$PAD
Sh "9" R 138 512 0 0 0
Dr 0 0 0
At SMD N 00888000
Ne 0 ""
Po 98 2264
$EndPAD
$PAD
Sh "10" R 138 512 0 0 0
Dr 0 0 0
At SMD N 00888000
Ne 0 ""
Po 295 2264
$EndPAD
$PAD
Sh "11" R 138 512 0 0 0
Dr 0 0 0
At SMD N 00888000
Ne 0 ""
Po 492 2264
$EndPAD
$PAD
Sh "25" R 512 138 0 0 0
Dr 0 0 0
At SMD N 00888000
Ne 0 ""
Po 2264 -98
$EndPAD
$PAD
Sh "26" R 512 138 0 0 0
Dr 0 0 0
At SMD N 00888000
Ne 0 ""
Po 2264 -295
$EndPAD
$PAD
Sh "27" R 512 138 0 0 0
Dr 0 0 0
At SMD N 00888000
Ne 0 ""
Po 2264 -492
$EndPAD
$PAD
Sh "41" R 138 512 0 0 0
Dr 0 0 0
At SMD N 00888000
Ne 0 ""
Po -98 -2264
$EndPAD
$PAD
Sh "42" R 138 512 0 0 0
Dr 0 0 0
At SMD N 00888000
Ne 0 ""
Po -295 -2264
$EndPAD
$PAD
Sh "43" R 138 512 0 0 0
Dr 0 0 0
At SMD N 00888000
Ne 0 ""
Po -492 -2264
$EndPAD
$PAD
Sh "57" R 512 138 0 0 0
Dr 0 0 0
At SMD N 00888000
Ne 0 ""
Po -2264 98
$EndPAD
$PAD
Sh "58" R 512 138 0 0 0
Dr 0 0 0
At SMD N 00888000
Ne 0 ""
Po -2264 295
$EndPAD
$PAD
Sh "59" R 512 138 0 0 0
Dr 0 0 0
At SMD N 00888000
Ne 0 ""
Po -2264 492
$EndPAD
$PAD
Sh "12" R 138 512 0 0 0
Dr 0 0 0
At SMD N 00888000
Ne 0 ""
Po 689 2264
$EndPAD
$PAD
Sh "13" R 138 512 0 0 0
Dr 0 0 0
At SMD N 00888000
Ne 0 ""
Po 886 2264
$EndPAD
$PAD
Sh "14" R 138 512 0 0 0
Dr 0 0 0
At SMD N 00888000
Ne 0 ""
Po 1083 2264
$EndPAD
$PAD
Sh "15" R 138 512 0 0 0
Dr 0 0 0
At SMD N 00888000
Ne 0 ""
Po 1280 2264
$EndPAD
$PAD
Sh "16" R 138 512 0 0 0
Dr 0 0 0
At SMD N 00888000
Ne 0 ""
Po 1476 2264
$EndPAD
$PAD
Sh "28" R 512 138 0 0 0
Dr 0 0 0
At SMD N 00888000
Ne 0 ""
Po 2264 -689
$EndPAD
$PAD
Sh "29" R 512 138 0 0 0
Dr 0 0 0
At SMD N 00888000
Ne 0 ""
Po 2264 -886
$EndPAD
$PAD
Sh "30" R 512 138 0 0 0
Dr 0 0 0
At SMD N 00888000
Ne 0 ""
Po 2264 -1083
$EndPAD
$PAD
Sh "31" R 512 138 0 0 0
Dr 0 0 0
At SMD N 00888000
Ne 0 ""
Po 2264 -1280
$EndPAD
$PAD
Sh "32" R 512 138 0 0 0
Dr 0 0 0
At SMD N 00888000
Ne 0 ""
Po 2264 -1476
$EndPAD
$PAD
Sh "44" R 138 512 0 0 0
Dr 0 0 0
At SMD N 00888000
Ne 0 ""
Po -689 -2264
$EndPAD
$PAD
Sh "45" R 138 512 0 0 0
Dr 0 0 0
At SMD N 00888000
Ne 0 ""
Po -886 -2264
$EndPAD
$PAD
Sh "46" R 138 512 0 0 0
Dr 0 0 0
At SMD N 00888000
Ne 0 ""
Po -1083 -2264
$EndPAD
$PAD
Sh "47" R 138 512 0 0 0
Dr 0 0 0
At SMD N 00888000
Ne 0 ""
Po -1280 -2264
$EndPAD
$PAD
Sh "48" R 138 512 0 0 0
Dr 0 0 0
At SMD N 00888000
Ne 0 ""
Po -1476 -2264
$EndPAD
$PAD
Sh "60" R 512 138 0 0 0
Dr 0 0 0
At SMD N 00888000
Ne 0 ""
Po -2264 689
$EndPAD
$PAD
Sh "61" R 512 138 0 0 0
Dr 0 0 0
At SMD N 00888000
Ne 0 ""
Po -2264 886
$EndPAD
$PAD
Sh "62" R 512 138 0 0 0
Dr 0 0 0
At SMD N 00888000
Ne 0 ""
Po -2264 1083
$EndPAD
$PAD
Sh "63" R 512 138 0 0 0
Dr 0 0 0
At SMD N 00888000
Ne 0 ""
Po -2264 1280
$EndPAD
$PAD
Sh "64" R 512 138 0 0 0
Dr 0 0 0
At SMD N 00888000
Ne 0 ""
Po -2264 1476
$EndPAD
$SHAPE3D
Na "walter\smd_lqfp\lqfp-64.wrl"
Sc 1.000000 1.000000 1.000000
Of 0.000000 0.000000 0.000000
Ro 0.000000 0.000000 0.000000
$EndSHAPE3D
$EndMODULE  LQFP-64
$MODULE LQFP-52
Po 0 0 0 15 49EA3819 00000000 ~~
Li lqfp52
Cd LQFP-52
Sc 00000000
AR
Op 0 0 0
T0 0 450 295 295 0 59 N V 21 N"LQFP-52"
T1 0 -450 295 295 0 59 N V 21 N"U***"
DS 1770 1970 -1770 1970 50 21
DS 1970 1770 1970 -1770 50 21
DS -1770 -1970 1770 -1970 50 21
DS -1970 1770 -1970 -1770 50 21
DC -1570 1570 -1660 1690 50 21
DS -1770 1970 -1970 1770 50 21
DS 1970 1770 1770 1970 50 21
DS 1770 -1970 1970 -1770 50 21
DS -1970 -1770 -1770 -1970 50 21
$PAD
Sh "4" R 157 512 0 0 0
Dr 0 0 0
At SMD N 00888000
Ne 0 ""
Po -768 2264
$EndPAD
$PAD
Sh "5" R 157 512 0 0 0
Dr 0 0 0
At SMD N 00888000
Ne 0 ""
Po -512 2264
$EndPAD
$PAD
Sh "6" R 157 512 0 0 0
Dr 0 0 0
At SMD N 00888000
Ne 0 ""
Po -256 2264
$EndPAD
$PAD
Sh "7" R 157 512 0 0 0
Dr 0 0 0
At SMD N 00888000
Ne 0 ""
Po 0 2264
$EndPAD
$PAD
Sh "8" R 157 512 0 0 0
Dr 0 0 0
At SMD N 00888000
Ne 0 ""
Po 256 2264
$EndPAD
$PAD
Sh "1" R 157 512 0 0 0
Dr 0 0 0
At SMD N 00888000
Ne 0 ""
Po -1535 2264
$EndPAD
$PAD
Sh "2" R 157 512 0 0 0
Dr 0 0 0
At SMD N 00888000
Ne 0 ""
Po -1280 2264
$EndPAD
$PAD
Sh "3" R 157 512 0 0 0
Dr 0 0 0
At SMD N 00888000
Ne 0 ""
Po -1024 2264
$EndPAD
$PAD
Sh "14" R 512 157 0 0 0
Dr 0 0 0
At SMD N 00888000
Ne 0 ""
Po 2264 1535
$EndPAD
$PAD
Sh "15" R 512 157 0 0 0
Dr 0 0 0
At SMD N 00888000
Ne 0 ""
Po 2264 1280
$EndPAD
$PAD
Sh "16" R 512 157 0 0 0
Dr 0 0 0
At SMD N 00888000
Ne 0 ""
Po 2264 1024
$EndPAD
$PAD
Sh "17" R 512 157 0 0 0
Dr 0 0 0
At SMD N 00888000
Ne 0 ""
Po 2264 768
$EndPAD
$PAD
Sh "18" R 512 157 0 0 0
Dr 0 0 0
At SMD N 00888000
Ne 0 ""
Po 2264 512
$EndPAD
$PAD
Sh "20" R 512 157 0 0 0
Dr 0 0 0
At SMD N 00888000
Ne 0 ""
Po 2264 0
$EndPAD
$PAD
Sh "19" R 512 157 0 0 0
Dr 0 0 0
At SMD N 00888000
Ne 0 ""
Po 2264 256
$EndPAD
$PAD
Sh "21" R 512 157 0 0 0
Dr 0 0 0
At SMD N 00888000
Ne 0 ""
Po 2264 -256
$EndPAD
$PAD
Sh "27" R 157 512 0 0 0
Dr 0 0 0
At SMD N 00888000
Ne 0 ""
Po 1535 -2264
$EndPAD
$PAD
Sh "28" R 157 512 0 0 0
Dr 0 0 0
At SMD N 00888000
Ne 0 ""
Po 1280 -2264
$EndPAD
$PAD
Sh "29" R 157 512 0 0 0
Dr 0 0 0
At SMD N 00888000
Ne 0 ""
Po 1024 -2264
$EndPAD
$PAD
Sh "30" R 157 512 0 0 0
Dr 0 0 0
At SMD N 00888000
Ne 0 ""
Po 768 -2264
$EndPAD
$PAD
Sh "31" R 157 512 0 0 0
Dr 0 0 0
At SMD N 00888000
Ne 0 ""
Po 512 -2264
$EndPAD
$PAD
Sh "32" R 157 512 0 0 0
Dr 0 0 0
At SMD N 00888000
Ne 0 ""
Po 256 -2264
$EndPAD
$PAD
Sh "33" R 157 512 0 0 0
Dr 0 0 0
At SMD N 00888000
Ne 0 ""
Po 0 -2264
$EndPAD
$PAD
Sh "34" R 157 512 0 0 0
Dr 0 0 0
At SMD N 00888000
Ne 0 ""
Po -256 -2264
$EndPAD
$PAD
Sh "40" R 512 157 0 0 0
Dr 0 0 0
At SMD N 00888000
Ne 0 ""
Po -2264 -1535
$EndPAD
$PAD
Sh "41" R 512 157 0 0 0
Dr 0 0 0
At SMD N 00888000
Ne 0 ""
Po -2264 -1280
$EndPAD
$PAD
Sh "42" R 512 157 0 0 0
Dr 0 0 0
At SMD N 00888000
Ne 0 ""
Po -2264 -1024
$EndPAD
$PAD
Sh "43" R 512 157 0 0 0
Dr 0 0 0
At SMD N 00888000
Ne 0 ""
Po -2264 -768
$EndPAD
$PAD
Sh "44" R 512 157 0 0 0
Dr 0 0 0
At SMD N 00888000
Ne 0 ""
Po -2264 -512
$EndPAD
$PAD
Sh "45" R 512 157 0 0 0
Dr 0 0 0
At SMD N 00888000
Ne 0 ""
Po -2264 -256
$EndPAD
$PAD
Sh "46" R 512 157 0 0 0
Dr 0 0 0
At SMD N 00888000
Ne 0 ""
Po -2264 0
$EndPAD
$PAD
Sh "47" R 512 157 0 0 0
Dr 0 0 0
At SMD N 00888000
Ne 0 ""
Po -2264 256
$EndPAD
$PAD
Sh "9" R 157 512 0 0 0
Dr 0 0 0
At SMD N 00888000
Ne 0 ""
Po 512 2264
$EndPAD
$PAD
Sh "10" R 157 512 0 0 0
Dr 0 0 0
At SMD N 00888000
Ne 0 ""
Po 768 2264
$EndPAD
$PAD
Sh "11" R 157 512 0 0 0
Dr 0 0 0
At SMD N 00888000
Ne 0 ""
Po 1024 2264
$EndPAD
$PAD
Sh "22" R 512 157 0 0 0
Dr 0 0 0
At SMD N 00888000
Ne 0 ""
Po 2264 -512
$EndPAD
$PAD
Sh "23" R 512 157 0 0 0
Dr 0 0 0
At SMD N 00888000
Ne 0 ""
Po 2264 -768
$EndPAD
$PAD
Sh "24" R 512 157 0 0 0
Dr 0 0 0
At SMD N 00888000
Ne 0 ""
Po 2264 -1024
$EndPAD
$PAD
Sh "35" R 157 512 0 0 0
Dr 0 0 0
At SMD N 00888000
Ne 0 ""
Po -512 -2264
$EndPAD
$PAD
Sh "36" R 157 512 0 0 0
Dr 0 0 0
At SMD N 00888000
Ne 0 ""
Po -768 -2264
$EndPAD
$PAD
Sh "37" R 157 512 0 0 0
Dr 0 0 0
At SMD N 00888000
Ne 0 ""
Po -1024 -2264
$EndPAD
$PAD
Sh "48" R 512 157 0 0 0
Dr 0 0 0
At SMD N 00888000
Ne 0 ""
Po -2264 512
$EndPAD
$PAD
Sh "49" R 512 157 0 0 0
Dr 0 0 0
At SMD N 00888000
Ne 0 ""
Po -2264 768
$EndPAD
$PAD
Sh "50" R 512 157 0 0 0
Dr 0 0 0
At SMD N 00888000
Ne 0 ""
Po -2264 1024
$EndPAD
$PAD
Sh "12" R 157 512 0 0 0
Dr 0 0 0
At SMD N 00888000
Ne 0 ""
Po 1280 2264
$EndPAD
$PAD
Sh "13" R 157 512 0 0 0
Dr 0 0 0
At SMD N 00888000
Ne 0 ""
Po 1535 2264
$EndPAD
$PAD
Sh "25" R 512 157 0 0 0
Dr 0 0 0
At SMD N 00888000
Ne 0 ""
Po 2264 -1280
$EndPAD
$PAD
Sh "26" R 512 157 0 0 0
Dr 0 0 0
At SMD N 00888000
Ne 0 ""
Po 2264 -1535
$EndPAD
$PAD
Sh "38" R 157 512 0 0 0
Dr 0 0 0
At SMD N 00888000
Ne 0 ""
Po -1280 -2264
$EndPAD
$PAD
Sh "39" R 157 512 0 0 0
Dr 0 0 0
At SMD N 00888000
Ne 0 ""
Po -1535 -2264
$EndPAD
$PAD
Sh "51" R 512 157 0 0 0
Dr 0 0 0
At SMD N 00888000
Ne 0 ""
Po -2264 1280
$EndPAD
$PAD
Sh "52" R 512 157 0 0 0
Dr 0 0 0
At SMD N 00888000
Ne 0 ""
Po -2264 1535
$EndPAD
$SHAPE3D
Na "walter\smd_lqfp\lqfp-52.wrl"
Sc 1.000000 1.000000 1.000000
Of 0.000000 0.000000 0.000000
Ro 0.000000 0.000000 0.000000
$EndSHAPE3D
$EndMODULE  LQFP-52
$MODULE LQFP-128
Po 0 0 0 15 4925D74A 00000000 ~~
Li lqfp128
Cd LQFP-128
Sc 00000000
AR
Op 0 0 0
T0 0 450 394 394 0 79 N V 21 N"LQFP-128"
T1 0 -450 394 394 0 79 N V 21 N"U***"
DC -2100 2100 -2250 2300 59 21
DS 2650 2800 2800 2650 59 21
DS 2800 2650 2800 -2650 59 21
DS 2800 -2650 2650 -2800 59 21
DS 2650 -2800 -2650 -2800 59 21
DS -2650 -2800 -2800 -2650 59 21
DS -2800 -2650 -2800 2650 59 21
DS -2800 2650 -2650 2800 59 21
DS -2650 2800 2650 2800 59 21
$PAD
Sh "1" R 98 472 0 0 0
Dr 0 0 0
At SMD N 00888000
Ne 0 ""
Po -2441 2992
$EndPAD
$PAD
Sh "2" R 98 472 0 0 0
Dr 0 0 0
At SMD N 00888000
Ne 0 ""
Po -2283 2992
$EndPAD
$PAD
Sh "3" R 98 472 0 0 0
Dr 0 0 0
At SMD N 00888000
Ne 0 ""
Po -2126 2992
$EndPAD
$PAD
Sh "4" R 98 472 0 0 0
Dr 0 0 0
At SMD N 00888000
Ne 0 ""
Po -1969 2992
$EndPAD
$PAD
Sh "5" R 98 472 0 0 0
Dr 0 0 0
At SMD N 00888000
Ne 0 ""
Po -1811 2992
$EndPAD
$PAD
Sh "6" R 98 472 0 0 0
Dr 0 0 0
At SMD N 00888000
Ne 0 ""
Po -1654 2992
$EndPAD
$PAD
Sh "7" R 98 472 0 0 0
Dr 0 0 0
At SMD N 00888000
Ne 0 ""
Po -1496 2992
$EndPAD
$PAD
Sh "8" R 98 472 0 0 0
Dr 0 0 0
At SMD N 00888000
Ne 0 ""
Po -1339 2992
$EndPAD
$PAD
Sh "9" R 98 472 0 0 0
Dr 0 0 0
At SMD N 00888000
Ne 0 ""
Po -1181 2992
$EndPAD
$PAD
Sh "10" R 98 472 0 0 0
Dr 0 0 0
At SMD N 00888000
Ne 0 ""
Po -1024 2992
$EndPAD
$PAD
Sh "11" R 98 472 0 0 0
Dr 0 0 0
At SMD N 00888000
Ne 0 ""
Po -866 2992
$EndPAD
$PAD
Sh "12" R 98 472 0 0 0
Dr 0 0 0
At SMD N 00888000
Ne 0 ""
Po -709 2992
$EndPAD
$PAD
Sh "13" R 98 472 0 0 0
Dr 0 0 0
At SMD N 00888000
Ne 0 ""
Po -551 2992
$EndPAD
$PAD
Sh "14" R 98 472 0 0 0
Dr 0 0 0
At SMD N 00888000
Ne 0 ""
Po -394 2992
$EndPAD
$PAD
Sh "15" R 98 472 0 0 0
Dr 0 0 0
At SMD N 00888000
Ne 0 ""
Po -236 2992
$EndPAD
$PAD
Sh "16" R 98 472 0 0 0
Dr 0 0 0
At SMD N 00888000
Ne 0 ""
Po -79 2992
$EndPAD
$PAD
Sh "17" R 98 472 0 0 0
Dr 0 0 0
At SMD N 00888000
Ne 0 ""
Po 79 2992
$EndPAD
$PAD
Sh "18" R 98 472 0 0 0
Dr 0 0 0
At SMD N 00888000
Ne 0 ""
Po 236 2992
$EndPAD
$PAD
Sh "19" R 98 472 0 0 0
Dr 0 0 0
At SMD N 00888000
Ne 0 ""
Po 394 2992
$EndPAD
$PAD
Sh "20" R 98 472 0 0 0
Dr 0 0 0
At SMD N 00888000
Ne 0 ""
Po 551 2992
$EndPAD
$PAD
Sh "21" R 98 472 0 0 0
Dr 0 0 0
At SMD N 00888000
Ne 0 ""
Po 709 2992
$EndPAD
$PAD
Sh "22" R 98 472 0 0 0
Dr 0 0 0
At SMD N 00888000
Ne 0 ""
Po 866 2992
$EndPAD
$PAD
Sh "23" R 98 472 0 0 0
Dr 0 0 0
At SMD N 00888000
Ne 0 ""
Po 1024 2992
$EndPAD
$PAD
Sh "24" R 98 472 0 0 0
Dr 0 0 0
At SMD N 00888000
Ne 0 ""
Po 1181 2992
$EndPAD
$PAD
Sh "25" R 98 472 0 0 0
Dr 0 0 0
At SMD N 00888000
Ne 0 ""
Po 1339 2992
$EndPAD
$PAD
Sh "26" R 98 472 0 0 0
Dr 0 0 0
At SMD N 00888000
Ne 0 ""
Po 1496 2992
$EndPAD
$PAD
Sh "27" R 98 472 0 0 0
Dr 0 0 0
At SMD N 00888000
Ne 0 ""
Po 1654 2992
$EndPAD
$PAD
Sh "28" R 98 472 0 0 0
Dr 0 0 0
At SMD N 00888000
Ne 0 ""
Po 1811 2992
$EndPAD
$PAD
Sh "29" R 98 472 0 0 0
Dr 0 0 0
At SMD N 00888000
Ne 0 ""
Po 1969 2992
$EndPAD
$PAD
Sh "30" R 98 472 0 0 0
Dr 0 0 0
At SMD N 00888000
Ne 0 ""
Po 2126 2992
$EndPAD
$PAD
Sh "31" R 98 472 0 0 0
Dr 0 0 0
At SMD N 00888000
Ne 0 ""
Po 2283 2992
$EndPAD
$PAD
Sh "32" R 98 472 0 0 0
Dr 0 0 0
At SMD N 00888000
Ne 0 ""
Po 2441 2992
$EndPAD
$PAD
Sh "33" R 472 98 0 0 0
Dr 0 0 0
At SMD N 00888000
Ne 0 ""
Po 2992 2441
$EndPAD
$PAD
Sh "34" R 472 98 0 0 0
Dr 0 0 0
At SMD N 00888000
Ne 0 ""
Po 2992 2283
$EndPAD
$PAD
Sh "35" R 472 98 0 0 0
Dr 0 0 0
At SMD N 00888000
Ne 0 ""
Po 2992 2126
$EndPAD
$PAD
Sh "36" R 472 98 0 0 0
Dr 0 0 0
At SMD N 00888000
Ne 0 ""
Po 2992 1969
$EndPAD
$PAD
Sh "37" R 472 98 0 0 0
Dr 0 0 0
At SMD N 00888000
Ne 0 ""
Po 2992 1811
$EndPAD
$PAD
Sh "38" R 472 98 0 0 0
Dr 0 0 0
At SMD N 00888000
Ne 0 ""
Po 2992 1654
$EndPAD
$PAD
Sh "39" R 472 98 0 0 0
Dr 0 0 0
At SMD N 00888000
Ne 0 ""
Po 2992 1496
$EndPAD
$PAD
Sh "40" R 472 98 0 0 0
Dr 0 0 0
At SMD N 00888000
Ne 0 ""
Po 2992 1339
$EndPAD
$PAD
Sh "41" R 472 98 0 0 0
Dr 0 0 0
At SMD N 00888000
Ne 0 ""
Po 2992 1181
$EndPAD
$PAD
Sh "42" R 472 98 0 0 0
Dr 0 0 0
At SMD N 00888000
Ne 0 ""
Po 2992 1024
$EndPAD
$PAD
Sh "43" R 472 98 0 0 0
Dr 0 0 0
At SMD N 00888000
Ne 0 ""
Po 2992 866
$EndPAD
$PAD
Sh "44" R 472 98 0 0 0
Dr 0 0 0
At SMD N 00888000
Ne 0 ""
Po 2992 709
$EndPAD
$PAD
Sh "45" R 472 98 0 0 0
Dr 0 0 0
At SMD N 00888000
Ne 0 ""
Po 2992 551
$EndPAD
$PAD
Sh "46" R 472 98 0 0 0
Dr 0 0 0
At SMD N 00888000
Ne 0 ""
Po 2992 394
$EndPAD
$PAD
Sh "47" R 472 98 0 0 0
Dr 0 0 0
At SMD N 00888000
Ne 0 ""
Po 2992 236
$EndPAD
$PAD
Sh "48" R 472 98 0 0 0
Dr 0 0 0
At SMD N 00888000
Ne 0 ""
Po 2992 79
$EndPAD
$PAD
Sh "49" R 472 98 0 0 0
Dr 0 0 0
At SMD N 00888000
Ne 0 ""
Po 2992 -79
$EndPAD
$PAD
Sh "50" R 472 98 0 0 0
Dr 0 0 0
At SMD N 00888000
Ne 0 ""
Po 2992 -236
$EndPAD
$PAD
Sh "51" R 472 98 0 0 0
Dr 0 0 0
At SMD N 00888000
Ne 0 ""
Po 2992 -394
$EndPAD
$PAD
Sh "52" R 472 98 0 0 0
Dr 0 0 0
At SMD N 00888000
Ne 0 ""
Po 2992 -551
$EndPAD
$PAD
Sh "53" R 472 98 0 0 0
Dr 0 0 0
At SMD N 00888000
Ne 0 ""
Po 2992 -709
$EndPAD
$PAD
Sh "54" R 472 98 0 0 0
Dr 0 0 0
At SMD N 00888000
Ne 0 ""
Po 2992 -866
$EndPAD
$PAD
Sh "55" R 472 98 0 0 0
Dr 0 0 0
At SMD N 00888000
Ne 0 ""
Po 2992 -1024
$EndPAD
$PAD
Sh "56" R 472 98 0 0 0
Dr 0 0 0
At SMD N 00888000
Ne 0 ""
Po 2992 -1181
$EndPAD
$PAD
Sh "57" R 472 98 0 0 0
Dr 0 0 0
At SMD N 00888000
Ne 0 ""
Po 2992 -1339
$EndPAD
$PAD
Sh "58" R 472 98 0 0 0
Dr 0 0 0
At SMD N 00888000
Ne 0 ""
Po 2992 -1496
$EndPAD
$PAD
Sh "59" R 472 98 0 0 0
Dr 0 0 0
At SMD N 00888000
Ne 0 ""
Po 2992 -1654
$EndPAD
$PAD
Sh "60" R 472 98 0 0 0
Dr 0 0 0
At SMD N 00888000
Ne 0 ""
Po 2992 -1811
$EndPAD
$PAD
Sh "61" R 472 98 0 0 0
Dr 0 0 0
At SMD N 00888000
Ne 0 ""
Po 2992 -1969
$EndPAD
$PAD
Sh "62" R 472 98 0 0 0
Dr 0 0 0
At SMD N 00888000
Ne 0 ""
Po 2992 -2126
$EndPAD
$PAD
Sh "63" R 472 98 0 0 0
Dr 0 0 0
At SMD N 00888000
Ne 0 ""
Po 2992 -2283
$EndPAD
$PAD
Sh "64" R 472 98 0 0 0
Dr 0 0 0
At SMD N 00888000
Ne 0 ""
Po 2992 -2441
$EndPAD
$PAD
Sh "65" R 98 472 0 0 0
Dr 0 0 0
At SMD N 00888000
Ne 0 ""
Po 2441 -2992
$EndPAD
$PAD
Sh "66" R 98 472 0 0 0
Dr 0 0 0
At SMD N 00888000
Ne 0 ""
Po 2283 -2992
$EndPAD
$PAD
Sh "67" R 98 472 0 0 0
Dr 0 0 0
At SMD N 00888000
Ne 0 ""
Po 2126 -2992
$EndPAD
$PAD
Sh "68" R 98 472 0 0 0
Dr 0 0 0
At SMD N 00888000
Ne 0 ""
Po 1969 -2992
$EndPAD
$PAD
Sh "69" R 98 472 0 0 0
Dr 0 0 0
At SMD N 00888000
Ne 0 ""
Po 1811 -2992
$EndPAD
$PAD
Sh "70" R 98 472 0 0 0
Dr 0 0 0
At SMD N 00888000
Ne 0 ""
Po 1654 -2992
$EndPAD
$PAD
Sh "71" R 98 472 0 0 0
Dr 0 0 0
At SMD N 00888000
Ne 0 ""
Po 1496 -2992
$EndPAD
$PAD
Sh "72" R 98 472 0 0 0
Dr 0 0 0
At SMD N 00888000
Ne 0 ""
Po 1339 -2992
$EndPAD
$PAD
Sh "73" R 98 472 0 0 0
Dr 0 0 0
At SMD N 00888000
Ne 0 ""
Po 1181 -2992
$EndPAD
$PAD
Sh "74" R 98 472 0 0 0
Dr 0 0 0
At SMD N 00888000
Ne 0 ""
Po 1024 -2992
$EndPAD
$PAD
Sh "75" R 98 472 0 0 0
Dr 0 0 0
At SMD N 00888000
Ne 0 ""
Po 866 -2992
$EndPAD
$PAD
Sh "76" R 98 472 0 0 0
Dr 0 0 0
At SMD N 00888000
Ne 0 ""
Po 709 -2992
$EndPAD
$PAD
Sh "77" R 98 472 0 0 0
Dr 0 0 0
At SMD N 00888000
Ne 0 ""
Po 551 -2992
$EndPAD
$PAD
Sh "78" R 98 472 0 0 0
Dr 0 0 0
At SMD N 00888000
Ne 0 ""
Po 394 -2992
$EndPAD
$PAD
Sh "79" R 98 472 0 0 0
Dr 0 0 0
At SMD N 00888000
Ne 0 ""
Po 236 -2992
$EndPAD
$PAD
Sh "80" R 98 472 0 0 0
Dr 0 0 0
At SMD N 00888000
Ne 0 ""
Po 79 -2992
$EndPAD
$PAD
Sh "81" R 98 472 0 0 0
Dr 0 0 0
At SMD N 00888000
Ne 0 ""
Po -79 -2992
$EndPAD
$PAD
Sh "82" R 98 472 0 0 0
Dr 0 0 0
At SMD N 00888000
Ne 0 ""
Po -236 -2992
$EndPAD
$PAD
Sh "83" R 98 472 0 0 0
Dr 0 0 0
At SMD N 00888000
Ne 0 ""
Po -394 -2992
$EndPAD
$PAD
Sh "84" R 98 472 0 0 0
Dr 0 0 0
At SMD N 00888000
Ne 0 ""
Po -551 -2992
$EndPAD
$PAD
Sh "85" R 98 472 0 0 0
Dr 0 0 0
At SMD N 00888000
Ne 0 ""
Po -709 -2992
$EndPAD
$PAD
Sh "86" R 98 472 0 0 0
Dr 0 0 0
At SMD N 00888000
Ne 0 ""
Po -866 -2992
$EndPAD
$PAD
Sh "87" R 98 472 0 0 0
Dr 0 0 0
At SMD N 00888000
Ne 0 ""
Po -1024 -2992
$EndPAD
$PAD
Sh "88" R 98 472 0 0 0
Dr 0 0 0
At SMD N 00888000
Ne 0 ""
Po -1181 -2992
$EndPAD
$PAD
Sh "89" R 98 472 0 0 0
Dr 0 0 0
At SMD N 00888000
Ne 0 ""
Po -1339 -2992
$EndPAD
$PAD
Sh "90" R 98 472 0 0 0
Dr 0 0 0
At SMD N 00888000
Ne 0 ""
Po -1496 -2992
$EndPAD
$PAD
Sh "91" R 98 472 0 0 0
Dr 0 0 0
At SMD N 00888000
Ne 0 ""
Po -1654 -2992
$EndPAD
$PAD
Sh "92" R 98 472 0 0 0
Dr 0 0 0
At SMD N 00888000
Ne 0 ""
Po -1811 -2992
$EndPAD
$PAD
Sh "93" R 98 472 0 0 0
Dr 0 0 0
At SMD N 00888000
Ne 0 ""
Po -1969 -2992
$EndPAD
$PAD
Sh "94" R 98 472 0 0 0
Dr 0 0 0
At SMD N 00888000
Ne 0 ""
Po -2126 -2992
$EndPAD
$PAD
Sh "95" R 98 472 0 0 0
Dr 0 0 0
At SMD N 00888000
Ne 0 ""
Po -2283 -2992
$EndPAD
$PAD
Sh "96" R 98 472 0 0 0
Dr 0 0 0
At SMD N 00888000
Ne 0 ""
Po -2441 -2992
$EndPAD
$PAD
Sh "97" R 472 98 0 0 0
Dr 0 0 0
At SMD N 00888000
Ne 0 ""
Po -2992 -2441
$EndPAD
$PAD
Sh "98" R 472 98 0 0 0
Dr 0 0 0
At SMD N 00888000
Ne 0 ""
Po -2992 -2283
$EndPAD
$PAD
Sh "99" R 472 98 0 0 0
Dr 0 0 0
At SMD N 00888000
Ne 0 ""
Po -2992 -2126
$EndPAD
$PAD
Sh "100" R 472 98 0 0 0
Dr 0 0 0
At SMD N 00888000
Ne 0 ""
Po -2992 -1969
$EndPAD
$PAD
Sh "101" R 472 98 0 0 0
Dr 0 0 0
At SMD N 00888000
Ne 0 ""
Po -2992 -1811
$EndPAD
$PAD
Sh "102" R 472 98 0 0 0
Dr 0 0 0
At SMD N 00888000
Ne 0 ""
Po -2992 -1654
$EndPAD
$PAD
Sh "103" R 472 98 0 0 0
Dr 0 0 0
At SMD N 00888000
Ne 0 ""
Po -2992 -1496
$EndPAD
$PAD
Sh "104" R 472 98 0 0 0
Dr 0 0 0
At SMD N 00888000
Ne 0 ""
Po -2992 -1339
$EndPAD
$PAD
Sh "105" R 472 98 0 0 0
Dr 0 0 0
At SMD N 00888000
Ne 0 ""
Po -2992 -1181
$EndPAD
$PAD
Sh "106" R 472 98 0 0 0
Dr 0 0 0
At SMD N 00888000
Ne 0 ""
Po -2992 -1024
$EndPAD
$PAD
Sh "107" R 472 98 0 0 0
Dr 0 0 0
At SMD N 00888000
Ne 0 ""
Po -2992 -866
$EndPAD
$PAD
Sh "108" R 472 98 0 0 0
Dr 0 0 0
At SMD N 00888000
Ne 0 ""
Po -2992 -709
$EndPAD
$PAD
Sh "109" R 472 98 0 0 0
Dr 0 0 0
At SMD N 00888000
Ne 0 ""
Po -2992 -551
$EndPAD
$PAD
Sh "110" R 472 98 0 0 0
Dr 0 0 0
At SMD N 00888000
Ne 0 ""
Po -2992 -394
$EndPAD
$PAD
Sh "111" R 472 98 0 0 0
Dr 0 0 0
At SMD N 00888000
Ne 0 ""
Po -2992 -236
$EndPAD
$PAD
Sh "112" R 472 98 0 0 0
Dr 0 0 0
At SMD N 00888000
Ne 0 ""
Po -2992 -79
$EndPAD
$PAD
Sh "113" R 472 98 0 0 0
Dr 0 0 0
At SMD N 00888000
Ne 0 ""
Po -2992 79
$EndPAD
$PAD
Sh "114" R 472 98 0 0 0
Dr 0 0 0
At SMD N 00888000
Ne 0 ""
Po -2992 236
$EndPAD
$PAD
Sh "115" R 472 98 0 0 0
Dr 0 0 0
At SMD N 00888000
Ne 0 ""
Po -2992 394
$EndPAD
$PAD
Sh "116" R 472 98 0 0 0
Dr 0 0 0
At SMD N 00888000
Ne 0 ""
Po -2992 551
$EndPAD
$PAD
Sh "117" R 472 98 0 0 0
Dr 0 0 0
At SMD N 00888000
Ne 0 ""
Po -2992 709
$EndPAD
$PAD
Sh "118" R 472 98 0 0 0
Dr 0 0 0
At SMD N 00888000
Ne 0 ""
Po -2992 866
$EndPAD
$PAD
Sh "119" R 472 98 0 0 0
Dr 0 0 0
At SMD N 00888000
Ne 0 ""
Po -2992 1024
$EndPAD
$PAD
Sh "120" R 472 98 0 0 0
Dr 0 0 0
At SMD N 00888000
Ne 0 ""
Po -2992 1181
$EndPAD
$PAD
Sh "121" R 472 98 0 0 0
Dr 0 0 0
At SMD N 00888000
Ne 0 ""
Po -2992 1339
$EndPAD
$PAD
Sh "122" R 472 98 0 0 0
Dr 0 0 0
At SMD N 00888000
Ne 0 ""
Po -2992 1496
$EndPAD
$PAD
Sh "123" R 472 98 0 0 0
Dr 0 0 0
At SMD N 00888000
Ne 0 ""
Po -2992 1654
$EndPAD
$PAD
Sh "124" R 472 98 0 0 0
Dr 0 0 0
At SMD N 00888000
Ne 0 ""
Po -2992 1811
$EndPAD
$PAD
Sh "125" R 472 98 0 0 0
Dr 0 0 0
At SMD N 00888000
Ne 0 ""
Po -2992 1969
$EndPAD
$PAD
Sh "126" R 472 98 0 0 0
Dr 0 0 0
At SMD N 00888000
Ne 0 ""
Po -2992 2126
$EndPAD
$PAD
Sh "127" R 472 98 0 0 0
Dr 0 0 0
At SMD N 00888000
Ne 0 ""
Po -2992 2283
$EndPAD
$PAD
Sh "128" R 472 98 0 0 0
Dr 0 0 0
At SMD N 00888000
Ne 0 ""
Po -2992 2441
$EndPAD
$SHAPE3D
Na "walter\smd_lqfp\lqfp-128.wrl"
Sc 1.000000 1.000000 1.000000
Of 0.000000 0.000000 0.000000
Ro 0.000000 0.000000 0.000000
$EndSHAPE3D
$EndMODULE  LQFP-128
$MODULE LQFP-32
Po 0 0 0 15 49EA21BE 00000000 ~~
Li lqfp32
Cd LQFP-32
Sc 00000000
AR
Op 0 0 0
T0 0 450 295 295 0 59 N V 21 N"LQFP-32"
T1 0 -450 295 295 0 59 N V 21 N"U***"
DC -950 950 -1050 1000 50 21
DS 1400 1250 1250 1400 50 21
DS 1250 1400 -1250 1400 50 21
DS -1250 1400 -1400 1250 50 21
DS -1400 1250 -1400 -1250 50 21
DS -1400 -1250 -1250 -1400 50 21
DS -1250 -1400 1250 -1400 50 21
DS 1250 -1400 1400 -1250 50 21
DS 1400 -1250 1400 1250 50 21
$PAD
Sh "4" R 217 512 0 0 0
Dr 0 0 0
At SMD N 00888000
Ne 0 ""
Po -157 1614
$EndPAD
$PAD
Sh "5" R 217 512 0 0 0
Dr 0 0 0
At SMD N 00888000
Ne 0 ""
Po 157 1614
$EndPAD
$PAD
Sh "6" R 217 512 0 0 0
Dr 0 0 0
At SMD N 00888000
Ne 0 ""
Po 472 1614
$EndPAD
$PAD
Sh "7" R 217 512 0 0 0
Dr 0 0 0
At SMD N 00888000
Ne 0 ""
Po 787 1614
$EndPAD
$PAD
Sh "8" R 217 512 0 0 0
Dr 0 0 0
At SMD N 00888000
Ne 0 ""
Po 1102 1614
$EndPAD
$PAD
Sh "1" R 217 512 0 0 0
Dr 0 0 0
At SMD N 00888000
Ne 0 ""
Po -1102 1614
$EndPAD
$PAD
Sh "2" R 217 512 0 0 0
Dr 0 0 0
At SMD N 00888000
Ne 0 ""
Po -787 1614
$EndPAD
$PAD
Sh "3" R 217 512 0 0 0
Dr 0 0 0
At SMD N 00888000
Ne 0 ""
Po -472 1614
$EndPAD
$PAD
Sh "9" R 512 217 0 0 0
Dr 0 0 0
At SMD N 00888000
Ne 0 ""
Po 1614 1102
$EndPAD
$PAD
Sh "10" R 512 217 0 0 0
Dr 0 0 0
At SMD N 00888000
Ne 0 ""
Po 1614 787
$EndPAD
$PAD
Sh "11" R 512 217 0 0 0
Dr 0 0 0
At SMD N 00888000
Ne 0 ""
Po 1614 472
$EndPAD
$PAD
Sh "12" R 512 217 0 0 0
Dr 0 0 0
At SMD N 00888000
Ne 0 ""
Po 1614 157
$EndPAD
$PAD
Sh "13" R 512 217 0 0 0
Dr 0 0 0
At SMD N 00888000
Ne 0 ""
Po 1614 -157
$EndPAD
$PAD
Sh "14" R 512 217 0 0 0
Dr 0 0 0
At SMD N 00888000
Ne 0 ""
Po 1614 -472
$EndPAD
$PAD
Sh "15" R 512 217 0 0 0
Dr 0 0 0
At SMD N 00888000
Ne 0 ""
Po 1614 -787
$EndPAD
$PAD
Sh "16" R 512 217 0 0 0
Dr 0 0 0
At SMD N 00888000
Ne 0 ""
Po 1614 -1102
$EndPAD
$PAD
Sh "17" R 217 512 0 0 0
Dr 0 0 0
At SMD N 00888000
Ne 0 ""
Po 1102 -1614
$EndPAD
$PAD
Sh "18" R 217 512 0 0 0
Dr 0 0 0
At SMD N 00888000
Ne 0 ""
Po 787 -1614
$EndPAD
$PAD
Sh "19" R 217 512 0 0 0
Dr 0 0 0
At SMD N 00888000
Ne 0 ""
Po 472 -1614
$EndPAD
$PAD
Sh "20" R 217 512 0 0 0
Dr 0 0 0
At SMD N 00888000
Ne 0 ""
Po 157 -1614
$EndPAD
$PAD
Sh "21" R 217 512 0 0 0
Dr 0 0 0
At SMD N 00888000
Ne 0 ""
Po -157 -1614
$EndPAD
$PAD
Sh "22" R 217 512 0 0 0
Dr 0 0 0
At SMD N 00888000
Ne 0 ""
Po -472 -1614
$EndPAD
$PAD
Sh "23" R 217 512 0 0 0
Dr 0 0 0
At SMD N 00888000
Ne 0 ""
Po -787 -1614
$EndPAD
$PAD
Sh "24" R 217 512 0 0 0
Dr 0 0 0
At SMD N 00888000
Ne 0 ""
Po -1102 -1614
$EndPAD
$PAD
Sh "25" R 512 217 0 0 0
Dr 0 0 0
At SMD N 00888000
Ne 0 ""
Po -1614 -1102
$EndPAD
$PAD
Sh "26" R 512 217 0 0 0
Dr 0 0 0
At SMD N 00888000
Ne 0 ""
Po -1614 -787
$EndPAD
$PAD
Sh "27" R 512 217 0 0 0
Dr 0 0 0
At SMD N 00888000
Ne 0 ""
Po -1614 -472
$EndPAD
$PAD
Sh "28" R 512 217 0 0 0
Dr 0 0 0
At SMD N 00888000
Ne 0 ""
Po -1614 -157
$EndPAD
$PAD
Sh "29" R 512 217 0 0 0
Dr 0 0 0
At SMD N 00888000
Ne 0 ""
Po -1614 157
$EndPAD
$PAD
Sh "30" R 512 217 0 0 0
Dr 0 0 0
At SMD N 00888000
Ne 0 ""
Po -1614 472
$EndPAD
$PAD
Sh "31" R 512 217 0 0 0
Dr 0 0 0
At SMD N 00888000
Ne 0 ""
Po -1614 787
$EndPAD
$PAD
Sh "32" R 512 217 0 0 0
Dr 0 0 0
At SMD N 00888000
Ne 0 ""
Po -1614 1102
$EndPAD
$SHAPE3D
Na "walter\smd_lqfp\lqfp-32.wrl"
Sc 1.000000 1.000000 1.000000
Of 0.000000 0.000000 0.000000
Ro 0.000000 0.000000 0.000000
$EndSHAPE3D
$EndMODULE  LQFP-32
$MODULE TQFP-100
Po 0 0 0 15 4E52A984 00000000 ~~
Li TQFP-100
Cd TQFP-100
Sc 00000000
AR lqfp64
Op 0 0 0
T0 0 -394 295 295 0 59 N V 21 N "U***"
T1 0 394 295 295 0 59 N V 21 N "TQFP-100"
DS -2559 2756 -2756 2559 59 21
DS -2756 2559 -2756 -2559 59 21
DS -2756 -2559 -2559 -2756 59 21
DS -2559 -2756 2559 -2756 59 21
DS 2559 -2756 2756 -2559 59 21
DS 2756 -2559 2756 2559 59 21
DS 2756 2559 2559 2756 59 21
DS 2559 2756 -2559 2756 59 21
DC -2397 2397 -2487 2517 50 21
$PAD
Sh "4" R 118 512 0 0 0
Dr 0 0 0
At SMD N 00888000
Ne 0 ""
Po -1772 3022
$EndPAD
$PAD
Sh "5" R 118 512 0 0 0
Dr 0 0 0
At SMD N 00888000
Ne 0 ""
Po -1575 3022
$EndPAD
$PAD
Sh "6" R 118 512 0 0 0
Dr 0 0 0
At SMD N 00888000
Ne 0 ""
Po -1378 3022
$EndPAD
$PAD
Sh "7" R 118 512 0 0 0
Dr 0 0 0
At SMD N 00888000
Ne 0 ""
Po -1181 3022
$EndPAD
$PAD
Sh "8" R 118 512 0 0 0
Dr 0 0 0
At SMD N 00888000
Ne 0 ""
Po -984 3022
$EndPAD
$PAD
Sh "1" R 118 512 0 0 0
Dr 0 0 0
At SMD N 00888000
Ne 0 ""
Po -2362 3022
$EndPAD
$PAD
Sh "2" R 118 512 0 0 0
Dr 0 0 0
At SMD N 00888000
Ne 0 ""
Po -2165 3022
$EndPAD
$PAD
Sh "3" R 118 512 0 0 0
Dr 0 0 0
At SMD N 00888000
Ne 0 ""
Po -1969 3022
$EndPAD
$PAD
Sh "17" R 118 512 0 0 0
Dr 0 0 0
At SMD N 00888000
Ne 0 ""
Po 787 3022
$EndPAD
$PAD
Sh "18" R 118 512 0 0 0
Dr 0 0 0
At SMD N 00888000
Ne 0 ""
Po 984 3022
$EndPAD
$PAD
Sh "19" R 118 512 0 0 0
Dr 0 0 0
At SMD N 00888000
Ne 0 ""
Po 1181 3022
$EndPAD
$PAD
Sh "20" R 118 512 0 0 0
Dr 0 0 0
At SMD N 00888000
Ne 0 ""
Po 1378 3022
$EndPAD
$PAD
Sh "21" R 118 512 0 0 0
Dr 0 0 0
At SMD N 00888000
Ne 0 ""
Po 1575 3022
$EndPAD
$PAD
Sh "22" R 118 512 0 0 0
Dr 0 0 0
At SMD N 00888000
Ne 0 ""
Po 1772 3022
$EndPAD
$PAD
Sh "23" R 118 512 0 0 0
Dr 0 0 0
At SMD N 00888000
Ne 0 ""
Po 1969 3022
$EndPAD
$PAD
Sh "24" R 118 512 0 0 0
Dr 0 0 0
At SMD N 00888000
Ne 0 ""
Po 2165 3022
$EndPAD
$PAD
Sh "33" R 512 118 0 0 0
Dr 0 0 0
At SMD N 00888000
Ne 0 ""
Po 3022 984
$EndPAD
$PAD
Sh "34" R 512 118 0 0 0
Dr 0 0 0
At SMD N 00888000
Ne 0 ""
Po 3022 787
$EndPAD
$PAD
Sh "35" R 512 118 0 0 0
Dr 0 0 0
At SMD N 00888000
Ne 0 ""
Po 3022 591
$EndPAD
$PAD
Sh "36" R 512 118 0 0 0
Dr 0 0 0
At SMD N 00888000
Ne 0 ""
Po 3022 394
$EndPAD
$PAD
Sh "37" R 512 118 0 0 0
Dr 0 0 0
At SMD N 00888000
Ne 0 ""
Po 3022 197
$EndPAD
$PAD
Sh "38" R 512 118 0 0 0
Dr 0 0 0
At SMD N 00888000
Ne 0 ""
Po 3022 0
$EndPAD
$PAD
Sh "39" R 512 118 0 0 0
Dr 0 0 0
At SMD N 00888000
Ne 0 ""
Po 3022 -197
$EndPAD
$PAD
Sh "40" R 512 118 0 0 0
Dr 0 0 0
At SMD N 00888000
Ne 0 ""
Po 3022 -394
$EndPAD
$PAD
Sh "49" R 512 118 0 0 0
Dr 0 0 0
At SMD N 00888000
Ne 0 ""
Po 3022 -2165
$EndPAD
$PAD
Sh "50" R 512 118 0 0 0
Dr 0 0 0
At SMD N 00888000
Ne 0 ""
Po 3022 -2362
$EndPAD
$PAD
Sh "51" R 118 512 0 0 0
Dr 0 0 0
At SMD N 00888000
Ne 0 ""
Po 2362 -3022
$EndPAD
$PAD
Sh "52" R 118 512 0 0 0
Dr 0 0 0
At SMD N 00888000
Ne 0 ""
Po 2165 -3022
$EndPAD
$PAD
Sh "53" R 118 512 0 0 0
Dr 0 0 0
At SMD N 00888000
Ne 0 ""
Po 1969 -3022
$EndPAD
$PAD
Sh "54" R 118 512 0 0 0
Dr 0 0 0
At SMD N 00888000
Ne 0 ""
Po 1772 -3022
$EndPAD
$PAD
Sh "55" R 118 512 0 0 0
Dr 0 0 0
At SMD N 00888000
Ne 0 ""
Po 1575 -3022
$EndPAD
$PAD
Sh "56" R 118 512 0 0 0
Dr 0 0 0
At SMD N 00888000
Ne 0 ""
Po 1378 -3022
$EndPAD
$PAD
Sh "9" R 118 512 0 0 0
Dr 0 0 0
At SMD N 00888000
Ne 0 ""
Po -787 3022
$EndPAD
$PAD
Sh "10" R 118 512 0 0 0
Dr 0 0 0
At SMD N 00888000
Ne 0 ""
Po -591 3022
$EndPAD
$PAD
Sh "11" R 118 512 0 0 0
Dr 0 0 0
At SMD N 00888000
Ne 0 ""
Po -394 3022
$EndPAD
$PAD
Sh "25" R 118 512 0 0 0
Dr 0 0 0
At SMD N 00888000
Ne 0 ""
Po 2362 3022
$EndPAD
$PAD
Sh "26" R 512 118 0 0 0
Dr 0 0 0
At SMD N 00888000
Ne 0 ""
Po 3022 2362
$EndPAD
$PAD
Sh "27" R 512 118 0 0 0
Dr 0 0 0
At SMD N 00888000
Ne 0 ""
Po 3022 2165
$EndPAD
$PAD
Sh "41" R 512 118 0 0 0
Dr 0 0 0
At SMD N 00888000
Ne 0 ""
Po 3022 -591
$EndPAD
$PAD
Sh "42" R 512 118 0 0 0
Dr 0 0 0
At SMD N 00888000
Ne 0 ""
Po 3022 -787
$EndPAD
$PAD
Sh "43" R 512 118 0 0 0
Dr 0 0 0
At SMD N 00888000
Ne 0 ""
Po 3022 -984
$EndPAD
$PAD
Sh "57" R 118 512 0 0 0
Dr 0 0 0
At SMD N 00888000
Ne 0 ""
Po 1181 -3022
$EndPAD
$PAD
Sh "58" R 118 512 0 0 0
Dr 0 0 0
At SMD N 00888000
Ne 0 ""
Po 984 -3022
$EndPAD
$PAD
Sh "59" R 118 512 0 0 0
Dr 0 0 0
At SMD N 00888000
Ne 0 ""
Po 787 -3022
$EndPAD
$PAD
Sh "12" R 118 512 0 0 0
Dr 0 0 0
At SMD N 00888000
Ne 0 ""
Po -197 3022
$EndPAD
$PAD
Sh "13" R 118 512 0 0 0
Dr 0 0 0
At SMD N 00888000
Ne 0 ""
Po 0 3022
$EndPAD
$PAD
Sh "14" R 118 512 0 0 0
Dr 0 0 0
At SMD N 00888000
Ne 0 ""
Po 197 3022
$EndPAD
$PAD
Sh "15" R 118 512 0 0 0
Dr 0 0 0
At SMD N 00888000
Ne 0 ""
Po 394 3022
$EndPAD
$PAD
Sh "16" R 118 512 0 0 0
Dr 0 0 0
At SMD N 00888000
Ne 0 ""
Po 591 3022
$EndPAD
$PAD
Sh "28" R 512 118 0 0 0
Dr 0 0 0
At SMD N 00888000
Ne 0 ""
Po 3022 1969
$EndPAD
$PAD
Sh "29" R 512 118 0 0 0
Dr 0 0 0
At SMD N 00888000
Ne 0 ""
Po 3022 1772
$EndPAD
$PAD
Sh "30" R 512 118 0 0 0
Dr 0 0 0
At SMD N 00888000
Ne 0 ""
Po 3022 1575
$EndPAD
$PAD
Sh "31" R 512 118 0 0 0
Dr 0 0 0
At SMD N 00888000
Ne 0 ""
Po 3022 1378
$EndPAD
$PAD
Sh "32" R 512 118 0 0 0
Dr 0 0 0
At SMD N 00888000
Ne 0 ""
Po 3022 1181
$EndPAD
$PAD
Sh "44" R 512 118 0 0 0
Dr 0 0 0
At SMD N 00888000
Ne 0 ""
Po 3022 -1181
$EndPAD
$PAD
Sh "45" R 512 118 0 0 0
Dr 0 0 0
At SMD N 00888000
Ne 0 ""
Po 3022 -1378
$EndPAD
$PAD
Sh "46" R 512 118 0 0 0
Dr 0 0 0
At SMD N 00888000
Ne 0 ""
Po 3022 -1575
$EndPAD
$PAD
Sh "47" R 512 118 0 0 0
Dr 0 0 0
At SMD N 00888000
Ne 0 ""
Po 3022 -1772
$EndPAD
$PAD
Sh "48" R 512 118 0 0 0
Dr 0 0 0
At SMD N 00888000
Ne 0 ""
Po 3022 -1969
$EndPAD
$PAD
Sh "60" R 118 512 0 0 0
Dr 0 0 0
At SMD N 00888000
Ne 0 ""
Po 591 -3022
$EndPAD
$PAD
Sh "61" R 118 512 0 0 0
Dr 0 0 0
At SMD N 00888000
Ne 0 ""
Po 394 -3022
$EndPAD
$PAD
Sh "62" R 118 512 0 0 0
Dr 0 0 0
At SMD N 00888000
Ne 0 ""
Po 197 -3022
$EndPAD
$PAD
Sh "63" R 118 512 0 0 0
Dr 0 0 0
At SMD N 00888000
Ne 0 ""
Po 0 -3022
$EndPAD
$PAD
Sh "64" R 118 512 0 0 0
Dr 0 0 0
At SMD N 00888000
Ne 0 ""
Po -197 -3022
$EndPAD
$PAD
Sh "65" R 118 512 0 0 0
Dr 0 0 0
At SMD N 00888000
Ne 0 ""
Po -394 -3022
$EndPAD
$PAD
Sh "66" R 118 512 0 0 0
Dr 0 0 0
At SMD N 00888000
Ne 0 ""
Po -591 -3022
$EndPAD
$PAD
Sh "67" R 118 512 0 0 0
Dr 0 0 0
At SMD N 00888000
Ne 0 ""
Po -787 -3022
$EndPAD
$PAD
Sh "68" R 118 512 0 0 0
Dr 0 0 0
At SMD N 00888000
Ne 0 ""
Po -984 -3022
$EndPAD
$PAD
Sh "69" R 118 512 0 0 0
Dr 0 0 0
At SMD N 00888000
Ne 0 ""
Po -1181 -3022
$EndPAD
$PAD
Sh "70" R 118 512 0 0 0
Dr 0 0 0
At SMD N 00888000
Ne 0 ""
Po -1378 -3022
$EndPAD
$PAD
Sh "71" R 118 512 0 0 0
Dr 0 0 0
At SMD N 00888000
Ne 0 ""
Po -1575 -3022
$EndPAD
$PAD
Sh "72" R 118 512 0 0 0
Dr 0 0 0
At SMD N 00888000
Ne 0 ""
Po -1772 -3022
$EndPAD
$PAD
Sh "73" R 118 512 0 0 0
Dr 0 0 0
At SMD N 00888000
Ne 0 ""
Po -1969 -3022
$EndPAD
$PAD
Sh "74" R 118 512 0 0 0
Dr 0 0 0
At SMD N 00888000
Ne 0 ""
Po -2165 -3022
$EndPAD
$PAD
Sh "75" R 118 512 0 0 0
Dr 0 0 0
At SMD N 00888000
Ne 0 ""
Po -2362 -3022
$EndPAD
$PAD
Sh "76" R 512 118 0 0 0
Dr 0 0 0
At SMD N 00888000
Ne 0 ""
Po -3022 -2362
$EndPAD
$PAD
Sh "77" R 512 118 0 0 0
Dr 0 0 0
At SMD N 00888000
Ne 0 ""
Po -3022 -2165
$EndPAD
$PAD
Sh "78" R 512 118 0 0 0
Dr 0 0 0
At SMD N 00888000
Ne 0 ""
Po -3022 -1969
$EndPAD
$PAD
Sh "79" R 512 118 0 0 0
Dr 0 0 0
At SMD N 00888000
Ne 0 ""
Po -3022 -1772
$EndPAD
$PAD
Sh "80" R 512 118 0 0 0
Dr 0 0 0
At SMD N 00888000
Ne 0 ""
Po -3022 -1575
$EndPAD
$PAD
Sh "81" R 512 118 0 0 0
Dr 0 0 0
At SMD N 00888000
Ne 0 ""
Po -3022 -1378
$EndPAD
$PAD
Sh "82" R 512 118 0 0 0
Dr 0 0 0
At SMD N 00888000
Ne 0 ""
Po -3022 -1181
$EndPAD
$PAD
Sh "83" R 512 118 0 0 0
Dr 0 0 0
At SMD N 00888000
Ne 0 ""
Po -3022 -984
$EndPAD
$PAD
Sh "84" R 512 118 0 0 0
Dr 0 0 0
At SMD N 00888000
Ne 0 ""
Po -3022 -787
$EndPAD
$PAD
Sh "85" R 512 118 0 0 0
Dr 0 0 0
At SMD N 00888000
Ne 0 ""
Po -3022 -591
$EndPAD
$PAD
Sh "86" R 512 118 0 0 0
Dr 0 0 0
At SMD N 00888000
Ne 0 ""
Po -3022 -394
$EndPAD
$PAD
Sh "87" R 512 118 0 0 0
Dr 0 0 0
At SMD N 00888000
Ne 0 ""
Po -3022 -197
$EndPAD
$PAD
Sh "88" R 512 118 0 0 0
Dr 0 0 0
At SMD N 00888000
Ne 0 ""
Po -3022 0
$EndPAD
$PAD
Sh "89" R 512 118 0 0 0
Dr 0 0 0
At SMD N 00888000
Ne 0 ""
Po -3022 197
$EndPAD
$PAD
Sh "90" R 512 118 0 0 0
Dr 0 0 0
At SMD N 00888000
Ne 0 ""
Po -3022 394
$EndPAD
$PAD
Sh "91" R 512 118 0 0 0
Dr 0 0 0
At SMD N 00888000
Ne 0 ""
Po -3022 591
$EndPAD
$PAD
Sh "92" R 512 118 0 0 0
Dr 0 0 0
At SMD N 00888000
Ne 0 ""
Po -3022 787
$EndPAD
$PAD
Sh "93" R 512 118 0 0 0
Dr 0 0 0
At SMD N 00888000
Ne 0 ""
Po -3022 984
$EndPAD
$PAD
Sh "94" R 512 118 0 0 0
Dr 0 0 0
At SMD N 00888000
Ne 0 ""
Po -3022 1181
$EndPAD
$PAD
Sh "95" R 512 118 0 0 0
Dr 0 0 0
At SMD N 00888000
Ne 0 ""
Po -3022 1378
$EndPAD
$PAD
Sh "96" R 512 118 0 0 0
Dr 0 0 0
At SMD N 00888000
Ne 0 ""
Po -3022 1575
$EndPAD
$PAD
Sh "97" R 512 118 0 0 0
Dr 0 0 0
At SMD N 00888000
Ne 0 ""
Po -3022 1772
$EndPAD
$PAD
Sh "98" R 512 118 0 0 0
Dr 0 0 0
At SMD N 00888000
Ne 0 ""
Po -3022 1969
$EndPAD
$PAD
Sh "99" R 512 118 0 0 0
Dr 0 0 0
At SMD N 00888000
Ne 0 ""
Po -3022 2165
$EndPAD
$PAD
Sh "100" R 512 118 0 0 0
Dr 0 0 0
At SMD N 00888000
Ne 0 ""
Po -3022 2362
$EndPAD
$SHAPE3D
Na "walter\smd_lqfp\tqfp-100.wrl"
Sc 1.000000 1.000000 1.000000
Of 0.000000 0.000000 0.000000
Ro 0.000000 0.000000 0.000000
$EndSHAPE3D
$EndMODULE  TQFP-100
$MODULE TQFP-144
Po 0 0 0 15 4E52B045 00000000 ~~
Li TQFP-144
Cd TQFP-144
Sc 00000000
AR lqfp64
Op 0 0 0
T0 0 -394 394 394 0 79 N V 21 N "U***"
T1 0 394 394 394 0 79 N V 21 N "TQFP-144"
DC -3504 3504 -3661 3661 59 21
DS -3740 3937 -3937 3740 59 21
DS -3937 3740 -3937 -3740 59 21
DS -3937 -3740 -3740 -3937 59 21
DS -3740 -3937 3740 -3937 59 21
DS 3740 -3937 3937 -3740 59 21
DS 3937 -3740 3937 3740 59 21
DS 3937 3740 3740 3937 59 21
DS 3740 3937 -3740 3937 59 21
$PAD
Sh "4" R 114 531 0 0 0
Dr 0 0 0
At SMD N 00888000
Ne 0 ""
Po -2854 4222
$EndPAD
$PAD
Sh "5" R 114 531 0 0 0
Dr 0 0 0
At SMD N 00888000
Ne 0 ""
Po -2657 4222
$EndPAD
$PAD
Sh "6" R 114 531 0 0 0
Dr 0 0 0
At SMD N 00888000
Ne 0 ""
Po -2461 4222
$EndPAD
$PAD
Sh "7" R 114 531 0 0 0
Dr 0 0 0
At SMD N 00888000
Ne 0 ""
Po -2264 4222
$EndPAD
$PAD
Sh "8" R 114 531 0 0 0
Dr 0 0 0
At SMD N 00888000
Ne 0 ""
Po -2067 4222
$EndPAD
$PAD
Sh "1" R 114 531 0 0 0
Dr 0 0 0
At SMD N 00888000
Ne 0 ""
Po -3445 4222
$EndPAD
$PAD
Sh "2" R 114 531 0 0 0
Dr 0 0 0
At SMD N 00888000
Ne 0 ""
Po -3248 4222
$EndPAD
$PAD
Sh "3" R 114 531 0 0 0
Dr 0 0 0
At SMD N 00888000
Ne 0 ""
Po -3051 4222
$EndPAD
$PAD
Sh "17" R 114 531 0 0 0
Dr 0 0 0
At SMD N 00888000
Ne 0 ""
Po -295 4222
$EndPAD
$PAD
Sh "18" R 114 531 0 0 0
Dr 0 0 0
At SMD N 00888000
Ne 0 ""
Po -98 4222
$EndPAD
$PAD
Sh "19" R 114 531 0 0 0
Dr 0 0 0
At SMD N 00888000
Ne 0 ""
Po 98 4222
$EndPAD
$PAD
Sh "20" R 114 531 0 0 0
Dr 0 0 0
At SMD N 00888000
Ne 0 ""
Po 295 4222
$EndPAD
$PAD
Sh "21" R 114 531 0 0 0
Dr 0 0 0
At SMD N 00888000
Ne 0 ""
Po 492 4222
$EndPAD
$PAD
Sh "22" R 114 531 0 0 0
Dr 0 0 0
At SMD N 00888000
Ne 0 ""
Po 689 4222
$EndPAD
$PAD
Sh "23" R 114 531 0 0 0
Dr 0 0 0
At SMD N 00888000
Ne 0 ""
Po 886 4222
$EndPAD
$PAD
Sh "24" R 114 531 0 0 0
Dr 0 0 0
At SMD N 00888000
Ne 0 ""
Po 1083 4222
$EndPAD
$PAD
Sh "33" R 114 531 0 0 0
Dr 0 0 0
At SMD N 00888000
Ne 0 ""
Po 2854 4222
$EndPAD
$PAD
Sh "34" R 114 531 0 0 0
Dr 0 0 0
At SMD N 00888000
Ne 0 ""
Po 3051 4222
$EndPAD
$PAD
Sh "35" R 114 531 0 0 0
Dr 0 0 0
At SMD N 00888000
Ne 0 ""
Po 3248 4222
$EndPAD
$PAD
Sh "36" R 114 531 0 0 0
Dr 0 0 0
At SMD N 00888000
Ne 0 ""
Po 3445 4222
$EndPAD
$PAD
Sh "37" R 531 114 0 0 0
Dr 0 0 0
At SMD N 00888000
Ne 0 ""
Po 4222 3445
$EndPAD
$PAD
Sh "38" R 531 114 0 0 0
Dr 0 0 0
At SMD N 00888000
Ne 0 ""
Po 4222 3248
$EndPAD
$PAD
Sh "39" R 531 114 0 0 0
Dr 0 0 0
At SMD N 00888000
Ne 0 ""
Po 4222 3051
$EndPAD
$PAD
Sh "40" R 531 114 0 0 0
Dr 0 0 0
At SMD N 00888000
Ne 0 ""
Po 4222 2854
$EndPAD
$PAD
Sh "49" R 531 114 0 0 0
Dr 0 0 0
At SMD N 00888000
Ne 0 ""
Po 4222 1083
$EndPAD
$PAD
Sh "50" R 531 114 0 0 0
Dr 0 0 0
At SMD N 00888000
Ne 0 ""
Po 4222 886
$EndPAD
$PAD
Sh "51" R 531 114 0 0 0
Dr 0 0 0
At SMD N 00888000
Ne 0 ""
Po 4222 689
$EndPAD
$PAD
Sh "52" R 531 114 0 0 0
Dr 0 0 0
At SMD N 00888000
Ne 0 ""
Po 4222 492
$EndPAD
$PAD
Sh "53" R 531 114 0 0 0
Dr 0 0 0
At SMD N 00888000
Ne 0 ""
Po 4222 295
$EndPAD
$PAD
Sh "54" R 531 114 0 0 0
Dr 0 0 0
At SMD N 00888000
Ne 0 ""
Po 4222 98
$EndPAD
$PAD
Sh "55" R 531 114 0 0 0
Dr 0 0 0
At SMD N 00888000
Ne 0 ""
Po 4222 -98
$EndPAD
$PAD
Sh "56" R 531 114 0 0 0
Dr 0 0 0
At SMD N 00888000
Ne 0 ""
Po 4222 -295
$EndPAD
$PAD
Sh "9" R 114 531 0 0 0
Dr 0 0 0
At SMD N 00888000
Ne 0 ""
Po -1870 4222
$EndPAD
$PAD
Sh "10" R 114 531 0 0 0
Dr 0 0 0
At SMD N 00888000
Ne 0 ""
Po -1673 4222
$EndPAD
$PAD
Sh "11" R 114 531 0 0 0
Dr 0 0 0
At SMD N 00888000
Ne 0 ""
Po -1476 4222
$EndPAD
$PAD
Sh "25" R 114 531 0 0 0
Dr 0 0 0
At SMD N 00888000
Ne 0 ""
Po 1280 4222
$EndPAD
$PAD
Sh "26" R 114 531 0 0 0
Dr 0 0 0
At SMD N 00888000
Ne 0 ""
Po 1476 4222
$EndPAD
$PAD
Sh "27" R 114 531 0 0 0
Dr 0 0 0
At SMD N 00888000
Ne 0 ""
Po 1673 4222
$EndPAD
$PAD
Sh "41" R 531 114 0 0 0
Dr 0 0 0
At SMD N 00888000
Ne 0 ""
Po 4222 2657
$EndPAD
$PAD
Sh "42" R 531 114 0 0 0
Dr 0 0 0
At SMD N 00888000
Ne 0 ""
Po 4222 2461
$EndPAD
$PAD
Sh "43" R 531 114 0 0 0
Dr 0 0 0
At SMD N 00888000
Ne 0 ""
Po 4222 2264
$EndPAD
$PAD
Sh "57" R 531 114 0 0 0
Dr 0 0 0
At SMD N 00888000
Ne 0 ""
Po 4222 -492
$EndPAD
$PAD
Sh "58" R 531 114 0 0 0
Dr 0 0 0
At SMD N 00888000
Ne 0 ""
Po 4222 -689
$EndPAD
$PAD
Sh "59" R 531 114 0 0 0
Dr 0 0 0
At SMD N 00888000
Ne 0 ""
Po 4222 -886
$EndPAD
$PAD
Sh "12" R 114 531 0 0 0
Dr 0 0 0
At SMD N 00888000
Ne 0 ""
Po -1280 4222
$EndPAD
$PAD
Sh "13" R 114 531 0 0 0
Dr 0 0 0
At SMD N 00888000
Ne 0 ""
Po -1083 4222
$EndPAD
$PAD
Sh "14" R 114 531 0 0 0
Dr 0 0 0
At SMD N 00888000
Ne 0 ""
Po -886 4222
$EndPAD
$PAD
Sh "15" R 114 531 0 0 0
Dr 0 0 0
At SMD N 00888000
Ne 0 ""
Po -689 4222
$EndPAD
$PAD
Sh "16" R 114 531 0 0 0
Dr 0 0 0
At SMD N 00888000
Ne 0 ""
Po -492 4222
$EndPAD
$PAD
Sh "28" R 114 531 0 0 0
Dr 0 0 0
At SMD N 00888000
Ne 0 ""
Po 1870 4222
$EndPAD
$PAD
Sh "29" R 114 531 0 0 0
Dr 0 0 0
At SMD N 00888000
Ne 0 ""
Po 2067 4222
$EndPAD
$PAD
Sh "30" R 114 531 0 0 0
Dr 0 0 0
At SMD N 00888000
Ne 0 ""
Po 2264 4222
$EndPAD
$PAD
Sh "31" R 114 531 0 0 0
Dr 0 0 0
At SMD N 00888000
Ne 0 ""
Po 2461 4222
$EndPAD
$PAD
Sh "32" R 114 531 0 0 0
Dr 0 0 0
At SMD N 00888000
Ne 0 ""
Po 2657 4222
$EndPAD
$PAD
Sh "44" R 531 114 0 0 0
Dr 0 0 0
At SMD N 00888000
Ne 0 ""
Po 4222 2067
$EndPAD
$PAD
Sh "45" R 531 114 0 0 0
Dr 0 0 0
At SMD N 00888000
Ne 0 ""
Po 4222 1870
$EndPAD
$PAD
Sh "46" R 531 114 0 0 0
Dr 0 0 0
At SMD N 00888000
Ne 0 ""
Po 4222 1673
$EndPAD
$PAD
Sh "47" R 531 114 0 0 0
Dr 0 0 0
At SMD N 00888000
Ne 0 ""
Po 4222 1476
$EndPAD
$PAD
Sh "48" R 531 114 0 0 0
Dr 0 0 0
At SMD N 00888000
Ne 0 ""
Po 4222 1280
$EndPAD
$PAD
Sh "60" R 531 114 0 0 0
Dr 0 0 0
At SMD N 00888000
Ne 0 ""
Po 4222 -1083
$EndPAD
$PAD
Sh "61" R 531 114 0 0 0
Dr 0 0 0
At SMD N 00888000
Ne 0 ""
Po 4222 -1280
$EndPAD
$PAD
Sh "62" R 531 114 0 0 0
Dr 0 0 0
At SMD N 00888000
Ne 0 ""
Po 4222 -1476
$EndPAD
$PAD
Sh "63" R 531 114 0 0 0
Dr 0 0 0
At SMD N 00888000
Ne 0 ""
Po 4222 -1673
$EndPAD
$PAD
Sh "64" R 531 114 0 0 0
Dr 0 0 0
At SMD N 00888000
Ne 0 ""
Po 4222 -1870
$EndPAD
$PAD
Sh "65" R 531 114 0 0 0
Dr 0 0 0
At SMD N 00888000
Ne 0 ""
Po 4222 -2067
$EndPAD
$PAD
Sh "66" R 531 114 0 0 0
Dr 0 0 0
At SMD N 00888000
Ne 0 ""
Po 4222 -2264
$EndPAD
$PAD
Sh "67" R 531 114 0 0 0
Dr 0 0 0
At SMD N 00888000
Ne 0 ""
Po 4222 -2461
$EndPAD
$PAD
Sh "68" R 531 114 0 0 0
Dr 0 0 0
At SMD N 00888000
Ne 0 ""
Po 4222 -2657
$EndPAD
$PAD
Sh "69" R 531 114 0 0 0
Dr 0 0 0
At SMD N 00888000
Ne 0 ""
Po 4222 -2854
$EndPAD
$PAD
Sh "70" R 531 114 0 0 0
Dr 0 0 0
At SMD N 00888000
Ne 0 ""
Po 4222 -3051
$EndPAD
$PAD
Sh "71" R 531 114 0 0 0
Dr 0 0 0
At SMD N 00888000
Ne 0 ""
Po 4222 -3248
$EndPAD
$PAD
Sh "72" R 531 114 0 0 0
Dr 0 0 0
At SMD N 00888000
Ne 0 ""
Po 4222 -3445
$EndPAD
$PAD
Sh "73" R 114 531 0 0 0
Dr 0 0 0
At SMD N 00888000
Ne 0 ""
Po 3445 -4222
$EndPAD
$PAD
Sh "74" R 114 531 0 0 0
Dr 0 0 0
At SMD N 00888000
Ne 0 ""
Po 3248 -4222
$EndPAD
$PAD
Sh "75" R 114 531 0 0 0
Dr 0 0 0
At SMD N 00888000
Ne 0 ""
Po 3051 -4222
$EndPAD
$PAD
Sh "76" R 114 531 0 0 0
Dr 0 0 0
At SMD N 00888000
Ne 0 ""
Po 2854 -4222
$EndPAD
$PAD
Sh "77" R 114 531 0 0 0
Dr 0 0 0
At SMD N 00888000
Ne 0 ""
Po 2657 -4222
$EndPAD
$PAD
Sh "78" R 114 531 0 0 0
Dr 0 0 0
At SMD N 00888000
Ne 0 ""
Po 2461 -4222
$EndPAD
$PAD
Sh "79" R 114 531 0 0 0
Dr 0 0 0
At SMD N 00888000
Ne 0 ""
Po 2264 -4222
$EndPAD
$PAD
Sh "80" R 114 531 0 0 0
Dr 0 0 0
At SMD N 00888000
Ne 0 ""
Po 2067 -4222
$EndPAD
$PAD
Sh "81" R 114 531 0 0 0
Dr 0 0 0
At SMD N 00888000
Ne 0 ""
Po 1870 -4222
$EndPAD
$PAD
Sh "82" R 114 531 0 0 0
Dr 0 0 0
At SMD N 00888000
Ne 0 ""
Po 1673 -4222
$EndPAD
$PAD
Sh "83" R 114 531 0 0 0
Dr 0 0 0
At SMD N 00888000
Ne 0 ""
Po 1476 -4222
$EndPAD
$PAD
Sh "84" R 114 531 0 0 0
Dr 0 0 0
At SMD N 00888000
Ne 0 ""
Po 1280 -4222
$EndPAD
$PAD
Sh "85" R 114 531 0 0 0
Dr 0 0 0
At SMD N 00888000
Ne 0 ""
Po 1083 -4222
$EndPAD
$PAD
Sh "86" R 114 531 0 0 0
Dr 0 0 0
At SMD N 00888000
Ne 0 ""
Po 886 -4222
$EndPAD
$PAD
Sh "87" R 114 531 0 0 0
Dr 0 0 0
At SMD N 00888000
Ne 0 ""
Po 689 -4222
$EndPAD
$PAD
Sh "88" R 114 531 0 0 0
Dr 0 0 0
At SMD N 00888000
Ne 0 ""
Po 492 -4222
$EndPAD
$PAD
Sh "89" R 114 531 0 0 0
Dr 0 0 0
At SMD N 00888000
Ne 0 ""
Po 295 -4222
$EndPAD
$PAD
Sh "90" R 114 531 0 0 0
Dr 0 0 0
At SMD N 00888000
Ne 0 ""
Po 98 -4222
$EndPAD
$PAD
Sh "91" R 114 531 0 0 0
Dr 0 0 0
At SMD N 00888000
Ne 0 ""
Po -98 -4222
$EndPAD
$PAD
Sh "92" R 114 531 0 0 0
Dr 0 0 0
At SMD N 00888000
Ne 0 ""
Po -295 -4222
$EndPAD
$PAD
Sh "93" R 114 531 0 0 0
Dr 0 0 0
At SMD N 00888000
Ne 0 ""
Po -492 -4222
$EndPAD
$PAD
Sh "94" R 114 531 0 0 0
Dr 0 0 0
At SMD N 00888000
Ne 0 ""
Po -689 -4222
$EndPAD
$PAD
Sh "95" R 114 531 0 0 0
Dr 0 0 0
At SMD N 00888000
Ne 0 ""
Po -886 -4222
$EndPAD
$PAD
Sh "96" R 114 531 0 0 0
Dr 0 0 0
At SMD N 00888000
Ne 0 ""
Po -1083 -4222
$EndPAD
$PAD
Sh "97" R 114 531 0 0 0
Dr 0 0 0
At SMD N 00888000
Ne 0 ""
Po -1280 -4222
$EndPAD
$PAD
Sh "98" R 114 531 0 0 0
Dr 0 0 0
At SMD N 00888000
Ne 0 ""
Po -1476 -4222
$EndPAD
$PAD
Sh "99" R 114 531 0 0 0
Dr 0 0 0
At SMD N 00888000
Ne 0 ""
Po -1673 -4222
$EndPAD
$PAD
Sh "100" R 114 531 0 0 0
Dr 0 0 0
At SMD N 00888000
Ne 0 ""
Po -1870 -4222
$EndPAD
$PAD
Sh "101" R 114 531 0 0 0
Dr 0 0 0
At SMD N 00888000
Ne 0 ""
Po -2067 -4222
$EndPAD
$PAD
Sh "102" R 114 531 0 0 0
Dr 0 0 0
At SMD N 00888000
Ne 0 ""
Po -2264 -4222
$EndPAD
$PAD
Sh "103" R 114 531 0 0 0
Dr 0 0 0
At SMD N 00888000
Ne 0 ""
Po -2461 -4222
$EndPAD
$PAD
Sh "104" R 114 531 0 0 0
Dr 0 0 0
At SMD N 00888000
Ne 0 ""
Po -2657 -4222
$EndPAD
$PAD
Sh "105" R 114 531 0 0 0
Dr 0 0 0
At SMD N 00888000
Ne 0 ""
Po -2854 -4222
$EndPAD
$PAD
Sh "106" R 114 531 0 0 0
Dr 0 0 0
At SMD N 00888000
Ne 0 ""
Po -3051 -4222
$EndPAD
$PAD
Sh "107" R 114 531 0 0 0
Dr 0 0 0
At SMD N 00888000
Ne 0 ""
Po -3248 -4222
$EndPAD
$PAD
Sh "108" R 114 531 0 0 0
Dr 0 0 0
At SMD N 00888000
Ne 0 ""
Po -3445 -4222
$EndPAD
$PAD
Sh "109" R 531 114 0 0 0
Dr 0 0 0
At SMD N 00888000
Ne 0 ""
Po -4222 -3445
$EndPAD
$PAD
Sh "110" R 531 114 0 0 0
Dr 0 0 0
At SMD N 00888000
Ne 0 ""
Po -4222 -3248
$EndPAD
$PAD
Sh "111" R 531 114 0 0 0
Dr 0 0 0
At SMD N 00888000
Ne 0 ""
Po -4222 -3051
$EndPAD
$PAD
Sh "112" R 531 114 0 0 0
Dr 0 0 0
At SMD N 00888000
Ne 0 ""
Po -4222 -2854
$EndPAD
$PAD
Sh "113" R 531 114 0 0 0
Dr 0 0 0
At SMD N 00888000
Ne 0 ""
Po -4222 -2657
$EndPAD
$PAD
Sh "114" R 531 114 0 0 0
Dr 0 0 0
At SMD N 00888000
Ne 0 ""
Po -4222 -2461
$EndPAD
$PAD
Sh "115" R 531 114 0 0 0
Dr 0 0 0
At SMD N 00888000
Ne 0 ""
Po -4222 -2264
$EndPAD
$PAD
Sh "116" R 531 114 0 0 0
Dr 0 0 0
At SMD N 00888000
Ne 0 ""
Po -4222 -2067
$EndPAD
$PAD
Sh "117" R 531 114 0 0 0
Dr 0 0 0
At SMD N 00888000
Ne 0 ""
Po -4222 -1870
$EndPAD
$PAD
Sh "118" R 531 114 0 0 0
Dr 0 0 0
At SMD N 00888000
Ne 0 ""
Po -4222 -1673
$EndPAD
$PAD
Sh "119" R 531 114 0 0 0
Dr 0 0 0
At SMD N 00888000
Ne 0 ""
Po -4222 -1476
$EndPAD
$PAD
Sh "120" R 531 114 0 0 0
Dr 0 0 0
At SMD N 00888000
Ne 0 ""
Po -4222 -1280
$EndPAD
$PAD
Sh "121" R 531 114 0 0 0
Dr 0 0 0
At SMD N 00888000
Ne 0 ""
Po -4222 -1083
$EndPAD
$PAD
Sh "122" R 531 114 0 0 0
Dr 0 0 0
At SMD N 00888000
Ne 0 ""
Po -4222 -886
$EndPAD
$PAD
Sh "123" R 531 114 0 0 0
Dr 0 0 0
At SMD N 00888000
Ne 0 ""
Po -4222 -689
$EndPAD
$PAD
Sh "124" R 531 114 0 0 0
Dr 0 0 0
At SMD N 00888000
Ne 0 ""
Po -4222 -492
$EndPAD
$PAD
Sh "125" R 531 114 0 0 0
Dr 0 0 0
At SMD N 00888000
Ne 0 ""
Po -4222 -295
$EndPAD
$PAD
Sh "126" R 531 114 0 0 0
Dr 0 0 0
At SMD N 00888000
Ne 0 ""
Po -4222 -98
$EndPAD
$PAD
Sh "127" R 531 114 0 0 0
Dr 0 0 0
At SMD N 00888000
Ne 0 ""
Po -4222 98
$EndPAD
$PAD
Sh "128" R 531 114 0 0 0
Dr 0 0 0
At SMD N 00888000
Ne 0 ""
Po -4222 295
$EndPAD
$PAD
Sh "129" R 531 114 0 0 0
Dr 0 0 0
At SMD N 00888000
Ne 0 ""
Po -4222 492
$EndPAD
$PAD
Sh "130" R 531 114 0 0 0
Dr 0 0 0
At SMD N 00888000
Ne 0 ""
Po -4222 689
$EndPAD
$PAD
Sh "131" R 531 114 0 0 0
Dr 0 0 0
At SMD N 00888000
Ne 0 ""
Po -4222 886
$EndPAD
$PAD
Sh "132" R 531 114 0 0 0
Dr 0 0 0
At SMD N 00888000
Ne 0 ""
Po -4222 1083
$EndPAD
$PAD
Sh "133" R 531 114 0 0 0
Dr 0 0 0
At SMD N 00888000
Ne 0 ""
Po -4222 1280
$EndPAD
$PAD
Sh "134" R 531 114 0 0 0
Dr 0 0 0
At SMD N 00888000
Ne 0 ""
Po -4222 1476
$EndPAD
$PAD
Sh "135" R 531 114 0 0 0
Dr 0 0 0
At SMD N 00888000
Ne 0 ""
Po -4222 1673
$EndPAD
$PAD
Sh "136" R 531 114 0 0 0
Dr 0 0 0
At SMD N 00888000
Ne 0 ""
Po -4222 1870
$EndPAD
$PAD
Sh "137" R 531 114 0 0 0
Dr 0 0 0
At SMD N 00888000
Ne 0 ""
Po -4222 2067
$EndPAD
$PAD
Sh "138" R 531 114 0 0 0
Dr 0 0 0
At SMD N 00888000
Ne 0 ""
Po -4222 2264
$EndPAD
$PAD
Sh "139" R 531 114 0 0 0
Dr 0 0 0
At SMD N 00888000
Ne 0 ""
Po -4222 2461
$EndPAD
$PAD
Sh "140" R 531 114 0 0 0
Dr 0 0 0
At SMD N 00888000
Ne 0 ""
Po -4222 2657
$EndPAD
$PAD
Sh "141" R 531 114 0 0 0
Dr 0 0 0
At SMD N 00888000
Ne 0 ""
Po -4222 2854
$EndPAD
$PAD
Sh "142" R 531 114 0 0 0
Dr 0 0 0
At SMD N 00888000
Ne 0 ""
Po -4222 3051
$EndPAD
$PAD
Sh "143" R 531 114 0 0 0
Dr 0 0 0
At SMD N 00888000
Ne 0 ""
Po -4222 3248
$EndPAD
$PAD
Sh "144" R 531 114 0 0 0
Dr 0 0 0
At SMD N 00888000
Ne 0 ""
Po -4222 3445
$EndPAD
$SHAPE3D
Na "walter\smd_lqfp\tqfp-144.wrl"
Sc 1.000000 1.000000 1.000000
Of 0.000000 0.000000 0.000000
Ro 0.000000 0.000000 0.000000
$EndSHAPE3D
$EndMODULE  TQFP-144
$EndLIBRARY
