PCBNEW-LibModule-V1  Čt 21. červen 2012, 21:47:15 CEST
# encoding utf-8
Units deci-mils
$INDEX
LTSR_15_NP
$EndINDEX
$MODULE LTSR_15_NP
Po 0 0 0 15 4A9BE58D 00000000 ~~
Li LTSR_15_NP
Sc 0
AR 
Op 0 0 0
T0 5220 0 472 472 900 100 N V 21 N "LTSR_15_NP"
T1 6000 0 472 472 900 100 N I 21 N "VAL**"
DS 3140 1620 3140 -1580 100 21
DS 2840 920 3140 1620 100 21
DS 3140 1620 3440 920 100 21
DS 3140 1620 3440 920 100 27
DS 3140 1620 2840 920 100 27
DS 3140 1620 3140 -1580 100 27
DS -3980 1820 -3980 -1820 100 27
DS -3980 1820 3980 1820 100 27
DS 3980 1820 3980 -1820 100 27
DS 3980 -1820 -3980 -1820 100 27
DS -4724 -3150 4724 -3150 100 21
DS 4724 -3150 4724 3150 100 21
DS 4724 3150 -4724 3150 100 21
DS -4724 3150 -4724 -3150 100 21
T2 -2559 1142 472 472 0 100 N V 21 N "REF"
T2 -2598 394 472 472 0 100 N V 21 N "OUT"
T2 -2598 -394 472 472 0 100 N V 21 N "GND"
T2 -2677 -1220 472 472 0 100 N V 21 N "+5V"
DS -4724 3150 4724 3150 100 26
DS 4724 3150 4724 -3150 100 26
DS 4724 -3150 -4724 -3150 100 26
DS -4724 -3150 -4724 3150 100 26
$PAD
Sh "1" C 866 866 0 0 0
Dr 630 0 0
At STD N 00C0FFFF
Ne 0 ""
Po -1000 -2500
$EndPAD
$PAD
Sh "2" C 866 866 0 0 0
Dr 630 0 0
At STD N 00C0FFFF
Ne 0 ""
Po 0 -2500
$EndPAD
$PAD
Sh "3" C 866 866 0 0 0
Dr 630 0 0
At STD N 00C0FFFF
Ne 0 ""
Po 1000 -2500
$EndPAD
$PAD
Sh "4" C 866 866 0 0 0
Dr 630 0 0
At STD N 00C0FFFF
Ne 0 ""
Po 1000 2500
$EndPAD
$PAD
Sh "5" C 866 866 0 0 0
Dr 630 0 0
At STD N 00C0FFFF
Ne 0 ""
Po 0 2500
$EndPAD
$PAD
Sh "6" C 866 866 0 0 0
Dr 630 0 0
At STD N 00C0FFFF
Ne 0 ""
Po -1000 2500
$EndPAD
$PAD
Sh "7" C 551 551 0 0 0
Dr 394 0 0
At STD N 00C0FFFF
Ne 0 ""
Po -4000 -1125
$EndPAD
$PAD
Sh "8" C 551 551 0 0 0
Dr 394 0 0
At STD N 00C0FFFF
Ne 0 ""
Po -4000 -375
$EndPAD
$PAD
Sh "9" C 551 551 0 0 0
Dr 394 0 0
At STD N 00C0FFFF
Ne 0 ""
Po -4000 375
$EndPAD
$PAD
Sh "10" C 551 551 0 0 0
Dr 394 0 0
At STD N 00C0FFFF
Ne 0 ""
Po -4000 1125
$EndPAD
$EndMODULE LTSR_15_NP
$EndLIBRARY
