PCBNEW-LibModule-V1  ven 09 set 2011 09:22:36 CEST
# encoding utf-8
$INDEX
conn_usb_A
conn_usb_Ax2
conn_usb_A-vert
conn_usb_B
DB_15F-VGA
dvi
rj45-led
rj45-shield
rj45-noshield
rj45-Tyco-2-5338556-1
conn_usb_B_micro_smd
$EndINDEX
$MODULE conn_usb_Ax2
Po 0 0 0 15 49F18E70 00000000 ~~
Li conn_usb_Ax2
Cd USB A-type receptacle, 2x stacked, Tyco P/N 5787617-3
Sc 00000000
AR
Op 0 0 0
T0 0 4200 600 600 0 120 N V 21 N"conn_usb_Ax2"
T1 0 -4200 600 600 0 120 N V 21 N"JP***"
DS -3100 -3100 -2600 -2700 150 21
DS -2600 -3500 -3100 -3100 150 21
DS 3100 -3100 2600 -2700 150 21
DS 2600 -3500 3100 -3100 150 21
DS 2600 3400 2600 -3400 150 21
DS -2600 -3400 -2600 3400 150 21
DS -3000 3350 3000 3350 150 21
DS -3000 3250 -3000 3450 150 21
DS 3000 3250 3000 3450 150 21
DS 3000 3450 -3000 3450 150 21
DS -3000 3250 3000 3250 150 21
DS 2600 -1100 3100 -700 150 21
DS 3100 -700 2600 -300 150 21
DS -2600 -1100 -3100 -700 150 21
DS -3100 -700 -2600 -300 150 21
DS 2600 -3500 -2600 -3500 150 21
$PAD
Sh "9" C 1181 1181 0 0 0
Dr 787 0 0
At STD N 0000FFFF
Ne 0 ""
Po -2587 -691
$EndPAD
$PAD
Sh "10" C 1181 1181 0 0 0
Dr 787 0 0
At STD N 0000FFFF
Ne 0 ""
Po 2587 -691
$EndPAD
$PAD
Sh "1" C 591 591 0 0 0
Dr 354 0 0
At STD N 0000FFFF
Ne 0 ""
Po -1378 -1758
$EndPAD
$PAD
Sh "2" C 591 591 0 0 0
Dr 354 0 0
At STD N 0000FFFF
Ne 0 ""
Po -394 -1758
$EndPAD
$PAD
Sh "3" C 591 591 0 0 0
Dr 354 0 0
At STD N 0000FFFF
Ne 0 ""
Po 394 -1758
$EndPAD
$PAD
Sh "4" C 591 591 0 0 0
Dr 354 0 0
At STD N 0000FFFF
Ne 0 ""
Po 1378 -1758
$EndPAD
$PAD
Sh "8" C 591 591 0 0 0
Dr 354 0 0
At STD N 0000FFFF
Ne 0 ""
Po 1378 -2790
$EndPAD
$PAD
Sh "5" C 591 591 0 0 0
Dr 354 0 0
At STD N 0000FFFF
Ne 0 ""
Po -1378 -2790
$EndPAD
$PAD
Sh "6" C 591 591 0 0 0
Dr 354 0 0
At STD N 0000FFFF
Ne 0 ""
Po -394 -2790
$EndPAD
$PAD
Sh "7" C 591 591 0 0 0
Dr 354 0 0
At STD N 0000FFFF
Ne 0 ""
Po 394 -2790
$EndPAD
$PAD
Sh "11" C 1181 1181 0 0 0
Dr 787 0 0
At STD N 0000FFFF
Ne 0 ""
Po -2587 -3136
$EndPAD
$PAD
Sh "12" C 1181 1181 0 0 0
Dr 787 0 0
At STD N 0000FFFF
Ne 0 ""
Po 2587 -3136
$EndPAD
$SHAPE3D
Na "walter\conn_pc\usb_Ax2.wrl"
Sc 1.000000 1.000000 1.000000
Of 0.000000 0.000000 0.000000
Ro 0.000000 0.000000 0.000000
$EndSHAPE3D
$EndMODULE  conn_usb_Ax2
$MODULE conn_usb_A
Po 0 0 0 15 49F18BC0 00000000 ~~
Li conn_usb_A
Cd USB A-type receptacle, Tyco P/N 292303-3
Sc 00000000
AR
Op 0 0 0
T0 0 3500 600 600 0 120 N V 21 N"conn_usb_A"
T1 0 -3400 600 600 0 120 N V 21 N"JP***"
DS -3000 2750 3000 2750 150 21
DS -3000 2650 -3000 2850 150 21
DS 3000 2650 3000 2850 150 21
DS 3000 2850 -3000 2850 150 21
DS -3000 2650 3000 2650 150 21
DS 2600 -1700 3100 -1300 150 21
DS 3100 -1300 2600 -900 150 21
DS -2600 -1700 -3100 -1300 150 21
DS -3100 -1300 -2600 -900 150 21
DS 2600 -2800 -2600 -2800 150 21
DS -2600 -2800 -2600 2800 150 21
DS 2600 2800 2600 -2800 150 21
$PAD
Sh "5" C 1181 1181 0 0 0
Dr 787 0 0
At STD N 0000FFFF
Ne 0 ""
Po -2587 -1291
$EndPAD
$PAD
Sh "6" C 1181 1181 0 0 0
Dr 787 0 0
At STD N 0000FFFF
Ne 0 ""
Po 2587 -1291
$EndPAD
$PAD
Sh "1" C 591 591 0 0 0
Dr 354 0 0
At STD N 0000FFFF
Ne 0 ""
Po -1378 -2358
$EndPAD
$PAD
Sh "2" C 591 591 0 0 0
Dr 354 0 0
At STD N 0000FFFF
Ne 0 ""
Po -394 -2358
$EndPAD
$PAD
Sh "3" C 591 591 0 0 0
Dr 354 0 0
At STD N 0000FFFF
Ne 0 ""
Po 394 -2358
$EndPAD
$PAD
Sh "4" C 591 591 0 0 0
Dr 354 0 0
At STD N 0000FFFF
Ne 0 ""
Po 1378 -2358
$EndPAD
$SHAPE3D
Na "walter\conn_pc\usb_A.wrl"
Sc 1.000000 1.000000 1.000000
Of 0.000000 0.000000 0.000000
Ro 0.000000 0.000000 0.000000
$EndSHAPE3D
$EndMODULE  conn_usb_A
$MODULE conn_usb_A-vert
Po 0 0 0 15 49F191BD 00000000 ~~
Li conn_usb_A-vert
Cd USB A-type vertical receptacle, Tyco P/N 440260-2
Sc 00000000
AR
Op 0 0 0
T0 0 4400 600 600 0 120 N V 21 N"conn_usb_A-vert"
T1 0 -4400 600 600 0 120 N V 21 N"JP***"
DS 1550 3800 -1550 3800 150 21
DS -1550 3700 -1550 3900 150 21
DS -1550 3900 1550 3900 150 21
DS 1550 3900 1550 3700 150 21
DS 1550 3700 -1550 3700 150 21
DS 1150 -3800 -1150 -3800 150 21
DS -1150 -3800 -1150 3800 150 21
DS 1150 3800 1150 -3800 150 21
$PAD
Sh "5" C 866 866 0 0 0
Dr 512 0 0
At STD N 0000FFFF
Ne 0 ""
Po -1071 -3661
$EndPAD
$PAD
Sh "6" C 866 866 0 0 0
Dr 512 0 0
At STD N 0000FFFF
Ne 0 ""
Po 1071 -3661
$EndPAD
$PAD
Sh "1" C 591 591 0 0 0
Dr 354 0 0
At STD N 0000FFFF
Ne 0 ""
Po 0 -1193
$EndPAD
$PAD
Sh "2" C 591 591 0 0 0
Dr 354 0 0
At STD N 0000FFFF
Ne 0 ""
Po 0 -1980
$EndPAD
$PAD
Sh "3" C 591 591 0 0 0
Dr 354 0 0
At STD N 0000FFFF
Ne 0 ""
Po 0 -2768
$EndPAD
$PAD
Sh "4" C 591 591 0 0 0
Dr 354 0 0
At STD N 0000FFFF
Ne 0 ""
Po 0 -3555
$EndPAD
$PAD
Sh "8" C 866 866 0 0 0
Dr 512 0 0
At STD N 0000FFFF
Ne 0 ""
Po 1071 -906
$EndPAD
$PAD
Sh "7" C 866 866 0 0 0
Dr 512 0 0
At STD N 0000FFFF
Ne 0 ""
Po -1071 -906
$EndPAD
$SHAPE3D
Na "walter\conn_pc\usb_A_vert.wrl"
Sc 1.000000 1.000000 1.000000
Of 0.000000 0.000000 0.000000
Ro 0.000000 0.000000 0.000000
$EndSHAPE3D
$EndMODULE  conn_usb_A-vert
$MODULE DB_15F-VGA
Po 0 0 0 15 4A8578AD 00000000 ~~
Li DB_15F-VGA
Cd D-SUB 15 pin VGA socket, Tyco P/N 440467-1
Sc 00000000
AR
Op 0 0 0
T0 0 1850 600 600 0 120 N V 21 N"DB_15F-VGA"
T1 0 -3350 600 600 0 120 N V 21 N"JP***"
DS -3950 500 -3950 2800 150 21
DS -4300 -950 -4000 -400 150 21
DS -5550 -950 -5900 -400 150 21
DS -3550 -2800 -3550 -250 150 21
DS -6100 500 -6100 -2800 150 21
DS 6100 -2800 6100 500 150 21
DS 6100 -2800 -6100 -2800 150 21
DS 3550 -250 3550 -2800 150 21
DS 5550 -950 5850 -400 150 21
DS 4300 -950 4050 -400 150 21
DS 4300 -950 5550 -950 150 21
DS -5550 -950 -4300 -950 150 21
DS 5850 -400 4050 -400 150 21
DS 4050 -400 4050 -300 150 21
DS 4050 -300 5850 -300 150 21
DS 5850 -300 5850 -400 150 21
DS -4000 -400 -5900 -400 150 21
DS -5900 -400 -5900 -300 150 21
DS -5900 -300 -4000 -300 150 21
DS -4000 -300 -4000 -400 150 21
DS 4500 -250 4500 -1250 150 21
DS 4500 -1250 5400 -1250 150 21
DS 5400 -1250 5400 -250 150 21
DS -5400 -250 -5400 -1250 150 21
DS -5400 -1250 -4500 -1250 150 21
DS -4500 -1250 -4500 -250 150 21
DS -6100 -250 6100 -250 150 21
DS -4350 500 -4350 2800 150 21
DS -5550 500 -5550 2800 150 21
DS 5550 500 5550 2800 150 21
DS 4350 500 4350 2800 150 21
DS 3950 500 3950 2800 150 21
DS 3950 2800 5950 2800 150 21
DS 5950 2800 5950 550 150 21
DS -5950 500 -5950 2800 150 21
DS -5950 2800 -3950 2800 150 21
DS -3200 500 -3200 2800 150 21
DS -3200 2800 3200 2800 150 21
DS 3200 2800 3200 500 150 21
DS -6100 500 6100 500 150 21
$PAD
Sh "17" C 1969 1969 0 0 0
Dr 1260 0 0
At STD N 0000FFFF
Ne 0 ""
Po 4919 -973
$EndPAD
$PAD
Sh "3" C 472 472 0 0 0
Dr 256 0 0
At STD N 0000FFFF
Ne 0 ""
Po -105 -1760
$EndPAD
$PAD
Sh "2" C 472 472 0 0 0
Dr 256 0 0
At STD N 0000FFFF
Ne 0 ""
Po 795 -1760
$EndPAD
$PAD
Sh "1" C 472 472 0 0 0
Dr 256 0 0
At STD N 0000FFFF
Ne 0 ""
Po 1697 -1760
$EndPAD
$PAD
Sh "4" C 472 472 0 0 0
Dr 256 0 0
At STD N 0000FFFF
Ne 0 ""
Po -1008 -1760
$EndPAD
$PAD
Sh "5" C 472 472 0 0 0
Dr 256 0 0
At STD N 0000FFFF
Ne 0 ""
Po -1909 -1760
$EndPAD
$PAD
Sh "9" C 472 472 0 0 0
Dr 256 0 0
At STD N 0000FFFF
Ne 0 ""
Po -557 -1170
$EndPAD
$PAD
Sh "8" C 472 472 0 0 0
Dr 256 0 0
At STD N 0000FFFF
Ne 0 ""
Po 344 -1170
$EndPAD
$PAD
Sh "7" C 472 472 0 0 0
Dr 256 0 0
At STD N 0000FFFF
Ne 0 ""
Po 1246 -1170
$EndPAD
$PAD
Sh "6" C 472 472 0 0 0
Dr 256 0 0
At STD N 0000FFFF
Ne 0 ""
Po 2148 -1170
$EndPAD
$PAD
Sh "16" C 1969 1969 0 0 0
Dr 1260 0 0
At STD N 0000FFFF
Ne 0 ""
Po -4919 -973
$EndPAD
$PAD
Sh "10" C 472 472 0 0 0
Dr 256 0 0
At STD N 0000FFFF
Ne 0 ""
Po -1459 -1170
$EndPAD
$PAD
Sh "11" C 472 472 0 0 0
Dr 256 0 0
At STD N 0000FFFF
Ne 0 ""
Po 1697 -579
$EndPAD
$PAD
Sh "12" C 472 472 0 0 0
Dr 256 0 0
At STD N 0000FFFF
Ne 0 ""
Po 795 -579
$EndPAD
$PAD
Sh "13" C 472 472 0 0 0
Dr 256 0 0
At STD N 0000FFFF
Ne 0 ""
Po -106 -580
$EndPAD
$PAD
Sh "14" C 472 472 0 0 0
Dr 256 0 0
At STD N 0000FFFF
Ne 0 ""
Po -1008 -579
$EndPAD
$PAD
Sh "15" C 472 472 0 0 0
Dr 256 0 0
At STD N 0000FFFF
Ne 0 ""
Po -1909 -579
$EndPAD
$SHAPE3D
Na "walter\conn_pc\db_15-vga.wrl"
Sc 1.000000 1.000000 1.000000
Of 0.000000 0.000000 0.000000
Ro 0.000000 0.000000 0.000000
$EndSHAPE3D
$EndMODULE  DB_15F-VGA
$MODULE dvi
Po 0 0 0 15 4A8579A2 00000000 ~~
Li dvi
Cd DVI connector, Tyco P/N 1-1734147-1
Sc 00000000
AR
Op 0 0 0
T0 0 2402 600 600 0 120 N V 21 N"DVI"
T1 0 -4250 600 600 0 120 N V 21 N"JP***"
DS -4950 -3550 -5550 -2950 150 21
DS -5550 -2950 -5550 -1300 150 21
DS 5600 -3000 5600 -1300 150 21
DS 4950 -3550 5600 -3000 150 21
DS -4950 -3550 -4950 -200 150 21
DS 4950 -3550 4950 -200 150 21
DS -7250 -200 -7250 -1300 150 21
DS -7250 -1300 -4950 -1300 150 21
DS 7250 -200 7250 -1300 150 21
DS 7250 -1300 4950 -1300 150 21
DS 7250 -200 7250 1000 150 21
DS -7250 -200 -7250 1000 150 21
DS -7250 -200 7250 -200 150 21
DS -4950 -3550 4950 -3550 150 21
DS -4750 3550 4750 3550 150 21
DS 4750 3550 4750 1000 150 21
DS -4750 3550 -4750 1000 150 21
DS -7250 1000 7250 1000 150 21
$PAD
Sh "26" C 1378 1378 0 0 0
Dr 748 0 0
At STD N 0000FFFF
Ne 0 ""
Po 5949 -1300
$EndPAD
$PAD
Sh "3" C 512 512 0 0 0
Dr 315 0 0
At STD N 0000FFFF
Ne 0 ""
Po -2250 -2800
$EndPAD
$PAD
Sh "2" C 512 512 0 0 0
Dr 315 0 0
At STD N 0000FFFF
Ne 0 ""
Po -3000 -2800
$EndPAD
$PAD
Sh "1" C 512 512 0 0 0
Dr 315 0 0
At STD N 0000FFFF
Ne 0 ""
Po -3750 -2800
$EndPAD
$PAD
Sh "4" C 512 512 0 0 0
Dr 315 0 0
At STD N 0000FFFF
Ne 0 ""
Po -1500 -2800
$EndPAD
$PAD
Sh "5" C 512 512 0 0 0
Dr 315 0 0
At STD N 0000FFFF
Ne 0 ""
Po -750 -2800
$EndPAD
$PAD
Sh "9" C 512 512 0 0 0
Dr 315 0 0
At STD N 0000FFFF
Ne 0 ""
Po -3750 -2050
$EndPAD
$PAD
Sh "7" C 512 512 0 0 0
Dr 315 0 0
At STD N 0000FFFF
Ne 0 ""
Po 750 -2800
$EndPAD
$PAD
Sh "6" C 512 512 0 0 0
Dr 315 0 0
At STD N 0000FFFF
Ne 0 ""
Po 0 -2800
$EndPAD
$PAD
Sh "25" C 1378 1378 0 0 0
Dr 748 0 0
At STD N 0000FFFF
Ne 0 ""
Po -5949 -1300
$EndPAD
$PAD
Sh "10" C 512 512 0 0 0
Dr 315 0 0
At STD N 0000FFFF
Ne 0 ""
Po -3000 -2050
$EndPAD
$PAD
Sh "11" C 512 512 0 0 0
Dr 315 0 0
At STD N 0000FFFF
Ne 0 ""
Po -2250 -2050
$EndPAD
$PAD
Sh "12" C 512 512 0 0 0
Dr 315 0 0
At STD N 0000FFFF
Ne 0 ""
Po -1500 -2050
$EndPAD
$PAD
Sh "13" C 512 512 0 0 0
Dr 315 0 0
At STD N 0000FFFF
Ne 0 ""
Po -750 -2050
$EndPAD
$PAD
Sh "14" C 512 512 0 0 0
Dr 315 0 0
At STD N 0000FFFF
Ne 0 ""
Po 0 -2050
$EndPAD
$PAD
Sh "15" C 512 512 0 0 0
Dr 315 0 0
At STD N 0000FFFF
Ne 0 ""
Po 750 -2050
$EndPAD
$PAD
Sh "16" C 512 512 0 0 0
Dr 315 0 0
At STD N 0000FFFF
Ne 0 ""
Po 1500 -2050
$EndPAD
$PAD
Sh "17" C 512 512 0 0 0
Dr 315 0 0
At STD N 0000FFFF
Ne 0 ""
Po -3750 -1300
$EndPAD
$PAD
Sh "18" C 512 512 0 0 0
Dr 315 0 0
At STD N 0000FFFF
Ne 0 ""
Po -3000 -1300
$EndPAD
$PAD
Sh "19" C 512 512 0 0 0
Dr 315 0 0
At STD N 0000FFFF
Ne 0 ""
Po -2250 -1300
$EndPAD
$PAD
Sh "20" C 512 512 0 0 0
Dr 315 0 0
At STD N 0000FFFF
Ne 0 ""
Po -1500 -1300
$EndPAD
$PAD
Sh "21" C 512 512 0 0 0
Dr 315 0 0
At STD N 0000FFFF
Ne 0 ""
Po -750 -1300
$EndPAD
$PAD
Sh "22" C 512 512 0 0 0
Dr 315 0 0
At STD N 0000FFFF
Ne 0 ""
Po 0 -1300
$EndPAD
$PAD
Sh "23" C 512 512 0 0 0
Dr 315 0 0
At STD N 0000FFFF
Ne 0 ""
Po 750 -1300
$EndPAD
$PAD
Sh "24" C 512 512 0 0 0
Dr 315 0 0
At STD N 0000FFFF
Ne 0 ""
Po 1500 -1300
$EndPAD
$PAD
Sh "8" C 512 512 0 0 0
Dr 315 0 0
At STD N 0000FFFF
Ne 0 ""
Po 1500 -2800
$EndPAD
$PAD
Sh "C2" C 512 512 0 0 0
Dr 315 0 0
At STD N 0000FFFF
Ne 0 ""
Po 3750 -2550
$EndPAD
$PAD
Sh "C1" C 512 512 0 0 0
Dr 315 0 0
At STD N 0000FFFF
Ne 0 ""
Po 2750 -2550
$EndPAD
$PAD
Sh "C3" C 512 512 0 0 0
Dr 315 0 0
At STD N 0000FFFF
Ne 0 ""
Po 2750 -1550
$EndPAD
$PAD
Sh "C4" C 512 512 0 0 0
Dr 315 0 0
At STD N 0000FFFF
Ne 0 ""
Po 3750 -1550
$EndPAD
$PAD
Sh "C5" C 512 512 0 0 0
Dr 315 0 0
At STD N 0000FFFF
Ne 0 ""
Po 3250 -3050
$EndPAD
$PAD
Sh "C5" C 512 512 0 0 0
Dr 315 0 0
At STD N 0000FFFF
Ne 0 ""
Po 3250 -1050
$EndPAD
$PAD
Sh "27" C 787 787 0 0 0
Dr 787 0 0
At STD N 0000FFFF
Ne 0 ""
Po -3750 -1
$EndPAD
$PAD
Sh "28" C 787 787 0 0 0
Dr 787 0 0
At STD N 0000FFFF
Ne 0 ""
Po 3750 -1
$EndPAD
$SHAPE3D
Na "walter\conn_pc\dvi.wrl"
Sc 1.000000 1.000000 1.000000
Of 0.000000 0.000000 0.000000
Ro 0.000000 0.000000 0.000000
$EndSHAPE3D
$EndMODULE  dvi
$MODULE conn_usb_B
Po 0 0 0 15 4A852146 00000000 ~~
Li conn_usb_B
Cd USB B-type receptacle, Lumberg P/N 2411-02
Kw USB
Sc 00000000
AR
Op 0 0 0
T0 0 3701 600 600 0 120 N V 21 N"conn_usb_B"
T1 0 -3583 600 600 0 120 N V 21 N"JP***"
DS 2370 -1590 3060 -900 100 21
DS 3060 -900 2370 -210 100 21
DS -2370 -1590 -3060 -900 100 21
DS -3060 -900 -2370 -210 100 21
DS -2370 -900 -2370 3160 100 21
DS -2370 3160 2370 3160 100 21
DS 2370 3160 2370 -900 100 21
DS 2370 -900 2370 -3150 100 21
DS 2370 -3150 -2370 -3150 100 21
DS -2370 -3150 -2370 -900 100 21
$PAD
Sh "3" C 591 591 0 0 0
Dr 197 0 0
At STD N 00E0FFFF
Ne 0 ""
Po -490 -1970
$EndPAD
$PAD
Sh "4" C 591 591 0 0 0
Dr 197 0 0
At STD N 00E0FFFF
Ne 0 ""
Po 490 -1970
$EndPAD
$PAD
Sh "1" C 591 591 0 0 0
Dr 197 0 0
At STD N 00E0FFFF
Ne 0 ""
Po 490 -2760
$EndPAD
$PAD
Sh "2" C 591 591 0 0 0
Dr 197 0 0
At STD N 00E0FFFF
Ne 0 ""
Po -490 -2760
$EndPAD
$PAD
Sh "5" C 1378 1378 0 0 0
Dr 800 0 0
At STD N 00E0FFFF
Ne 0 ""
Po -2370 -900
$EndPAD
$PAD
Sh "6" C 1378 1378 0 0 0
Dr 800 0 0
At STD N 00E0FFFF
Ne 0 ""
Po 2370 -900
$EndPAD
$SHAPE3D
Na "walter\conn_pc\usb_B.wrl"
Sc 1.000000 1.000000 1.000000
Of 0.000000 0.000000 0.000000
Ro 0.000000 0.000000 0.000000
$EndSHAPE3D
$EndMODULE  conn_usb_B
$MODULE rj45-led
Po 0 0 0 15 4A858350 00000000 ~~
Li rj45-led
Cd RJ45 + led indicators, Tyco P/N 2-406549-7
Sc 00000000
AR
Op 0 0 0
T0 0 3850 600 600 0 120 N V 21 N"RJ45-led"
T1 0 -3700 600 600 0 120 N V 21 N"JP***"
DS 1299 -2244 1496 -1929 120 21
DS 1496 -1929 1496 -2244 120 21
DS 1299 -1929 1299 -2244 120 21
DS 1417 -1654 1339 -1654 120 21
DA 1417 -1575 1496 -1575 900 120 21
DA 1417 -1575 1417 -1654 900 120 21
DS 1496 -1339 1339 -1496 120 21
DS 1339 -1339 1339 -1654 120 21
DS 1024 -1929 1024 -2047 120 21
DA 1024 -1496 1024 -1654 900 120 21
DA 1024 -1496 1181 -1496 900 120 21
DA 1024 -1496 1024 -1339 900 120 21
DA 1024 -1496 866 -1496 900 120 21
DA -1378 -1496 -1378 -1654 900 120 21
DA 1024 -2087 1024 -1929 900 120 21
DA 1024 -2087 866 -2087 900 120 21
DS -2087 -1693 -2283 -1496 120 21
DS -2283 -1496 -2087 -1299 120 21
DS -2087 -1299 -2087 -1693 120 21
DS -2362 -1693 -2362 -1299 120 21
DS -2047 -2283 -2047 -1890 120 21
DS -2323 -2283 -2323 -1890 120 21
DS -2323 -1890 -2126 -2087 120 21
DS -2126 -2087 -2323 -2283 120 21
DS -2717 -1496 -1772 -1496 120 21
DS -2717 -2087 -1772 -2087 120 21
DS -1063 -1496 -905 -1339 120 21
DS -984 -1654 -1063 -1654 120 21
DA -984 -1575 -905 -1575 900 120 21
DA -984 -1575 -984 -1654 900 120 21
DS -1063 -1339 -1063 -1654 120 21
DA -1377 -1496 -1220 -1496 900 120 21
DA -1377 -1496 -1377 -1339 900 120 21
DA -1377 -1496 -1535 -1496 900 120 21
DS -1062 -1929 -1062 -2244 120 21
DS -1062 -2244 -865 -1929 120 21
DS -865 -1929 -865 -2244 120 21
DS -1338 -2047 -1338 -1929 120 21
DA -1375 -2088 -1375 -1930 900 120 21
DA -1375 -2088 -1533 -2088 900 120 21
DS 2206 -1496 2403 -1693 120 21
DS 2403 -1693 2403 -1299 120 21
DS 2403 -1299 2206 -1496 120 21
DS 2127 -1693 2127 -1299 120 21
DS 2325 -2086 2128 -1889 120 21
DS 2128 -1889 2128 -2283 120 21
DS 2128 -2283 2325 -2086 120 21
DS 2404 -2283 2404 -1889 120 21
DS 1734 -2086 2718 -2086 120 21
DS 1733 -1496 2678 -1496 120 21
DS 2500 3100 2500 3200 150 21
DS 2500 3200 3300 3200 150 21
DS 3300 3200 3300 3100 150 21
DS -3300 3100 -3300 3200 150 21
DS -3300 3200 -2500 3200 150 21
DS -2500 3200 -2500 3100 150 21
DS 600 900 -600 900 150 21
DS 400 900 400 3100 150 21
DS 600 200 600 900 150 21
DS -600 900 -600 200 150 21
DS -400 3100 -400 900 150 21
DS -2400 3100 -2400 200 150 21
DS -2400 200 2400 200 150 21
DS 2400 200 2400 3100 150 21
DS -3400 3100 -3400 -3100 150 21
DS -3400 -3100 3400 -3100 150 21
DS 3400 -3100 3400 3100 150 21
DS 3400 3100 -3400 3100 150 21
$PAD
Sh "3" C 472 472 0 0 0
Dr 315 0 0
At STD N 0000FFFF
Ne 0 ""
Po 599 22
$EndPAD
$PAD
Sh "1" C 472 472 0 0 0
Dr 315 0 0
At STD N 0000FFFF
Ne 0 ""
Po 1398 22
$EndPAD
$PAD
Sh "2" C 472 472 0 0 0
Dr 315 0 0
At STD N 0000FFFF
Ne 0 ""
Po 999 -679
$EndPAD
$PAD
Sh "4" C 472 472 0 0 0
Dr 315 0 0
At STD N 0000FFFF
Ne 0 ""
Po 200 -679
$EndPAD
$PAD
Sh "5" C 472 472 0 0 0
Dr 315 0 0
At STD N 0000FFFF
Ne 0 ""
Po -200 22
$EndPAD
$PAD
Sh "6" C 472 472 0 0 0
Dr 315 0 0
At STD N 0000FFFF
Ne 0 ""
Po -599 -679
$EndPAD
$PAD
Sh "7" C 472 472 0 0 0
Dr 315 0 0
At STD N 0000FFFF
Ne 0 ""
Po -999 22
$EndPAD
$PAD
Sh "8" C 472 472 0 0 0
Dr 315 0 0
At STD N 0000FFFF
Ne 0 ""
Po -1398 -679
$EndPAD
$PAD
Sh "13" C 984 984 0 0 0
Dr 591 0 0
At STD N 0000FFFF
Ne 0 ""
Po -3197 -328
$EndPAD
$PAD
Sh "14" C 984 984 0 0 0
Dr 591 0 0
At STD N 0000FFFF
Ne 0 ""
Po 3197 -328
$EndPAD
$PAD
Sh "15" C 1280 1280 0 0 0
Dr 1280 0 0
At STD N 0000FFFF
Ne 0 ""
Po -2496 1022
$EndPAD
$PAD
Sh "16" C 1280 1280 0 0 0
Dr 1280 0 0
At STD N 0000FFFF
Ne 0 ""
Po 2496 1022
$EndPAD
$PAD
Sh "12" C 472 472 0 0 0
Dr 315 0 0
At STD N 0000FFFF
Ne 0 ""
Po -2701 -2576
$EndPAD
$PAD
Sh "11" C 472 472 0 0 0
Dr 315 0 0
At STD N 0000FFFF
Ne 0 ""
Po -1799 -2576
$EndPAD
$PAD
Sh "10" C 472 472 0 0 0
Dr 315 0 0
At STD N 0000FFFF
Ne 0 ""
Po 1799 -2576
$EndPAD
$PAD
Sh "9" C 472 472 0 0 0
Dr 315 0 0
At STD N 0000FFFF
Ne 0 ""
Po 2701 -2576
$EndPAD
$SHAPE3D
Na "walter\conn_pc\rj45-led.wrl"
Sc 1.000000 1.000000 1.000000
Of 0.000000 0.000000 0.000000
Ro 0.000000 0.000000 0.000000
$EndSHAPE3D
$EndMODULE  rj45-led
$MODULE rj45-shield
Po 0 0 0 15 4B8F7E44 00000000 ~~
Li rj45-shield
Cd RJ45, shielded
Sc 00000000
AR
Op 0 0 0
T0 0 2700 600 600 0 120 N V 21 N"RJ45-shield"
T1 0 -3100 600 600 0 120 N V 21 N"JP***"
DS 3400 2100 3400 -2600 150 21
DS -3400 -2600 -3400 2100 150 21
DS 600 -100 -600 -100 150 21
DS 400 -100 400 2100 150 21
DS 600 -800 600 -100 150 21
DS -600 -100 -600 -800 150 21
DS -400 2100 -400 -100 150 21
DS -2400 2100 -2400 -800 150 21
DS -2400 -800 2400 -800 150 21
DS 2400 -800 2400 2100 150 21
DS -3400 -2600 3400 -2600 150 21
DS 3400 2100 -3400 2100 150 21
$PAD
Sh "3" C 472 472 0 0 0
Dr 315 0 0
At STD N 0000FFFF
Ne 0 ""
Po 599 -978
$EndPAD
$PAD
Sh "1" C 472 472 0 0 0
Dr 315 0 0
At STD N 0000FFFF
Ne 0 ""
Po 1398 -978
$EndPAD
$PAD
Sh "2" C 472 472 0 0 0
Dr 315 0 0
At STD N 0000FFFF
Ne 0 ""
Po 999 -1679
$EndPAD
$PAD
Sh "4" C 472 472 0 0 0
Dr 315 0 0
At STD N 0000FFFF
Ne 0 ""
Po 200 -1679
$EndPAD
$PAD
Sh "5" C 472 472 0 0 0
Dr 315 0 0
At STD N 0000FFFF
Ne 0 ""
Po -200 -978
$EndPAD
$PAD
Sh "6" C 472 472 0 0 0
Dr 315 0 0
At STD N 0000FFFF
Ne 0 ""
Po -599 -1679
$EndPAD
$PAD
Sh "7" C 472 472 0 0 0
Dr 315 0 0
At STD N 0000FFFF
Ne 0 ""
Po -999 -978
$EndPAD
$PAD
Sh "8" C 472 472 0 0 0
Dr 315 0 0
At STD N 0000FFFF
Ne 0 ""
Po -1398 -1679
$EndPAD
$PAD
Sh "13" C 984 984 0 0 0
Dr 591 0 0
At STD N 0000FFFF
Ne 0 ""
Po -3197 -1328
$EndPAD
$PAD
Sh "14" C 984 984 0 0 0
Dr 591 0 0
At STD N 0000FFFF
Ne 0 ""
Po 3197 -1328
$EndPAD
$PAD
Sh "15" C 1280 1280 0 0 0
Dr 1280 0 0
At STD N 0000FFFF
Ne 0 ""
Po -2496 22
$EndPAD
$PAD
Sh "16" C 1280 1280 0 0 0
Dr 1280 0 0
At STD N 0000FFFF
Ne 0 ""
Po 2496 22
$EndPAD
$SHAPE3D
Na "walter\conn_pc\rj45-shield.wrl"
Sc 1.000000 1.000000 1.000000
Of 0.000000 0.000000 0.000000
Ro 0.000000 0.000000 0.000000
$EndSHAPE3D
$EndMODULE  rj45-shield
$MODULE rj45-noshield
Po 0 0 0 15 4B8F7EE1 00000000 ~~
Li rj45-noshield
Cd RJ45, unshielded
Sc 00000000
AR
Op 0 0 0
T0 0 2700 600 600 0 120 N V 21 N"RJ45-noshield"
T1 0 -3100 600 600 0 120 N V 21 N"JP***"
DS 3400 2100 3400 -2600 150 21
DS -3400 -2600 -3400 2100 150 21
DS 600 -100 -600 -100 150 21
DS 400 -100 400 2100 150 21
DS 600 -800 600 -100 150 21
DS -600 -100 -600 -800 150 21
DS -400 2100 -400 -100 150 21
DS -2400 2100 -2400 -800 150 21
DS -2400 -800 2400 -800 150 21
DS 2400 -800 2400 2100 150 21
DS -3400 -2600 3400 -2600 150 21
DS 3400 2100 -3400 2100 150 21
$PAD
Sh "3" C 472 472 0 0 0
Dr 315 0 0
At STD N 0000FFFF
Ne 0 ""
Po 599 -978
$EndPAD
$PAD
Sh "1" C 472 472 0 0 0
Dr 315 0 0
At STD N 0000FFFF
Ne 0 ""
Po 1398 -978
$EndPAD
$PAD
Sh "2" C 472 472 0 0 0
Dr 315 0 0
At STD N 0000FFFF
Ne 0 ""
Po 999 -1679
$EndPAD
$PAD
Sh "4" C 472 472 0 0 0
Dr 315 0 0
At STD N 0000FFFF
Ne 0 ""
Po 200 -1679
$EndPAD
$PAD
Sh "5" C 472 472 0 0 0
Dr 315 0 0
At STD N 0000FFFF
Ne 0 ""
Po -200 -978
$EndPAD
$PAD
Sh "6" C 472 472 0 0 0
Dr 315 0 0
At STD N 0000FFFF
Ne 0 ""
Po -599 -1679
$EndPAD
$PAD
Sh "7" C 472 472 0 0 0
Dr 315 0 0
At STD N 0000FFFF
Ne 0 ""
Po -999 -978
$EndPAD
$PAD
Sh "8" C 472 472 0 0 0
Dr 315 0 0
At STD N 0000FFFF
Ne 0 ""
Po -1398 -1679
$EndPAD
$PAD
Sh "15" C 1280 1280 0 0 0
Dr 1280 0 0
At STD N 0000FFFF
Ne 0 ""
Po -2496 22
$EndPAD
$PAD
Sh "16" C 1280 1280 0 0 0
Dr 1280 0 0
At STD N 0000FFFF
Ne 0 ""
Po 2496 22
$EndPAD
$SHAPE3D
Na "walter\conn_pc\rj45-noshield.wrl"
Sc 1.000000 1.000000 1.000000
Of 0.000000 0.000000 0.000000
Ro 0.000000 0.000000 0.000000
$EndSHAPE3D
$EndMODULE  rj45-noshield
$MODULE rj45-Tyco-2-5338556-1
Po 0 0 0 15 4BA261D1 00000000 ~~
Li rj45-Tyco-2-5338556-1
Cd RJ45, shielded, Tyco P/N 2-5338556-1
Sc 00000000
AR
Op 0 0 0
T0 0 3858 600 600 0 120 N V 21 N"RJ45-Tyco-2-5338556-1"
T1 0 -4724 600 600 0 120 N V 21 N"JP***"
DS 3268 3268 -3268 3268 150 21
DS -3268 3268 -3268 -4252 150 21
DS -3268 -4252 3268 -4252 150 21
DS 3268 -4252 3268 3268 150 21
DS 600 1042 -600 1042 150 21
DS 400 1042 400 3242 150 21
DS 600 341 600 1041 150 21
DS -600 1042 -600 342 150 21
DS -400 3242 -400 1042 150 21
DS -2400 3242 -2400 342 150 21
DS -2400 303 2400 303 150 21
DS 2400 342 2400 3242 150 21
$PAD
Sh "3" C 472 472 0 0 0
Dr 315 0 0
At STD N 0000FFFF
Ne 0 ""
Po 599 -2504
$EndPAD
$PAD
Sh "1" C 472 472 0 0 0
Dr 315 0 0
At STD N 0000FFFF
Ne 0 ""
Po 1398 -2504
$EndPAD
$PAD
Sh "2" C 472 472 0 0 0
Dr 315 0 0
At STD N 0000FFFF
Ne 0 ""
Po 999 -3504
$EndPAD
$PAD
Sh "4" C 472 472 0 0 0
Dr 315 0 0
At STD N 0000FFFF
Ne 0 ""
Po 200 -3504
$EndPAD
$PAD
Sh "5" C 472 472 0 0 0
Dr 315 0 0
At STD N 0000FFFF
Ne 0 ""
Po -200 -2504
$EndPAD
$PAD
Sh "6" C 472 472 0 0 0
Dr 315 0 0
At STD N 0000FFFF
Ne 0 ""
Po -599 -3504
$EndPAD
$PAD
Sh "7" C 472 472 0 0 0
Dr 315 0 0
At STD N 0000FFFF
Ne 0 ""
Po -999 -2504
$EndPAD
$PAD
Sh "8" C 472 472 0 0 0
Dr 315 0 0
At STD N 0000FFFF
Ne 0 ""
Po -1398 -3504
$EndPAD
$PAD
Sh "13" C 984 984 0 0 0
Dr 591 0 0
At STD N 0000FFFF
Ne 0 ""
Po -3100 1201
$EndPAD
$PAD
Sh "14" C 984 984 0 0 0
Dr 591 0 0
At STD N 0000FFFF
Ne 0 ""
Po 3100 1201
$EndPAD
$PAD
Sh "15" C 1280 1280 0 0 0
Dr 1280 0 0
At STD N 0000FFFF
Ne 0 ""
Po -2250 0
$EndPAD
$PAD
Sh "16" C 1280 1280 0 0 0
Dr 1280 0 0
At STD N 0000FFFF
Ne 0 ""
Po 2250 0
$EndPAD
$EndMODULE  rj45-Tyco-2-5338556-1
$MODULE conn_usb_B_micro_smd
Po 0 0 0 15 4E68E149 00000000 ~~
Li conn_usb_B_micro_smd
Cd USB B micro SMD connector, Molex P/N 47346-0001
Sc 00000000
AR conn_usb_B_micro_smd
Op 0 0 0
T0 0 1024 197 197 0 39 N V 21 N "conn_usb_B_micro_smd"
T1 0 -1575 197 197 0 39 N V 21 N "VAL**"
DS -1654 787 1654 787 79 21
DS -1654 827 1654 827 79 21
DS 1654 827 1654 748 79 21
DS 1654 748 -1654 748 79 21
DS -1654 748 -1654 827 79 21
DS -1535 827 -1535 -1142 79 21
DS -1535 -1142 1535 -1142 79 21
DS 1535 -1142 1535 827 79 21
$PAD
Sh "6" R 463 748 0 0 0
Dr 0 0 0
At SMD N 00888000
Ne 0 ""
Po -330 0
$EndPAD
$PAD
Sh "6" R 463 748 0 0 0
Dr 0 0 0
At SMD N 00888000
Ne 0 ""
Po 330 0
$EndPAD
$PAD
Sh "6" R 935 748 0 0 0
Dr 0 0 0
At SMD N 00888000
Ne 0 ""
Po 1147 0
$EndPAD
$PAD
Sh "6" R 935 748 0 0 0
Dr 0 0 0
At SMD N 00888000
Ne 0 ""
Po -1147 0
$EndPAD
$PAD
Sh "6" R 581 827 0 0 0
Dr 0 0 0
At SMD N 00888000
Ne 0 ""
Po 969 -906
$EndPAD
$PAD
Sh "6" R 581 827 0 0 0
Dr 0 0 0
At SMD N 00888000
Ne 0 ""
Po -969 -906
$EndPAD
$PAD
Sh "1" R 177 543 0 0 0
Dr 0 0 0
At SMD N 00888000
Ne 0 ""
Po -512 -1047
$EndPAD
$PAD
Sh "2" R 177 543 0 0 0
Dr 0 0 0
At SMD N 00888000
Ne 0 ""
Po -256 -1047
$EndPAD
$PAD
Sh "3" R 177 543 0 0 0
Dr 0 0 0
At SMD N 00888000
Ne 0 ""
Po 0 -1047
$EndPAD
$PAD
Sh "4" R 177 543 0 0 0
Dr 0 0 0
At SMD N 00888000
Ne 0 ""
Po 256 -1047
$EndPAD
$PAD
Sh "5" R 177 543 0 0 0
Dr 0 0 0
At SMD N 00888000
Ne 0 ""
Po 512 -1047
$EndPAD
$SHAPE3D
Na "walter\conn_pc\usb_B_micro_smd.wrl"
Sc 1.000000 1.000000 1.000000
Of 0.000000 0.000000 0.000000
Ro 0.000000 0.000000 0.000000
$EndSHAPE3D
$EndMODULE  conn_usb_B_micro_smd
$EndLIBRARY
