PCBNEW-LibModule-V1  So 8. prosinec 2012, 18:14:51 CET
# encoding utf-8
Units deci-mils
$INDEX

AUTOLED
FYT-5631
HD-A54X
HD-M51XXX
L-BARG
LED-5X2MM
LED-5X2MM_v2
LED-LEZICI
LED10MM
LED3V-5MM
OPTOCOUPLER
PHOTO_NPN
PHOTO_NPN-3mm
SFH506
SFH5110
SFH5110-L
SSD1303-TAB
$EndINDEX
$MODULE 
Po 0 0 0 15 4EA17055 4EA16DD6 ~~
Li 
Sc 4EA16DD6
AR 
Op 0 0 0
T0 0 -1800 315 315 0 79 N V 21 N "AUTOLED-H"
T1 0 0 315 315 0 59 N I 21 N "Val**"
DC 0 0 500 -500 118 21
DS -1500 1500 1500 1500 118 21
DS 1500 1500 1500 -1500 118 21
DS 1500 -1500 -1000 -1500 118 21
DS -1000 -1500 -1500 -1000 118 21
DS -1500 -1000 -1500 1500 118 21
$PAD
Sh "1" R 600 600 0 0 0
Dr 360 0 0
At STD N 00C08001
Ne 0 ""
Po -1000 1000
$EndPAD
$PAD
Sh "2" C 600 600 0 0 0
Dr 360 0 0
At STD N 0CC08001
Ne 0 ""
Po 1000 1000
$EndPAD
$PAD
Sh "3" C 600 600 0 0 0
Dr 360 0 0
At STD N 0CC08001
Ne 0 ""
Po -1000 -1000
$EndPAD
$PAD
Sh "4" C 600 600 0 0 0
Dr 360 0 0
At STD N 0CC08001
Ne 0 ""
Po 1000 -1000
$EndPAD
$EndMODULE 
$MODULE AUTOLED
Po 0 0 0 15 4EA170F7 00000000 ~~
Li AUTOLED
Sc 0
AR 
Op 0 0 0
T0 0 -1800 315 315 0 79 N V 21 N "AUTOLED-H"
T1 0 0 315 315 0 59 N I 21 N "Val**"
DC 0 0 500 -500 118 21
DS -1500 1500 1500 1500 118 21
DS 1500 1500 1500 -1500 118 21
DS 1500 -1500 -1000 -1500 118 21
DS -1000 -1500 -1500 -1000 118 21
DS -1500 -1000 -1500 1500 118 21
$PAD
Sh "1" R 600 600 0 0 0
Dr 354 0 0
At STD N 00E0FFFF
Ne 0 ""
Po -1000 1000
$EndPAD
$PAD
Sh "2" C 600 600 0 0 0
Dr 354 0 0
At STD N 00E0FFFF
Ne 0 ""
Po 1000 1000
$EndPAD
$PAD
Sh "3" C 600 600 0 0 0
Dr 354 0 0
At STD N 00E0FFFF
Ne 0 ""
Po -1000 -1000
$EndPAD
$PAD
Sh "4" C 600 600 0 0 0
Dr 354 0 0
At STD N 00E0FFFF
Ne 0 ""
Po 1000 -1000
$EndPAD
$SHAPE3D
Na "LED/AutoLED.wrl"
Sc 1 -1 1
Of 0 0 0
Ro 0 0 0
$EndSHAPE3D
$EndMODULE AUTOLED
$MODULE FYT-5631
Po 0 0 0 15 4EA172FD 00000000 ~~
Li FYT-5631
Sc 0
AR 
Op 0 0 0
T0 0 -4200 394 394 0 79 N V 21 N "FYT-5631"
T1 0 4400 394 394 0 79 N I 21 N "Val**"
DS -6850 3740 -7441 3150 118 21
DC 5340 2210 5420 2130 390 26
DC 1650 2210 1730 2130 390 26
DC -2050 2210 -1970 2130 390 26
DS 4240 2290 2590 2280 390 26
DS 2280 1970 2470 280 390 26
DS 4640 1970 4830 280 390 26
DS 4480 0 2820 0 390 26
DS 2510 -310 2710 -2000 390 26
DS 4870 -310 5070 -2000 390 26
DS 4710 -2350 3060 -2360 390 26
DS 550 2290 -1110 2280 390 26
DS -1420 1970 -1230 280 390 26
DS 940 1970 1130 280 390 26
DS 780 0 -880 0 390 26
DS -1180 -310 -990 -2000 390 26
DS 1170 -310 1370 -2000 390 26
DS 1020 -2350 -640 -2360 390 26
DS -3150 2290 -4810 2280 390 26
DS -5120 1970 -4920 280 390 26
DS -2760 1970 -2560 280 390 26
DS -2920 0 -4570 0 390 26
DS -4880 -310 -4690 -2000 390 26
DS -2520 -310 -2330 -2000 390 26
DS -2680 -2350 -4340 -2360 390 26
DS -7440 3740 7430 3740 190 26
DS 7430 3740 7430 -3730 190 26
DS 7430 -3730 -7440 -3730 190 26
DS -7440 -3730 -7440 3740 190 26
DS -7440 3740 7430 3740 190 21
DS 7430 3740 7430 -3730 190 21
DS 7430 -3730 -7440 -3730 190 21
DS -7440 -3730 -7440 3740 190 21
$PAD
Sh "1" R 700 700 0 0 0
Dr 300 0 0
At STD N 00E0FFFF
Ne 0 ""
Po -2500 3000
$EndPAD
$PAD
Sh "2" C 700 700 0 0 0
Dr 300 0 0
At STD N 00E0FFFF
Ne 0 ""
Po -1500 3000
$EndPAD
$PAD
Sh "3" C 700 700 0 0 0
Dr 300 0 0
At STD N 00E0FFFF
Ne 0 ""
Po -500 3000
$EndPAD
$PAD
Sh "4" C 700 700 0 0 0
Dr 300 0 0
At STD N 00E0FFFF
Ne 0 ""
Po 500 3000
$EndPAD
$PAD
Sh "5" C 700 700 0 0 0
Dr 300 0 0
At STD N 00E0FFFF
Ne 0 ""
Po 1500 3000
$EndPAD
$PAD
Sh "6" C 700 700 0 0 0
Dr 300 0 0
At STD N 00E0FFFF
Ne 0 ""
Po 2500 3000
$EndPAD
$PAD
Sh "7" C 700 700 0 0 0
Dr 300 0 0
At STD N 00E0FFFF
Ne 0 ""
Po 2500 -3000
$EndPAD
$PAD
Sh "8" C 700 700 0 0 0
Dr 300 0 0
At STD N 00E0FFFF
Ne 0 ""
Po 1500 -3000
$EndPAD
$PAD
Sh "9" C 700 700 0 0 0
Dr 300 0 0
At STD N 00E0FFFF
Ne 0 ""
Po 500 -3000
$EndPAD
$PAD
Sh "10" C 700 700 0 0 0
Dr 300 0 0
At STD N 00E0FFFF
Ne 0 ""
Po -500 -3000
$EndPAD
$PAD
Sh "11" C 700 700 0 0 0
Dr 300 0 0
At STD N 00E0FFFF
Ne 0 ""
Po -1500 -3000
$EndPAD
$PAD
Sh "12" C 700 700 0 0 0
Dr 300 0 0
At STD N 00E0FFFF
Ne 0 ""
Po -2500 -3000
$EndPAD
$EndMODULE FYT-5631
$MODULE HD-A54X
Po 0 0 0 15 4FC4CC20 00000000 ~~
Li HD-A54X
Sc 0
AR 
Op 0 0 0
T0 0 -4500 394 394 0 79 N V 21 N "HD-A54X"
T1 0 4500 394 394 0 79 N I 21 N "Value"
DC 3150 2140 3230 2140 390 25
DS 790 2140 2050 2140 390 25
DS 950 20 2210 20 390 25
DS 1190 -2190 2450 -2190 390 25
DS 2600 330 2450 1830 390 25
DS 2680 -380 2840 -1870 390 25
DS 950 20 2210 20 390 25
DS 560 330 400 1830 390 25
DS 640 -380 790 -1870 390 25
DC -780 2140 -700 2140 390 25
DS -3140 2140 -1880 2140 390 25
DS -2980 20 -1720 20 390 25
DS -2750 -2190 -1490 -2190 390 25
DS -1330 330 -1490 1830 390 25
DS -1250 -380 -1090 -1870 390 25
DS -2980 20 -1720 20 390 25
DS -3380 330 -3530 1830 390 25
DS -3300 -380 -3140 -1870 390 25
DS -5000 3000 -4000 4000 70 21
DS -4000 4000 -5000 4000 70 25
DS -5000 4000 -5000 3000 70 25
DS -5000 4000 -5000 -4000 70 21
DS -5000 -4000 5000 -4000 70 21
DS 5000 -4000 5000 4000 70 21
DS 5000 4000 -5000 4000 70 21
$PAD
Sh "1" R 600 600 0 0 0
Dr 360 0 0
At STD N 00E0FFFF
Ne 0 ""
Po -4000 3000
$EndPAD
$PAD
Sh "2" C 600 600 0 0 0
Dr 360 0 0
At STD N 00E0FFFF
Ne 0 ""
Po -3000 3000
$EndPAD
$PAD
Sh "3" C 600 600 0 0 0
Dr 360 0 0
At STD N 00E0FFFF
Ne 0 ""
Po -2000 3000
$EndPAD
$PAD
Sh "4" C 600 600 0 0 0
Dr 360 0 0
At STD N 00E0FFFF
Ne 0 ""
Po -1000 3000
$EndPAD
$PAD
Sh "5" C 600 600 0 0 0
Dr 360 0 0
At STD N 00E0FFFF
Ne 0 ""
Po 0 3000
$EndPAD
$PAD
Sh "6" C 600 600 0 0 0
Dr 360 0 0
At STD N 00E0FFFF
Ne 0 ""
Po 1000 3000
$EndPAD
$PAD
Sh "7" C 600 600 0 0 0
Dr 360 0 0
At STD N 00E0FFFF
Ne 0 ""
Po 2000 3000
$EndPAD
$PAD
Sh "8" C 600 600 0 0 0
Dr 360 0 0
At STD N 00E0FFFF
Ne 0 ""
Po 3000 3000
$EndPAD
$PAD
Sh "9" C 600 600 0 0 0
Dr 360 0 0
At STD N 00E0FFFF
Ne 0 ""
Po 4000 3000
$EndPAD
$PAD
Sh "10" C 600 600 0 0 0
Dr 360 0 0
At STD N 00E0FFFF
Ne 0 ""
Po 4000 -3000
$EndPAD
$PAD
Sh "11" C 600 600 0 0 0
Dr 360 0 0
At STD N 00E0FFFF
Ne 0 ""
Po 3000 -3000
$EndPAD
$PAD
Sh "12" C 600 600 0 0 0
Dr 360 0 0
At STD N 00E0FFFF
Ne 0 ""
Po 2000 -3000
$EndPAD
$PAD
Sh "13" C 600 600 0 0 0
Dr 360 0 0
At STD N 00E0FFFF
Ne 0 ""
Po 1000 -3000
$EndPAD
$PAD
Sh "14" C 600 600 0 0 0
Dr 360 0 0
At STD N 00E0FFFF
Ne 0 ""
Po 0 -3000
$EndPAD
$PAD
Sh "15" C 600 600 0 0 0
Dr 360 0 0
At STD N 00E0FFFF
Ne 0 ""
Po -1000 -3000
$EndPAD
$PAD
Sh "16" C 600 600 0 0 0
Dr 360 0 0
At STD N 00E0FFFF
Ne 0 ""
Po -2000 -3000
$EndPAD
$PAD
Sh "17" C 600 600 0 0 0
Dr 360 0 0
At STD N 00E0FFFF
Ne 0 ""
Po -3000 -3000
$EndPAD
$PAD
Sh "18" C 600 600 0 0 0
Dr 360 0 0
At STD N 00E0FFFF
Ne 0 ""
Po -4000 -3000
$EndPAD
$EndMODULE HD-A54X
$MODULE HD-M51XXX
Po 0 0 0 15 4FC4CD8B 00000000 ~~
Li HD-M51XXX
Sc 0
AR 
Op 0 0 0
T0 0 -4250 394 394 0 79 N V 21 N "HD-M51XXX"
T1 0 4250 394 394 0 79 N I 21 N "Val**"
DS -9000 3750 -9750 3000 79 21
DS 1350 20 2690 20 390 25
DS 960 250 800 1900 390 25
DS 1190 -2030 1030 -380 390 25
DC -460 2140 -380 2060 390 25
DS -2900 2220 -1560 2220 390 25
DS -2430 -2270 -1090 -2270 390 25
DS -1010 330 -1170 1980 390 25
DS -770 -1950 -930 -300 390 25
DS -2660 20 -1330 20 390 25
DS -3060 250 -3210 1900 390 25
DS -2820 -2030 -2980 -380 390 25
DC -4310 2140 -4240 2060 390 25
DS -6750 2220 -5420 2220 390 25
DS -6280 -2270 -4940 -2270 390 25
DS -4860 330 -5020 1980 390 25
DS -4630 -1950 -4790 -300 390 25
DS -6520 20 -5180 20 390 25
DS -6910 250 -7070 1900 390 25
DS -6670 -2030 -6830 -380 390 25
DS -9750 3750 9750 3750 79 21
DS 9750 3750 9750 -3750 79 21
DS 9750 -3750 -9750 -3750 79 21
DS -9750 -3750 -9750 3750 79 21
DC 7410 2140 7490 2060 390 25
DS 4970 2220 6310 2220 390 25
DS 5440 -2270 6780 -2270 390 25
DS 6860 330 6700 1980 390 25
DS 7090 -1950 6930 -300 390 25
DS 5200 20 6540 20 390 25
DS 4810 250 4650 1900 390 25
DS 5050 -2030 4890 -380 390 25
DC 3550 2140 3630 2060 390 25
DS 1110 2220 2450 2220 390 25
DS 1590 -2270 2920 -2270 390 25
DS 3000 330 2840 1980 390 25
DS 3240 -1950 3080 -300 390 25
$PAD
Sh "1" R 600 600 0 0 0
Dr 360 0 0
At STD N 00E0FFFF
Ne 0 ""
Po -2500 3000
$EndPAD
$PAD
Sh "2" C 600 600 0 0 0
Dr 360 0 0
At STD N 00E0FFFF
Ne 0 ""
Po -1500 3000
$EndPAD
$PAD
Sh "3" C 600 600 0 0 0
Dr 360 0 0
At STD N 00E0FFFF
Ne 0 ""
Po -500 3000
$EndPAD
$PAD
Sh "4" C 600 600 0 0 0
Dr 360 0 0
At STD N 00E0FFFF
Ne 0 ""
Po 500 3000
$EndPAD
$PAD
Sh "5" C 600 600 0 0 0
Dr 360 0 0
At STD N 00E0FFFF
Ne 0 ""
Po 1500 3000
$EndPAD
$PAD
Sh "6" C 600 600 0 0 0
Dr 360 0 0
At STD N 00E0FFFF
Ne 0 ""
Po 2500 3000
$EndPAD
$PAD
Sh "7" C 600 600 0 0 0
Dr 360 0 0
At STD N 00E0FFFF
Ne 0 ""
Po 2500 -3000
$EndPAD
$PAD
Sh "8" C 600 600 0 0 0
Dr 360 0 0
At STD N 00E0FFFF
Ne 0 ""
Po 1500 -3000
$EndPAD
$PAD
Sh "9" C 600 600 0 0 0
Dr 360 0 0
At STD N 00E0FFFF
Ne 0 ""
Po 500 -3000
$EndPAD
$PAD
Sh "10" C 600 600 0 0 0
Dr 360 0 0
At STD N 00E0FFFF
Ne 0 ""
Po -500 -3000
$EndPAD
$PAD
Sh "11" C 600 600 0 0 0
Dr 360 0 0
At STD N 00E0FFFF
Ne 0 ""
Po -1500 -3000
$EndPAD
$PAD
Sh "12" C 600 600 0 0 0
Dr 360 0 0
At STD N 00E0FFFF
Ne 0 ""
Po -2500 -3000
$EndPAD
$EndMODULE HD-M51XXX
$MODULE L-BARG
Po 0 0 0 15 50B9C017 00000000 ~~
Li L-BARG
Sc 0
AR 
Op 0 0 0
T0 0 -2500 394 394 0 79 N V 21 N "L-BARG"
T1 0 2500 394 394 0 79 N I 21 N "Val**"
DS 1500 -500 1500 500 590 21
DS 2500 -500 2500 500 590 21
DS -500 -500 -500 500 590 21
DS 500 -500 500 500 590 21
DS -2500 -500 -2500 500 590 21
DS -1500 -500 -1500 500 590 21
DS 3500 -500 3500 500 590 21
DS 4500 -500 4500 500 590 21
DS -3500 -500 -3500 500 590 21
DS -4500 -500 -4500 500 590 21
DS -5000 -2000 -5000 1500 110 21
DS -5000 1500 -4500 2000 110 21
DS -4500 2000 5000 2000 110 21
DS 5000 2000 5000 -2000 110 21
DS 5000 -2000 -5000 -2000 110 21
$PAD
Sh "1" R 620 620 0 0 0
Dr 300 0 0
At STD N 00E0FFFF
Ne 0 ""
Po -4500 1500
$EndPAD
$PAD
Sh "2" C 620 620 0 0 0
Dr 300 0 0
At STD N 00E0FFFF
Ne 0 ""
Po -3500 1500
$EndPAD
$PAD
Sh "3" C 620 620 0 0 0
Dr 300 0 0
At STD N 00E0FFFF
Ne 0 ""
Po -2500 1500
$EndPAD
$PAD
Sh "4" C 620 620 0 0 0
Dr 300 0 0
At STD N 00E0FFFF
Ne 0 ""
Po -1500 1500
$EndPAD
$PAD
Sh "5" C 620 620 0 0 0
Dr 300 0 0
At STD N 00E0FFFF
Ne 0 ""
Po -500 1500
$EndPAD
$PAD
Sh "6" C 620 620 0 0 0
Dr 300 0 0
At STD N 00E0FFFF
Ne 0 ""
Po 500 1500
$EndPAD
$PAD
Sh "7" C 620 620 0 0 0
Dr 300 0 0
At STD N 00E0FFFF
Ne 0 ""
Po 1500 1500
$EndPAD
$PAD
Sh "8" C 620 620 0 0 0
Dr 300 0 0
At STD N 00E0FFFF
Ne 0 ""
Po 2500 1500
$EndPAD
$PAD
Sh "9" C 620 620 0 0 0
Dr 300 0 0
At STD N 00E0FFFF
Ne 0 ""
Po 3500 1500
$EndPAD
$PAD
Sh "10" C 620 620 0 0 0
Dr 300 0 0
At STD N 00E0FFFF
Ne 0 ""
Po 4500 1500
$EndPAD
$PAD
Sh "11" C 620 620 0 0 0
Dr 300 0 0
At STD N 00E0FFFF
Ne 0 ""
Po 4500 -1500
$EndPAD
$PAD
Sh "12" C 620 620 0 0 0
Dr 300 0 0
At STD N 00E0FFFF
Ne 0 ""
Po 3500 -1500
$EndPAD
$PAD
Sh "13" C 620 620 0 0 0
Dr 300 0 0
At STD N 00E0FFFF
Ne 0 ""
Po 2500 -1500
$EndPAD
$PAD
Sh "14" C 620 620 0 0 0
Dr 300 0 0
At STD N 00E0FFFF
Ne 0 ""
Po 1500 -1500
$EndPAD
$PAD
Sh "15" C 620 620 0 0 0
Dr 300 0 0
At STD N 00E0FFFF
Ne 0 ""
Po 500 -1500
$EndPAD
$PAD
Sh "16" C 620 620 0 0 0
Dr 300 0 0
At STD N 00E0FFFF
Ne 0 ""
Po -500 -1500
$EndPAD
$PAD
Sh "17" C 620 620 0 0 0
Dr 300 0 0
At STD N 00E0FFFF
Ne 0 ""
Po -1500 -1500
$EndPAD
$PAD
Sh "18" C 620 620 0 0 0
Dr 300 0 0
At STD N 00E0FFFF
Ne 0 ""
Po -2500 -1500
$EndPAD
$PAD
Sh "19" C 620 620 0 0 0
Dr 300 0 0
At STD N 00E0FFFF
Ne 0 ""
Po -3500 -1500
$EndPAD
$PAD
Sh "20" C 620 620 0 0 0
Dr 300 0 0
At STD N 00E0FFFF
Ne 0 ""
Po -4500 -1500
$EndPAD
$SHAPE3D
Na "Vlastni/BARGRAF.wrl"
Sc 1 1 1
Of 0 0 0
Ro 0 0 0
$EndSHAPE3D
$EndMODULE L-BARG
$MODULE LED-5X2MM
Po 0 0 0 15 50B9C05A 00000000 ~~
Li LED-5X2MM
Sc 0
AR 
Op 0 0 0
T0 0 -1000 394 394 0 79 N V 21 N "LED 5X2MM"
T1 0 1000 315 315 0 59 N I 21 N "Val**"
DS -1000 500 1000 500 70 21
DS 1000 500 1000 -500 70 21
DS 1000 -500 -1000 -500 70 21
DS -1000 -500 -1000 500 70 21
$PAD
Sh "1" R 600 600 0 0 0
Dr 360 0 0
At STD N 0CC08001
Ne 0 ""
Po -500 0
$EndPAD
$PAD
Sh "2" C 600 600 0 0 0
Dr 360 0 0
At STD N 0CC08001
Ne 0 ""
Po 500 0
$EndPAD
$SHAPE3D
Na "LED/LED2x5mm-RED.wrl"
Sc 1 1 1
Of 0 0 0
Ro 0 0 0
$EndSHAPE3D
$EndMODULE LED-5X2MM
$MODULE LED-5X2MM_v2
Po 0 0 0 15 4EA17611 00000000 ~~
Li LED-5X2MM_v2
Sc 0
AR 
Op 0 0 0
T0 0 -1000 394 394 0 79 N V 21 N "LED 5X2MM"
T1 0 1000 315 315 0 59 N I 21 N "Val**"
DS -1000 500 -1000 -500 70 26
DS -1000 -500 1000 -500 70 26
DS 1000 -500 1000 500 70 26
DS 1000 500 -1000 500 70 26
DS -1000 500 1000 500 70 21
DS 1000 500 1000 -500 70 21
DS 1000 -500 -1000 -500 70 21
DS -1000 -500 -1000 500 70 21
$PAD
Sh "1" R 600 600 0 0 0
Dr 360 0 0
At STD N 0CC08001
Ne 0 ""
Po -500 0
$EndPAD
$PAD
Sh "2" C 600 600 0 0 0
Dr 360 0 0
At STD N 0CC08001
Ne 0 ""
Po 500 0
$EndPAD
$EndMODULE LED-5X2MM_v2
$MODULE LED-LEZICI
Po 0 0 0 15 50B9C0B9 00000000 ~~
Li LED-LEZICI
Sc 0
AR 
Op 0 0 0
T0 -1250 -2750 315 315 900 59 N V 21 N "LED-LEZICI"
T1 0 -2750 315 315 900 59 N I 21 N "Val**"
DS 500 -500 500 -1120 310 21
DS -500 -500 -500 -1120 310 21
DS -1000 -1250 1000 -1250 70 21
DS 1000 -1250 1000 -1500 70 21
DS 1000 -1500 870 -1500 70 21
DS 870 -1500 870 -3620 70 21
DA 0 -3500 -880 -3620 1643 70 21
DS -880 -3620 -880 -1500 70 21
DS -880 -1500 -1000 -1500 70 21
DS -1000 -1500 -1000 -1250 70 21
$PAD
Sh "1" R 600 600 0 0 0
Dr 360 0 0
At STD N 00E0FFFF
Ne 0 ""
Po -500 0
$EndPAD
$PAD
Sh "2" C 600 600 0 0 0
Dr 360 0 0
At STD N 00E0FFFF
Ne 0 ""
Po 500 0
$EndPAD
$SHAPE3D
Na "LED/led5_horizontal.wrl"
Sc 1 1 1
Of 0 0 0
Ro 0 0 0
$EndSHAPE3D
$EndMODULE LED-LEZICI
$MODULE LED10MM
Po 0 0 0 15 4EA1768F 00000000 ~~
Li LED10MM
Sc 0
AR 
Op 0 0 0
T0 0 -2500 315 315 0 59 N V 21 N "LED 10MM"
T1 0 1000 315 315 0 59 N I 21 N "Val**"
DA 40 50 1750 0 930 70 21
DA -50 -40 -1750 0 930 70 21
DC 0 0 2150 0 70 21
DA -50 -40 -1750 0 930 70 26
DC 0 0 2150 0 70 26
DA -40 -30 1500 0 873 70 26
DA 30 40 -1500 0 873 70 21
DA -30 -20 1500 0 881 70 21
DA 40 50 1750 0 930 70 26
DA 30 40 -1500 0 873 70 26
$PAD
Sh "1" R 600 600 0 0 0
Dr 360 0 0
At STD N 00E0FFFF
Ne 0 ""
Po -500 0
$EndPAD
$PAD
Sh "2" C 600 600 0 0 0
Dr 360 0 0
At STD N 00E0FFFF
Ne 0 ""
Po 500 0
$EndPAD
$EndMODULE LED10MM
$MODULE LED3V-5MM
Po 0 0 0 15 4EA1777B 00000000 ~~
Li LED3V-5MM
Sc 0
AR 
Op 0 0 0
T0 0 -1500 315 315 0 59 N V 21 N "LED3V 5MM"
T1 0 1500 315 315 0 59 N I 21 N "Val**"
DA -30 -20 1000 0 872 50 21
DA 20 30 -1000 0 872 50 21
DC 0 0 850 -850 110 21
DA -30 -20 1000 0 872 50 26
DA 20 30 -1000 0 872 50 26
DC 0 0 850 -850 110 26
$PAD
Sh "1" R 600 600 0 0 0
Dr 360 0 0
At STD N 00E0FFFF
Ne 0 ""
Po 0 0
$EndPAD
$PAD
Sh "2" C 600 600 0 0 0
Dr 360 0 0
At STD N 00E0FFFF
Ne 0 ""
Po -1000 0
$EndPAD
$PAD
Sh "3" C 600 600 0 0 0
Dr 360 0 0
At STD N 00E0FFFF
Ne 0 ""
Po 1000 0
$EndPAD
$EndMODULE LED3V-5MM
$MODULE OPTOCOUPLER
Po 0 0 0 15 50B9C0FB 00000000 ~~
Li OPTOCOUPLER
Sc 0
AR 
Op 0 0 0
T0 0 -2250 315 315 0 59 N V 21 N "OPTOCOUPLER"
T1 0 0 315 315 0 59 N I 21 N "Val**"
DS -1380 500 -1380 -1000 70 21
DS -1380 -1000 1370 -1000 70 21
DS 1370 -1000 1370 1000 70 21
DS 1370 1000 -1380 1000 70 21
DS -1380 1000 -1380 500 70 21
DS -1380 500 -1130 500 70 21
DS -1130 500 -1130 -500 70 21
DS -1130 -500 -1380 -500 70 21
$PAD
Sh "1" R 560 560 0 0 900
Dr 320 0 0
At STD N 00E0FFFF
Ne 0 ""
Po -500 1500
$EndPAD
$PAD
Sh "2" C 560 560 0 0 0
Dr 320 0 0
At STD N 00E0FFFF
Ne 0 ""
Po 500 1500
$EndPAD
$PAD
Sh "3" C 560 560 0 0 0
Dr 320 0 0
At STD N 00E0FFFF
Ne 0 ""
Po 500 -1500
$EndPAD
$PAD
Sh "4" C 560 560 0 0 0
Dr 320 0 0
At STD N 00E0FFFF
Ne 0 ""
Po -500 -1500
$EndPAD
$SHAPE3D
Na "dil/dil_4-300.wrl"
Sc 1 1 1
Of 0 0 0
Ro 0 0 0
$EndSHAPE3D
$EndMODULE OPTOCOUPLER
$MODULE PHOTO_NPN
Po 0 0 0 15 4FE78592 00000000 ~~
Li PHOTO_NPN
Sc 0
AR 
Op 0 0 0
T0 0 -1250 315 315 0 59 N V 21 N "PHOTO_NPN"
T1 0 1500 315 315 0 59 N I 21 N "Val**"
DC 0 0 1000 0 100 26
DC 0 0 -750 -500 20 26
DC 0 0 -750 -500 20 21
DC 0 0 1000 0 100 21
$PAD
Sh "1" R 600 600 0 0 0
Dr 315 0 0
At STD N 00E0FFFF
Ne 0 ""
Po -500 0
$EndPAD
$PAD
Sh "2" C 600 600 0 0 0
Dr 315 0 0
At STD N 00E0FFFF
Ne 0 ""
Po 500 0
$EndPAD
$SHAPE3D
Na "LED/led5_wit_trans2.wrl"
Sc 1 1 1
Of 0 0 0
Ro 0 0 0
$EndSHAPE3D
$EndMODULE PHOTO_NPN
$MODULE PHOTO_NPN-3mm
Po 0 0 0 15 4EA178CC 00000000 ~~
Li PHOTO_NPN-3mm
Sc 0
AR 
Op 0 0 0
T0 0 -1000 315 315 0 59 N V 21 N "PHOTO_NPN 3MM"
T1 0 1000 315 315 0 59 N I 21 N "Val**"
DA 0 0 370 500 737 70 26
DA 0 0 -380 -500 737 70 26
DA 0 0 370 500 737 70 21
DA 0 0 -380 -500 737 70 21
$PAD
Sh "1" R 600 600 0 0 0
Dr 315 0 0
At STD N 00E0FFFF
Ne 0 ""
Po -500 0
$EndPAD
$PAD
Sh "3" C 600 600 0 0 0
Dr 315 0 0
At STD N 00E0FFFF
Ne 0 ""
Po 500 0
$EndPAD
$SHAPE3D
Na "LED/led3_wit_trans2.wrl"
Sc 1 1 1
Of 0 0 0
Ro 0 0 0
$EndSHAPE3D
$EndMODULE PHOTO_NPN-3mm
$MODULE SFH506
Po 0 0 0 15 4EA17A78 00000000 ~~
Li SFH506
Sc 0
AR 
Op 0 0 0
T0 0 -2200 315 315 0 59 N V 21 N "SFH506"
T1 0 2350 315 315 0 59 N I 21 N "Val**"
DS -1000 750 -1000 850 71 21
DA -1000 0 -1000 750 900 71 21
DA -1000 0 -1750 0 900 71 21
DS -1000 2000 -1000 820 70 26
DS -1000 -750 -1000 -1930 70 26
DS -1000 -1930 570 -1930 70 26
DS 570 -1930 570 2000 70 26
DS 570 2000 -1000 2000 70 26
DS -1000 2000 570 2000 70 21
DS 570 2000 570 -1930 70 21
DS 570 -1930 -1000 -1930 70 21
DS -1000 -1930 -1000 -750 70 21
DS -1000 820 -1000 2000 70 21
$PAD
Sh "1" C 600 600 0 0 0
Dr 315 0 0
At STD N 00E0FFFF
Ne 0 ""
Po 0 1500
$EndPAD
$PAD
Sh "2" C 600 600 0 0 0
Dr 315 0 0
At STD N 00E0FFFF
Ne 0 ""
Po 0 -500
$EndPAD
$PAD
Sh "3" C 600 600 0 0 0
Dr 315 0 0
At STD N 00E0FFFF
Ne 0 ""
Po 0 -1500
$EndPAD
$EndMODULE SFH506
$MODULE SFH5110
Po 0 0 0 15 4EA17AD4 00000000 ~~
Li SFH5110
Sc 0
AR 
Op 0 0 0
T0 0 -1600 315 315 0 59 N V 21 N "SFH5110"
T1 0 1000 315 315 0 59 N I 21 N "Val**"
DS 1200 400 1200 520 110 21
DS 1200 520 -1200 520 110 21
DS -1200 520 -1200 400 110 21
DS -1200 -660 1200 -660 110 26
DS -1200 520 1200 520 110 26
DS 1200 520 1200 -660 110 26
DS 1200 -660 1000 -660 110 26
DA 0 -190 -1000 -660 1296 110 26
DS -1000 -660 -1200 -660 110 26
DS -1200 -660 -1200 480 110 26
DS -1200 -390 -1200 -660 110 21
DS -1200 -660 -1000 -660 110 21
DA 0 -190 -1000 -660 1296 110 21
DS 1000 -660 1200 -660 110 21
DS 1200 -660 1200 -430 110 21
$PAD
Sh "1" R 580 580 0 0 0
Dr 300 0 0
At STD N 00E0FFFF
Ne 0 ""
Po 1000 0
$EndPAD
$PAD
Sh "2" C 580 580 0 0 0
Dr 300 0 0
At STD N 00E0FFFF
Ne 0 ""
Po 0 0
$EndPAD
$PAD
Sh "3" C 580 580 0 0 0
Dr 300 0 0
At STD N 00E0FFFF
Ne 0 ""
Po -1000 0
$EndPAD
$SHAPE3D
Na "Vlastni\\SFH5110.wrl"
Sc 1 1 1
Of 0 0 0
Ro 0 0 0
$EndSHAPE3D
$EndMODULE SFH5110
$MODULE SFH5110-L
Po 0 0 0 15 4EA17B33 00000000 ~~
Li SFH5110-L
Sc 0
AR 
Op 0 0 0
T0 0 -600 315 315 0 59 N V 21 N "SFH5110-L"
T1 0 4000 315 315 0 59 N I 21 N "Val**"
DS 820 1150 820 830 190 26
DS 820 830 1020 830 190 26
DS 1020 830 1020 520 190 26
DS -830 1150 -830 830 190 26
DS -830 830 -1030 830 190 26
DS -1030 830 -1030 520 190 26
DS 0 1150 0 520 190 26
DS -830 1150 -830 830 190 21
DS -830 830 -1030 830 190 21
DS -1030 830 -1030 520 190 21
DS 0 1150 0 520 190 21
DA -320 2680 -990 2680 900 110 21
DS -320 2010 310 2010 110 21
DA 310 2680 310 2010 900 110 21
DA 310 2680 980 2680 900 110 21
DS 310 3350 -320 3350 110 21
DA -380 2740 -320 3350 1012 110 21
DS 1170 1180 -1180 1180 110 21
DS -1180 1180 -1180 3540 110 21
DS -1180 3540 1170 3540 110 21
DS 1170 3540 1170 1180 110 21
DA -320 2680 -990 2680 900 110 26
DS -320 2010 310 2010 110 26
DA 310 2680 310 2010 900 110 26
DA 310 2680 980 2680 900 110 26
DS 310 3350 -320 3350 110 26
DA -380 2740 -320 3350 1012 110 26
DS 1170 1180 -1180 1180 110 26
DS -1180 1180 -1180 3540 110 26
DS -1180 3540 1170 3540 110 26
DS 1170 3540 1170 1180 110 26
DS 820 1150 820 830 190 21
DS 820 830 1020 830 190 21
DS 1020 830 1020 520 190 21
$PAD
Sh "1" R 580 580 0 0 0
Dr 300 0 0
At STD N 00E0FFFF
Ne 0 ""
Po 1000 0
$EndPAD
$PAD
Sh "2" C 580 580 0 0 0
Dr 300 0 0
At STD N 00E0FFFF
Ne 0 ""
Po 0 0
$EndPAD
$PAD
Sh "3" C 580 580 0 0 0
Dr 300 0 0
At STD N 00E0FFFF
Ne 0 ""
Po -1000 0
$EndPAD
$SHAPE3D
Na "Vlastni\\SFH5110L.wrl"
Sc 1 1 1
Of 0 0 0
Ro 0 0 0
$EndSHAPE3D
$EndMODULE SFH5110-L
$MODULE SSD1303-TAB
Po 0 0 0 15 4EA17B9D 00000000 ~~
Li SSD1303-TAB
Sc 0
AR 
Op 0 0 0
T0 0 -6200 315 315 0 59 N V 21 N "SSD1303-TAB"
T1 0 -3400 315 315 0 59 N I 21 N "Val**"
DS -5440 -4640 -5440 -2240 110 26
DS -5440 -2240 5430 -2240 110 26
DS 5430 -2240 5430 -4640 110 26
DS 5430 -4640 -5440 -4640 110 26
DS -5520 0 5470 0 110 26
DS -5520 1110 5430 1110 110 26
DS -1890 3310 1880 3310 110 26
DS 1880 3310 1880 4020 110 26
DS 1880 4020 -1890 4020 110 26
DS -1890 4020 -1890 3310 110 26
DS -5510 0 -6620 0 110 26
DS -6620 0 -6620 -5700 110 26
DS -6620 -5700 6530 -5700 110 26
DS 6530 -5700 6530 0 110 26
DS 6530 0 5430 0 110 26
DS 5430 0 5430 5830 110 26
DS 5430 5830 -5510 5830 110 26
DS -5510 5830 -5510 0 110 26
DS -5510 0 -6620 0 110 21
DS -6620 0 -6620 -5700 110 21
DS -6620 -5700 6530 -5700 110 21
DS 6530 -5700 6530 0 110 21
DS 6530 0 5430 0 110 21
DS 5430 0 5430 5830 110 21
DS 5430 5830 -5510 5830 110 21
DS -5510 5830 -5510 0 110 21
$PAD
Sh "1" R 140 680 0 0 0
Dr 0 0 0
At SMD N 04888000
Ne 0 ""
Po -5020 5190
$EndPAD
$PAD
Sh "2" R 140 680 0 0 0
Dr 0 0 0
At SMD N 04888000
Ne 0 ""
Po -4690 5190
$EndPAD
$PAD
Sh "3" R 140 680 0 0 0
Dr 0 0 0
At SMD N 04888000
Ne 0 ""
Po -4360 5190
$EndPAD
$PAD
Sh "4" R 140 680 0 0 0
Dr 0 0 0
At SMD N 04888000
Ne 0 ""
Po -4020 5190
$EndPAD
$PAD
Sh "5" R 140 680 0 0 0
Dr 0 0 0
At SMD N 04888000
Ne 0 ""
Po -3690 5190
$EndPAD
$PAD
Sh "6" R 140 680 0 0 0
Dr 0 0 0
At SMD N 04888000
Ne 0 ""
Po -3350 5190
$EndPAD
$PAD
Sh "7" R 140 680 0 0 0
Dr 0 0 0
At SMD N 04888000
Ne 0 ""
Po -3020 5190
$EndPAD
$PAD
Sh "8" R 140 680 0 0 0
Dr 0 0 0
At SMD N 04888000
Ne 0 ""
Po -2680 5190
$EndPAD
$PAD
Sh "9" R 140 680 0 0 0
Dr 0 0 0
At SMD N 04888000
Ne 0 ""
Po -2350 5190
$EndPAD
$PAD
Sh "10" R 140 680 0 0 0
Dr 0 0 0
At SMD N 04888000
Ne 0 ""
Po -2010 5190
$EndPAD
$PAD
Sh "11" R 140 680 0 0 0
Dr 0 0 0
At SMD N 04888000
Ne 0 ""
Po -1680 5190
$EndPAD
$PAD
Sh "12" R 140 680 0 0 0
Dr 0 0 0
At SMD N 04888000
Ne 0 ""
Po -1340 5190
$EndPAD
$PAD
Sh "13" R 140 680 0 0 0
Dr 0 0 0
At SMD N 04888000
Ne 0 ""
Po -1010 5190
$EndPAD
$PAD
Sh "14" R 140 680 0 0 0
Dr 0 0 0
At SMD N 04888000
Ne 0 ""
Po -670 5190
$EndPAD
$PAD
Sh "15" R 140 680 0 0 0
Dr 0 0 0
At SMD N 04888000
Ne 0 ""
Po -340 5190
$EndPAD
$PAD
Sh "16" R 140 680 0 0 0
Dr 0 0 0
At SMD N 04888000
Ne 0 ""
Po 0 5190
$EndPAD
$PAD
Sh "17" R 140 680 0 0 0
Dr 0 0 0
At SMD N 04888000
Ne 0 ""
Po 330 5190
$EndPAD
$PAD
Sh "18" R 140 680 0 0 0
Dr 0 0 0
At SMD N 04888000
Ne 0 ""
Po 660 5190
$EndPAD
$PAD
Sh "19" R 140 680 0 0 0
Dr 0 0 0
At SMD N 04888000
Ne 0 ""
Po 1000 5190
$EndPAD
$PAD
Sh "20" R 140 680 0 0 0
Dr 0 0 0
At SMD N 04888000
Ne 0 ""
Po 1330 5190
$EndPAD
$PAD
Sh "21" R 140 680 0 0 0
Dr 0 0 0
At SMD N 04888000
Ne 0 ""
Po 1670 5190
$EndPAD
$PAD
Sh "22" R 140 680 0 0 0
Dr 0 0 0
At SMD N 04888000
Ne 0 ""
Po 2000 5190
$EndPAD
$PAD
Sh "23" R 140 680 0 0 0
Dr 0 0 0
At SMD N 04888000
Ne 0 ""
Po 2340 5190
$EndPAD
$PAD
Sh "24" R 140 680 0 0 0
Dr 0 0 0
At SMD N 04888000
Ne 0 ""
Po 2670 5190
$EndPAD
$PAD
Sh "25" R 140 680 0 0 0
Dr 0 0 0
At SMD N 04888000
Ne 0 ""
Po 3010 5190
$EndPAD
$PAD
Sh "26" R 140 680 0 0 0
Dr 0 0 0
At SMD N 04888000
Ne 0 ""
Po 3340 5190
$EndPAD
$PAD
Sh "27" R 140 680 0 0 0
Dr 0 0 0
At SMD N 04888000
Ne 0 ""
Po 3680 5190
$EndPAD
$PAD
Sh "28" R 140 680 0 0 0
Dr 0 0 0
At SMD N 04888000
Ne 0 ""
Po 4010 5190
$EndPAD
$PAD
Sh "29" R 140 680 0 0 0
Dr 0 0 0
At SMD N 04888000
Ne 0 ""
Po 4350 5190
$EndPAD
$PAD
Sh "30" R 140 680 0 0 0
Dr 0 0 0
At SMD N 04888000
Ne 0 ""
Po 4680 5190
$EndPAD
$PAD
Sh "31" R 140 680 0 0 0
Dr 0 0 0
At SMD N 04888000
Ne 0 ""
Po 5010 5190
$EndPAD
$PAD
Sh "DIRA" C 340 340 0 0 0
Dr 180 0 0
At STD N 00E0FFFF
Ne 0 ""
Po -4340 4260
$EndPAD
$PAD
Sh "DIRA" C 340 340 0 0 0
Dr 180 0 0
At STD N 00E0FFFF
Ne 0 ""
Po 4330 4260
$EndPAD
$EndMODULE SSD1303-TAB
$EndLIBRARY
