PCBNEW-LibModule-V1  Po 1. duben 2013, 15:10:56 CEST
# encoding utf-8
Units mm
$INDEX
Bead
DE1207
DL50
DPU022A3
DPU033A3
DPU047A3
DPU068A3
DPU1000A1
DPU100A1
DPU140A4
DPU150A0.5
DPU150A5
DPU220A3
DPU330A1
DPU330A3
DPU470A1
DPU470A3
DPU680A1
FASTRON-AX
FASTRON-RAD
FASTRONAX-1000
FASTRONAX-800
FASTRONAX-M
FASTRONRAD-L
SC105F
SC75F
SFT1030
SMT43
TL.SMT75
TL.XXXSM4
TL.XXXSMD
TLEC
TLEC-1000
TLEC-800
TR_EI20-1X
TR_EI20-2X
TR_EI303-1X
TR_EI303-2X
TR_EI382-1X
TR_EI382-2X
TR_EI422
$EndINDEX
$MODULE Bead
Po 0 0 0 15 4FE73CDA 00000000 ~~
Li Bead
Sc 0
AR 
Op 0 0 0
T0 0 -2.286 0.99822 0.99822 0 0.19812 N V 21 N "Bead"
T1 0 0 0.99822 0.99822 0 0.19812 N I 21 N "Value"
DS 2.8448 0 3.81 0 0.1778 21
DS -3.81 0 -2.8702 0 0.1778 21
DS 2.8448 -1.27 -2.8702 -1.27 0.1778 21
DS -2.8702 -1.27 -2.8702 -1.27 0.1778 21
DS -2.8702 -1.27 -2.8702 1.27 0.1778 21
DS -2.8702 1.27 2.8448 1.27 0.1778 21
DS 2.8448 1.27 2.8448 -1.27 0.1778 21
$PAD
Sh "1" C 1.397 1.397 0 0 0
Dr 0.79756 0 0
At STD N 00E0FFFF
Ne 0 ""
Po -5.08 0
$EndPAD
$PAD
Sh "2" C 1.397 1.397 0 0 0
Dr 0.79756 0 0
At STD N 00E0FFFF
Ne 0 ""
Po 5.08 0
$EndPAD
$SHAPE3D
Na "Vlastni/Bead.wrl"
Sc 1 1 1
Of 0 0 0
Ro 0 0 0
$EndSHAPE3D
$EndMODULE Bead
$MODULE DE1207
Po 0 0 0 15 4E8B0EA0 00000000 ~~
Li DE1207
Sc 0
AR DE1207
Op 0 0 0
T0 0 -7.80034 1.524 1.524 0 0.3048 N V 21 N "L**"
T1 0 8.001 1.524 1.524 0 0.3048 N V 21 N "VAL**"
DA -5.4991 -5.4991 -5.99948 -5.4991 900 0.381 21
DA 5.4991 -5.4991 5.4991 -5.99948 900 0.381 21
DA -5.4991 5.4991 -5.4991 5.99948 900 0.381 21
DA 5.4991 5.4991 5.99948 5.4991 900 0.381 21
DA 0 0 3.74904 3.74904 900 0.381 21
DA 0 0 -3.74904 -3.74904 900 0.381 21
DS 5.99948 3.50012 5.99948 5.4991 0.381 21
DS 5.4991 5.99948 -5.4991 5.99948 0.381 21
DS -5.99948 5.4991 -5.99948 3.50012 0.381 21
DS -5.99948 -3.50012 -5.99948 -5.4991 0.381 21
DS -5.4991 -5.99948 5.4991 -5.99948 0.381 21
DS 5.99948 -5.4991 5.99948 -3.50012 0.381 21
$PAD
Sh "1" R 2.90068 5.40004 0 0 0
Dr 0 0 0
At SMD N 00888000
Ne 0 ""
Po -4.95046 0
$EndPAD
$PAD
Sh "2" R 2.90068 5.40004 0 0 0
Dr 0 0 0
At SMD N 00888000
Ne 0 ""
Po 4.95046 0
$EndPAD
$SHAPE3D
Na "Vlastni\\DE1207.wrl"
Sc 1 1 1
Of 0 0 0
Ro 0 0 0
$EndSHAPE3D
$EndMODULE DE1207
$MODULE DL50
Po 0 0 0 15 50C373E0 00000000 ~~
Li DL50
Sc 0
AR 
Op 0 0 0
T0 0 -8.636 0.8001 0.8001 0 0.14986 N V 21 N "DL50"
T1 0 8.636 0.8001 0.8001 0 0.14986 N I 21 N "Val**"
DA 0 -0.0508 6.985 2.032 1467 0.2794 21
DA 0 0.0508 -6.985 -2.032 1467 0.2794 21
DS 9.271 1.8288 9.271 2.5908 0.2794 21
DS 9.271 2.5908 4.191 7.6708 0.2794 21
DS 4.191 7.6708 -4.191 7.6708 0.2794 21
DS -4.191 7.6708 -9.271 2.5908 0.2794 21
DS -9.271 2.5908 -9.271 1.8288 0.2794 21
DS -9.271 -1.778 -9.271 -2.54 0.2794 21
DS -9.271 -2.54 -4.191 -7.62 0.2794 21
DS -4.191 -7.62 4.191 -7.62 0.2794 21
DS 4.191 -7.62 9.271 -2.54 0.2794 21
DS 9.271 -2.54 9.271 -1.778 0.2794 21
$PAD
Sh "1" R 4.9784 2.9972 0 0 0
Dr 0 0 0
At SMD N 00888000
Ne 0 ""
Po -8.255 0
$EndPAD
$PAD
Sh "2" R 4.9784 2.9972 0 0 0
Dr 0 0 0
At SMD N 00888000
Ne 0 ""
Po 8.255 0
$EndPAD
$SHAPE3D
Na "Inductor/DL50.wrl"
Sc 1 1 1
Of 0 0 0
Ro 0 0 0
$EndSHAPE3D
$EndMODULE DL50
$MODULE DPU022A3
Po 0 0 0 15 4EA5333F 00000000 ~~
Li DPU022A3
Sc 0
AR 
Op 0 0 0
T0 0 -8.128 0.8001 0.8001 0 0.14986 N V 21 N "DPU022A3"
T1 0 8.128 0.8001 0.8001 0 0.14986 N I 21 N "Val**"
DS -3.302 -6.985 3.683 -6.985 0.2286 26
DS 3.683 -6.985 3.683 6.985 0.2286 26
DS 3.683 6.985 -3.302 6.985 0.2286 26
DS -3.302 6.985 -3.302 -6.985 0.2286 26
DS -3.302 -6.985 3.683 -6.985 0.2286 21
DS 3.683 -6.985 3.683 6.985 0.2286 21
DS 3.683 6.985 -3.302 6.985 0.2286 21
DS -3.302 6.985 -3.302 -6.985 0.2286 21
$PAD
Sh "1" R 1.524 1.524 0 0 0
Dr 0.9144 0 0
At STD N 00C08001
Ne 0 ""
Po -4.572 0
$EndPAD
$PAD
Sh "2" C 1.524 1.524 0 0 0
Dr 0.9144 0 0
At STD N 00C08001
Ne 0 ""
Po 4.953 0
$EndPAD
$EndMODULE DPU022A3
$MODULE DPU033A3
Po 0 0 0 15 4EA5336D 00000000 ~~
Li DPU033A3
Sc 0
AR 
Op 0 0 0
T0 0 -10.668 0.8001 0.8001 0 0.14986 N V 21 N "DPU033A3"
T1 0 10.668 0.8001 0.8001 0 0.14986 N I 21 N "Val**"
DS -3.302 -6.985 -3.302 9.525 0.2286 26
DS -3.302 9.525 3.683 9.525 0.2286 26
DS 3.683 9.525 3.683 -9.525 0.2286 26
DS 3.683 -9.525 -3.302 -9.525 0.2286 26
DS -3.302 -9.525 -3.302 -6.985 0.2286 26
DS -3.302 -6.985 -3.302 9.525 0.2286 21
DS -3.302 9.525 3.683 9.525 0.2286 21
DS 3.683 9.525 3.683 -9.525 0.2286 21
DS 3.683 -9.525 -3.302 -9.525 0.2286 21
DS -3.302 -9.525 -3.302 -6.985 0.2286 21
$PAD
Sh "1" R 1.524 1.524 0 0 0
Dr 0.9144 0 0
At STD N 00C08001
Ne 0 ""
Po -4.572 0
$EndPAD
$PAD
Sh "2" C 1.524 1.524 0 0 0
Dr 0.9144 0 0
At STD N 00C08001
Ne 0 ""
Po 4.953 0
$EndPAD
$EndMODULE DPU033A3
$MODULE DPU047A3
Po 0 0 0 15 4EA533A0 00000000 ~~
Li DPU047A3
Sc 0
AR 
Op 0 0 0
T0 0 -11.176 0.8001 0.8001 0 0.14986 N V 21 N "DPU047A3"
T1 0 11.176 0.8001 0.8001 0 0.14986 N I 21 N "Val**"
DS -3.302 -6.985 -3.302 10.16 0.2286 26
DS -3.302 10.16 3.683 10.16 0.2286 26
DS 3.683 10.16 3.683 -10.16 0.2286 26
DS 3.683 -10.16 -3.302 -10.16 0.2286 26
DS -3.302 -10.16 -3.302 -6.985 0.2286 26
DS -3.302 -6.985 -3.302 10.16 0.2286 21
DS -3.302 10.16 3.683 10.16 0.2286 21
DS 3.683 10.16 3.683 -10.16 0.2286 21
DS 3.683 -10.16 -3.302 -10.16 0.2286 21
DS -3.302 -10.16 -3.302 -6.985 0.2286 21
$PAD
Sh "1" R 1.524 1.524 0 0 0
Dr 0.9144 0 0
At STD N 00C08001
Ne 0 ""
Po -4.572 0
$EndPAD
$PAD
Sh "2" C 1.524 1.524 0 0 0
Dr 0.9144 0 0
At STD N 00C08001
Ne 0 ""
Po 4.953 0
$EndPAD
$EndMODULE DPU047A3
$MODULE DPU068A3
Po 0 0 0 15 4EA533E9 00000000 ~~
Li DPU068A3
Sc 0
AR 
Op 0 0 0
T0 0 -14.224 0.8001 0.8001 0 0.14986 N V 21 N "DPU068A3"
T1 0 14.224 0.8001 0.8001 0 0.14986 N I 21 N "Val**"
DS 6.223 7.3152 6.223 -12.7 0.2286 26
DS 6.223 -12.7 -5.842 -12.7 0.2286 26
DS -5.842 -12.7 -5.842 12.7 0.2286 26
DS -5.842 12.7 6.223 12.7 0.2286 26
DS 6.223 12.7 6.223 7.3152 0.2286 26
DS -5.842 -6.985 -5.842 -12.7 0.2286 21
DS -5.842 -12.7 6.223 -12.7 0.2286 21
DS 6.223 -12.7 6.223 12.7 0.2286 21
DS 6.223 12.7 -5.842 12.7 0.2286 21
DS -5.842 12.7 -5.842 -6.985 0.2286 21
$PAD
Sh "1" R 1.524 1.524 0 0 0
Dr 0.9144 0 0
At STD N 00E0FFFF
Ne 0 ""
Po -7.112 0
$EndPAD
$PAD
Sh "2" C 1.524 1.524 0 0 0
Dr 0.9144 0 0
At STD N 00E0FFFF
Ne 0 ""
Po 7.493 0
$EndPAD
$EndMODULE DPU068A3
$MODULE DPU1000A1
Po 0 0 0 15 4EA53697 00000000 ~~
Li DPU1000A1
Sc 0
AR 
Op 0 0 0
T0 -0.508 -14.224 0.8001 0.8001 0 0.14986 N V 21 N "DPU1000A1"
T1 0 0 0.8001 0.8001 0 0.14986 N I 21 N "Val**"
DS 6.6548 -13.0048 6.6548 13.0302 0.2286 26
DS 6.6548 13.0302 -6.35 13.0302 0.2286 26
DS -6.35 13.0302 -6.35 -13.0048 0.2286 26
DS -6.35 -13.0048 6.6548 -13.0048 0.2286 26
DS -6.35 -6.985 -6.35 13.0302 0.2286 21
DS -6.35 13.0302 6.6548 13.0302 0.2286 21
DS 6.6548 13.0302 6.6548 -13.0048 0.2286 21
DS 6.6548 -13.0048 -6.35 -13.0048 0.2286 21
DS -6.35 -13.0048 -6.35 -6.985 0.2286 21
$PAD
Sh "1" R 1.524 1.524 0 0 0
Dr 0.9144 0 0
At STD N 00E0FFFF
Ne 0 ""
Po -7.62 0
$EndPAD
$PAD
Sh "2" C 1.524 1.524 0 0 0
Dr 0.9144 0 0
At STD N 00E0FFFF
Ne 0 ""
Po 8.255 0
$EndPAD
$EndMODULE DPU1000A1
$MODULE DPU100A1
Po 0 0 0 15 4EA53425 00000000 ~~
Li DPU100A1
Sc 0
AR 
Op 0 0 0
T0 0 -8.636 0.8001 0.8001 0 0.14986 N V 21 N "DPU100A1"
T1 0 9.144 0.8001 0.8001 0 0.14986 N I 21 N "Val**"
DS 3.937 7.62 3.937 -7.62 0.2286 26
DS 3.937 -7.62 -4.318 -7.62 0.2286 26
DS -4.318 -7.62 -4.318 7.62 0.2286 26
DS -4.318 7.62 3.937 7.62 0.2286 26
DS -4.318 -6.985 -4.318 -7.62 0.2286 21
DS -4.318 -7.62 3.937 -7.62 0.2286 21
DS 3.937 -7.62 3.937 7.62 0.2286 21
DS 3.937 7.62 -4.318 7.62 0.2286 21
DS -4.318 7.62 -4.318 -6.985 0.2286 21
$PAD
Sh "1" R 1.524 1.524 0 0 0
Dr 0.9144 0 0
At STD N 00E0FFFF
Ne 0 ""
Po -5.588 0
$EndPAD
$PAD
Sh "2" C 1.524 1.524 0 0 0
Dr 0.9144 0 0
At STD N 00E0FFFF
Ne 0 ""
Po 5.207 0
$EndPAD
$EndMODULE DPU100A1
$MODULE DPU140A4
Po 0 0 0 15 4EA53484 00000000 ~~
Li DPU140A4
Sc 0
AR 
Op 0 0 0
T0 0 -16.256 0.8001 0.8001 0 0.14986 N V 21 N "DPU140A4"
T1 0 16.764 0.8001 0.8001 0 0.14986 N I 21 N "Val**"
DS 5.715 7.3152 5.715 15.24 0.2286 26
DS 5.715 15.24 -6.35 15.24 0.2286 26
DS -6.35 15.24 -6.35 -15.24 0.2286 26
DS -6.35 -15.24 5.715 -15.24 0.2286 26
DS 5.715 -15.24 5.715 7.3152 0.2286 26
DS -6.35 -6.985 -6.35 15.24 0.2286 21
DS -6.35 15.24 5.715 15.24 0.2286 21
DS 5.715 15.24 5.715 -15.24 0.2286 21
DS 5.715 -15.24 -6.35 -15.24 0.2286 21
DS -6.35 -15.24 -6.35 -6.985 0.2286 21
$PAD
Sh "1" R 2.3368 2.3368 0 0 0
Dr 1.778 0 0
At STD N 00E0FFFF
Ne 0 ""
Po -7.62 0
$EndPAD
$PAD
Sh "2" C 2.3368 2.3368 0 0 0
Dr 1.778 0 0
At STD N 00E0FFFF
Ne 0 ""
Po 7.62 0
$EndPAD
$EndMODULE DPU140A4
$MODULE DPU150A0.5
Po 0 0 0 15 4EA534B5 00000000 ~~
Li DPU150A0.5
Sc 0
AR 
Op 0 0 0
T0 0 -8.636 0.8001 0.8001 0 0.14986 N V 21 N "DPU150A0.5"
T1 0 8.636 0.8001 0.8001 0 0.14986 N I 21 N "Val**"
DS 3.683 -7.62 3.683 7.62 0.2286 26
DS 3.683 7.62 -3.302 7.62 0.2286 26
DS -3.302 7.62 -3.302 -7.62 0.2286 26
DS -3.302 -7.62 3.683 -7.62 0.2286 26
DS -3.302 -6.985 -3.302 -7.62 0.2286 21
DS -3.302 -7.62 3.683 -7.62 0.2286 21
DS 3.683 -7.62 3.683 7.62 0.2286 21
DS 3.683 7.62 -3.302 7.62 0.2286 21
DS -3.302 7.62 -3.302 -6.985 0.2286 21
$PAD
Sh "1" R 1.524 1.524 0 0 0
Dr 0.9144 0 0
At STD N 00E0FFFF
Ne 0 ""
Po -4.572 0
$EndPAD
$PAD
Sh "2" C 1.524 1.524 0 0 0
Dr 0.9144 0 0
At STD N 00E0FFFF
Ne 0 ""
Po 4.953 0
$EndPAD
$EndMODULE DPU150A0.5
$MODULE DPU150A5
Po 0 0 0 15 4EA53512 00000000 ~~
Li DPU150A5
Sc 0
AR 
Op 0 0 0
T0 0 -21.844 0.8001 0.8001 0 0.14986 N V 21 N "DPU150A5"
T1 0 0 0.8001 0.8001 0 0.14986 N I 21 N "Val**"
DS 6.6548 -13.6398 6.6548 -20.6248 0.2286 26
DS 6.6548 -20.6248 -6.35 -20.6248 0.2286 26
DS -6.35 -20.6248 -6.35 20.6502 0.2286 26
DS -6.35 20.6502 6.6548 20.6502 0.2286 26
DS 6.6548 20.6502 6.6548 -13.6398 0.2286 26
DS -6.35 -6.985 -6.35 20.6502 0.2286 21
DS -6.35 20.6502 6.6548 20.6502 0.2286 21
DS 6.6548 20.6502 6.6548 -20.6248 0.2286 21
DS 6.6548 -20.6248 -6.35 -20.6248 0.2286 21
DS -6.35 -20.6248 -6.35 -6.985 0.2286 21
$PAD
Sh "1" R 2.8448 2.8448 0 0 0
Dr 2.286 0 0
At STD N 00E0FFFF
Ne 0 ""
Po -7.62 0
$EndPAD
$PAD
Sh "2" C 2.8448 2.8448 0 0 0
Dr 2.286 0 0
At STD N 00E0FFFF
Ne 0 ""
Po 8.255 0
$EndPAD
$EndMODULE DPU150A5
$MODULE DPU220A3
Po 0 0 0 15 4EA5354D 00000000 ~~
Li DPU220A3
Sc 0
AR 
Op 0 0 0
T0 0 -15.748 0.8001 0.8001 0 0.14986 N V 21 N "DPU220A3"
T1 0 0 0.8001 0.8001 0 0.14986 N I 21 N "Val**"
DS 6.6548 -13.6398 6.6548 -14.605 0.2286 26
DS 6.6548 -14.605 -6.35 -14.605 0.2286 26
DS -6.35 -14.605 -6.35 14.605 0.2286 26
DS -6.35 14.605 6.6548 14.605 0.2286 26
DS 6.6548 14.605 6.6548 -13.6398 0.2286 26
DS -6.35 -6.985 -6.35 14.605 0.2286 21
DS -6.35 14.605 6.6548 14.605 0.2286 21
DS 6.6548 14.605 6.6548 -14.605 0.2286 21
DS 6.6548 -14.605 -6.35 -14.605 0.2286 21
DS -6.35 -14.605 -6.35 -6.985 0.2286 21
$PAD
Sh "1" R 1.524 1.524 0 0 0
Dr 0.9144 0 0
At STD N 00E0FFFF
Ne 0 ""
Po -7.62 0
$EndPAD
$PAD
Sh "2" C 1.524 1.524 0 0 0
Dr 0.9144 0 0
At STD N 00E0FFFF
Ne 0 ""
Po 8.255 0
$EndPAD
$EndMODULE DPU220A3
$MODULE DPU330A1
Po 0 0 0 15 4EA53596 00000000 ~~
Li DPU330A1
Sc 0
AR 
Op 0 0 0
T0 0 -11.176 0.8001 0.8001 0 0.14986 N V 21 N "DPU330A1"
T1 0.508 0 0.8001 0.8001 0 0.14986 N I 21 N "Val**"
DS 3.937 7.62 3.937 -10.16 0.2286 26
DS 3.937 -10.16 -4.318 -10.16 0.2286 26
DS -4.318 -10.16 -4.318 10.16 0.2286 26
DS -4.318 10.16 3.937 10.16 0.2286 26
DS 3.937 10.16 3.937 7.62 0.2286 26
DS -4.318 -6.985 -4.318 10.16 0.2286 21
DS -4.318 10.16 3.937 10.16 0.2286 21
DS 3.937 10.16 3.937 -10.16 0.2286 21
DS 3.937 -10.16 -4.318 -10.16 0.2286 21
DS -4.318 -10.16 -4.318 -6.985 0.2286 21
$PAD
Sh "1" R 1.524 1.524 0 0 0
Dr 0.9144 0 0
At STD N 00E0FFFF
Ne 0 ""
Po -5.588 0
$EndPAD
$PAD
Sh "2" C 1.524 1.524 0 0 0
Dr 0.9144 0 0
At STD N 00E0FFFF
Ne 0 ""
Po 5.207 0
$EndPAD
$EndMODULE DPU330A1
$MODULE DPU330A3
Po 0 0 0 15 4EA535C8 00000000 ~~
Li DPU330A3
Sc 0
AR 
Op 0 0 0
T0 0 -16.256 0.8001 0.8001 0 0.14986 N V 21 N "DPU330A3"
T1 0 0 0.8001 0.8001 0 0.14986 N I 21 N "Val**"
DS 6.9088 -13.6398 6.9088 -15.24 0.2286 26
DS 6.9088 -15.24 -7.366 -15.24 0.2286 26
DS -7.366 -15.24 -7.366 15.24 0.2286 26
DS -7.366 15.24 6.9088 15.24 0.2286 26
DS 6.9088 15.24 6.9088 -13.6398 0.2286 26
DS -7.366 -6.985 -7.366 -15.24 0.2286 21
DS -7.366 -15.24 6.9088 -15.24 0.2286 21
DS 6.9088 -15.24 6.9088 15.24 0.2286 21
DS 6.9088 15.24 -7.366 15.24 0.2286 21
DS -7.366 15.24 -7.366 -6.985 0.2286 21
$PAD
Sh "1" R 1.524 1.524 0 0 0
Dr 0.9144 0 0
At STD N 00E0FFFF
Ne 0 ""
Po -8.636 0
$EndPAD
$PAD
Sh "2" C 1.524 1.524 0 0 0
Dr 0.9144 0 0
At STD N 00E0FFFF
Ne 0 ""
Po 8.509 0
$EndPAD
$EndMODULE DPU330A3
$MODULE DPU470A1
Po 0 0 0 15 4EA53600 00000000 ~~
Li DPU470A1
Sc 0
AR 
Op 0 0 0
T0 0 -14.732 0.8001 0.8001 0 0.14986 N V 21 N "DPU470A1"
T1 0 0 0.8001 0.8001 0 0.14986 N I 21 N "Val**"
DS 6.223 7.3152 6.223 -13.6398 0.2286 26
DS 6.223 -13.6398 -5.842 -13.6398 0.2286 26
DS -5.842 -13.6398 -5.842 13.6652 0.2286 26
DS -5.842 13.6652 6.223 13.6652 0.2286 26
DS 6.223 13.6652 6.223 7.3152 0.2286 26
DS -5.842 -6.985 -5.842 -13.6398 0.2286 21
DS -5.842 -13.6398 6.223 -13.6398 0.2286 21
DS 6.223 -13.6398 6.223 13.6652 0.2286 21
DS 6.223 13.6652 -5.842 13.6652 0.2286 21
DS -5.842 13.6652 -5.842 -6.985 0.2286 21
$PAD
Sh "1" R 1.524 1.524 0 0 0
Dr 0.9144 0 0
At STD N 00E0FFFF
Ne 0 ""
Po -7.112 0
$EndPAD
$PAD
Sh "2" C 1.524 1.524 0 0 0
Dr 0.9144 0 0
At STD N 00E0FFFF
Ne 0 ""
Po 7.493 0
$EndPAD
$EndMODULE DPU470A1
$MODULE DPU470A3
Po 0 0 0 15 4EA53631 00000000 ~~
Li DPU470A3
Sc 0
AR 
Op 0 0 0
T0 0 -22.352 0.8001 0.8001 0 0.14986 N V 21 N "DPU470A3"
T1 0 0 0.8001 0.8001 0 0.14986 N I 21 N "Val**"
DS 7.7978 -21.2598 -8.382 -21.2598 0.2286 26
DS -8.382 -21.2598 -8.382 21.2852 0.2286 26
DS -8.382 21.2852 7.7978 21.2852 0.2286 26
DS 7.7978 21.2852 7.7978 -21.2598 0.2286 26
DS -8.382 -6.985 -8.382 -21.2598 0.2286 21
DS -8.382 -21.2598 7.7978 -21.2598 0.2286 21
DS 7.7978 -21.2598 7.7978 21.2852 0.2286 21
DS 7.7978 21.2852 -8.382 21.2852 0.2286 21
DS -8.382 21.2852 -8.382 -6.985 0.2286 21
$PAD
Sh "1" R 1.524 1.524 0 0 0
Dr 0.9144 0 0
At STD N 00E0FFFF
Ne 0 ""
Po -9.652 0
$EndPAD
$PAD
Sh "2" C 1.524 1.524 0 0 0
Dr 0.9144 0 0
At STD N 00E0FFFF
Ne 0 ""
Po 9.398 0
$EndPAD
$EndMODULE DPU470A3
$MODULE DPU680A1
Po 0 0 0 15 4EA53665 00000000 ~~
Li DPU680A1
Sc 0
AR 
Op 0 0 0
T0 0 -14.732 0.8001 0.8001 0 0.14986 N V 21 N "DPU680A1"
T1 0 0 0.8001 0.8001 0 0.14986 N I 21 N "Val**"
DS 6.6548 -13.6398 6.6548 13.6652 0.2286 26
DS 6.6548 13.6652 -6.35 13.6652 0.2286 26
DS -6.35 13.6652 -6.35 -13.6398 0.2286 26
DS -6.35 -13.6398 6.6548 -13.6398 0.2286 26
DS -6.35 -6.985 -6.35 -13.6398 0.2286 21
DS -6.35 -13.6398 6.6548 -13.6398 0.2286 21
DS 6.6548 -13.6398 6.6548 13.6652 0.2286 21
DS 6.6548 13.6652 -6.35 13.6652 0.2286 21
DS -6.35 13.6652 -6.35 -6.985 0.2286 21
$PAD
Sh "1" R 1.524 1.524 0 0 0
Dr 0.9144 0 0
At STD N 00E0FFFF
Ne 0 ""
Po -7.62 0
$EndPAD
$PAD
Sh "2" C 1.524 1.524 0 0 0
Dr 0.9144 0 0
At STD N 00E0FFFF
Ne 0 ""
Po 8.255 0
$EndPAD
$EndMODULE DPU680A1
$MODULE FASTRON-AX
Po 0 0 0 15 4EA536CA 00000000 ~~
Li FASTRON-AX
Sc 0
AR 
Op 0 0 0
T0 0 -4.064 0.8001 0.8001 0 0.14986 N V 21 N "FASTRON-AX"
T1 0 3.556 0.8001 0.8001 0 0.14986 N I 21 N "Val**"
DS -1.905 2.159 -1.905 -2.159 0.0508 26
DA -3.7084 1.1684 -3.81 2.8702 831 0.254 21
DA -6.6548 1.2192 -6.35 0 783 0.254 21
DA -7.0358 -1.4986 -5.4102 -1.27 574 0.254 21
DA -3.6576 -1.0922 -5.4102 -1.27 792 0.254 21
DS -3.81 -2.8448 -2.54 -2.8448 0.254 21
DA -2.5146 -2.4384 -2.54 -2.8448 608 0.254 21
DS -2.159 -2.667 -1.905 -2.2098 0.254 21
DS -1.905 -2.2098 1.905 -2.2098 0.254 21
DA 0.254 -3.4544 2.159 -2.667 145 0.254 21
DA 2.4892 -2.4384 2.159 -2.667 624 0.254 21
DS 2.54 -2.8448 3.81 -2.8448 0.254 21
DA 3.6322 -1.0922 3.81 -2.8448 784 0.254 21
DA 6.5532 -1.143 6.35 0 861 0.254 21
DA 7.0104 1.524 5.3848 1.27 576 0.254 21
DA 3.6322 1.1176 5.3848 1.27 792 0.254 21
DS 3.81 2.8702 2.54 2.8702 0.254 21
DA 2.4892 2.4638 2.54 2.8702 655 0.254 21
DA 0.254 3.4798 1.905 2.2352 139 0.254 21
DS 1.905 2.2352 -1.905 2.2352 0.254 21
DS -1.905 2.2352 -2.159 2.667 0.254 21
DA -2.5146 2.4638 -2.159 2.667 638 0.254 21
DS -2.54 2.8702 -3.81 2.8702 0.254 21
DA -3.7084 1.1684 -3.81 2.8702 831 0.254 26
DA -6.6548 1.2192 -6.35 0 783 0.254 26
DA -7.0358 -1.4986 -5.4102 -1.27 574 0.254 26
DA -3.6576 -1.0922 -5.4102 -1.27 792 0.254 26
DS -3.81 -2.8448 -2.54 -2.8448 0.254 26
DA -2.5146 -2.4384 -2.54 -2.8448 608 0.254 26
DS -2.159 -2.667 -1.905 -2.2098 0.254 26
DS -1.905 -2.2098 1.905 -2.2098 0.254 26
DA 0.254 -3.4544 2.159 -2.667 145 0.254 26
DA 2.4892 -2.4384 2.159 -2.667 624 0.254 26
DS 2.54 -2.8448 3.81 -2.8448 0.254 26
DA 3.6322 -1.0922 3.81 -2.8448 784 0.254 26
DA 6.5532 -1.143 6.35 0 861 0.254 26
DA 7.0104 1.524 5.3848 1.27 576 0.254 26
DA 3.6322 1.1176 5.3848 1.27 792 0.254 26
DS 3.81 2.8702 2.54 2.8702 0.254 26
DA 2.4892 2.4638 2.54 2.8702 655 0.254 26
DA 0.254 3.4798 1.905 2.2352 139 0.254 26
DS 1.905 2.2352 -1.905 2.2352 0.254 26
DS -1.905 2.2352 -2.159 2.667 0.254 26
DA -2.5146 2.4638 -2.159 2.667 638 0.254 26
DS -2.54 2.8702 -3.81 2.8702 0.254 26
DS 1.905 -2.159 1.905 2.159 0.0508 21
DS -1.905 2.159 -1.905 -2.159 0.0508 21
DS 1.905 -2.159 1.905 2.159 0.0508 26
$PAD
Sh "1" R 1.524 1.524 0 0 0
Dr 0.9144 0 0
At STD N 00E0FFFF
Ne 0 ""
Po -7.62 0
$EndPAD
$PAD
Sh "2" C 1.524 1.524 0 0 0
Dr 0.9144 0 0
At STD N 00E0FFFF
Ne 0 ""
Po 7.62 0
$EndPAD
$EndMODULE FASTRON-AX
$MODULE FASTRON-RAD
Po 0 0 0 15 4EB15653 00000000 ~~
Li FASTRON-RAD
Sc 0
AR FASTRON-RAD
Op 0 0 0
T0 0 -5.588 0.8001 0.8001 0 0.14986 N V 21 N "FASTRON-RAD"
T1 0 3.556 0.8001 0.8001 0 0.14986 N I 21 N "Val**"
DA -0.0508 -0.0762 2.4384 1.27 1231 0.2286 26
DA -0.0508 0.1016 -2.54 -1.2446 1231 0.2286 26
DC -0.0508 0 4.699 0 0.2286 26
DC -0.0508 0 4.699 0 0.2286 21
$PAD
Sh "1" R 1.524 1.524 0 0 0
Dr 0.9144 0 0
At STD N 00E0FFFF
Ne 0 ""
Po -2.54 0
$EndPAD
$PAD
Sh "2" C 1.524 1.524 0 0 0
Dr 0.9144 0 0
At STD N 00E0FFFF
Ne 0 ""
Po 2.54 0
$EndPAD
$SHAPE3D
Na "Vlastni\\09P.wrl"
Sc 1 1 1
Of 0 0 0
Ro 0 0 0
$EndSHAPE3D
$EndMODULE FASTRON-RAD
$MODULE FASTRONAX-1000
Po 0 0 0 15 4EA53731 00000000 ~~
Li FASTRONAX-1000
Sc 0
AR 
Op 0 0 0
T0 0 -4.064 0.8001 0.8001 0 0.14986 N V 21 N "FASTRON-AX-1000"
T1 0 3.556 0.8001 0.8001 0 0.14986 N I 21 N "Val**"
DS 11.0998 0 6.35 0 0.254 26
DS -11.1252 0 -6.35 0 0.254 26
DS 11.0998 0 6.35 0 0.254 21
DS -11.1252 0 -6.35 0 0.254 21
DS -1.905 2.159 -1.905 -2.159 0.0508 26
DA -3.7084 1.1684 -3.81 2.8702 831 0.254 26
DA -6.6548 1.2192 -6.35 0 783 0.254 26
DA -7.0358 -1.4986 -5.4102 -1.27 574 0.254 26
DA -3.6576 -1.0922 -5.4102 -1.27 792 0.254 26
DS -3.81 -2.8448 -2.54 -2.8448 0.254 26
DA -2.5146 -2.4384 -2.54 -2.8448 608 0.254 26
DS -2.159 -2.667 -1.905 -2.2098 0.254 26
DS -1.905 -2.2098 1.905 -2.2098 0.254 26
DA 0.254 -3.4544 2.159 -2.667 145 0.254 26
DA 2.4892 -2.4384 2.159 -2.667 624 0.254 26
DS 2.54 -2.8448 3.81 -2.8448 0.254 26
DA 3.6322 -1.0922 3.81 -2.8448 784 0.254 26
DA 6.5532 -1.143 6.35 0 861 0.254 26
DA 7.0104 1.524 5.3848 1.27 576 0.254 26
DA 3.6322 1.1176 5.3848 1.27 792 0.254 26
DS 3.81 2.8702 2.54 2.8702 0.254 26
DA 2.4892 2.4638 2.54 2.8702 655 0.254 26
DA 0.254 3.4798 1.905 2.2352 139 0.254 26
DS 1.905 2.2352 -1.905 2.2352 0.254 26
DS -1.905 2.2352 -2.159 2.667 0.254 26
DA -2.5146 2.4638 -2.159 2.667 638 0.254 26
DS -2.54 2.8702 -3.81 2.8702 0.254 26
DS 1.905 -2.159 1.905 2.159 0.0508 21
DS -1.905 2.159 -1.905 -2.159 0.0508 21
DS 1.905 -2.159 1.905 2.159 0.0508 26
DA -3.7084 1.1684 -3.81 2.8702 831 0.254 21
DA -6.6548 1.2192 -6.35 0 783 0.254 21
DA -7.0358 -1.4986 -5.4102 -1.27 574 0.254 21
DA -3.6576 -1.0922 -5.4102 -1.27 792 0.254 21
DS -3.81 -2.8448 -2.54 -2.8448 0.254 21
DA -2.5146 -2.4384 -2.54 -2.8448 608 0.254 21
DS -2.159 -2.667 -1.905 -2.2098 0.254 21
DS -1.905 -2.2098 1.905 -2.2098 0.254 21
DA 0.254 -3.4544 2.159 -2.667 145 0.254 21
DA 2.4892 -2.4384 2.159 -2.667 624 0.254 21
DS 2.54 -2.8448 3.81 -2.8448 0.254 21
DA 3.6322 -1.0922 3.81 -2.8448 784 0.254 21
DA 6.5532 -1.143 6.35 0 861 0.254 21
DA 7.0104 1.524 5.3848 1.27 576 0.254 21
DA 3.6322 1.1176 5.3848 1.27 792 0.254 21
DS 3.81 2.8702 2.54 2.8702 0.254 21
DA 2.4892 2.4638 2.54 2.8702 655 0.254 21
DA 0.254 3.4798 1.905 2.2352 139 0.254 21
DS 1.905 2.2352 -1.905 2.2352 0.254 21
DS -1.905 2.2352 -2.159 2.667 0.254 21
DA -2.5146 2.4638 -2.159 2.667 638 0.254 21
DS -2.54 2.8702 -3.81 2.8702 0.254 21
$PAD
Sh "1" R 1.524 1.524 0 0 0
Dr 0.9144 0 0
At STD N 00E0FFFF
Ne 0 ""
Po -12.7 0
$EndPAD
$PAD
Sh "2" C 1.524 1.524 0 0 0
Dr 0.9144 0 0
At STD N 00E0FFFF
Ne 0 ""
Po 12.7 0
$EndPAD
$EndMODULE FASTRONAX-1000
$MODULE FASTRONAX-800
Po 0 0 0 15 4EA536F7 00000000 ~~
Li FASTRONAX-800
Sc 0
AR 
Op 0 0 0
T0 0 -4.064 0.8001 0.8001 0 0.14986 N V 21 N "FASTRON-AX-800"
T1 0 3.556 0.8001 0.8001 0 0.14986 N I 21 N "Val**"
DA -3.7084 1.1684 -3.81 2.8702 831 0.254 26
DA -6.6548 1.2192 -6.35 0 783 0.254 26
DA -7.0358 -1.4986 -5.4102 -1.27 574 0.254 26
DA -3.6576 -1.0922 -5.4102 -1.27 792 0.254 26
DS -3.81 -2.8448 -2.54 -2.8448 0.254 26
DA -2.5146 -2.4384 -2.54 -2.8448 608 0.254 26
DS -2.159 -2.667 -1.905 -2.2098 0.254 26
DS -1.905 -2.2098 1.905 -2.2098 0.254 26
DA 0.254 -3.4544 2.159 -2.667 145 0.254 26
DA 2.4892 -2.4384 2.159 -2.667 624 0.254 26
DS 2.54 -2.8448 3.81 -2.8448 0.254 26
DA 3.6322 -1.0922 3.81 -2.8448 784 0.254 26
DA 6.5532 -1.143 6.35 0 861 0.254 26
DA 7.0104 1.524 5.3848 1.27 576 0.254 26
DA 3.6322 1.1176 5.3848 1.27 792 0.254 26
DS 3.81 2.8702 2.54 2.8702 0.254 26
DA 2.4892 2.4638 2.54 2.8702 655 0.254 26
DA 0.254 3.4798 1.905 2.2352 139 0.254 26
DS 1.905 2.2352 -1.905 2.2352 0.254 26
DS -1.905 2.2352 -2.159 2.667 0.254 26
DA -2.5146 2.4638 -2.159 2.667 638 0.254 26
DS -2.54 2.8702 -3.81 2.8702 0.254 26
DS 1.905 -2.159 1.905 2.159 0.0508 21
DS -1.905 2.159 -1.905 -2.159 0.0508 21
DS 1.905 -2.159 1.905 2.159 0.0508 26
DA -3.7084 1.1684 -3.81 2.8702 831 0.254 21
DA -6.6548 1.2192 -6.35 0 783 0.254 21
DA -7.0358 -1.4986 -5.4102 -1.27 574 0.254 21
DA -3.6576 -1.0922 -5.4102 -1.27 792 0.254 21
DS -3.81 -2.8448 -2.54 -2.8448 0.254 21
DA -2.5146 -2.4384 -2.54 -2.8448 608 0.254 21
DS -2.159 -2.667 -1.905 -2.2098 0.254 21
DS -1.905 -2.2098 1.905 -2.2098 0.254 21
DA 0.254 -3.4544 2.159 -2.667 145 0.254 21
DA 2.4892 -2.4384 2.159 -2.667 624 0.254 21
DS 2.54 -2.8448 3.81 -2.8448 0.254 21
DA 3.6322 -1.0922 3.81 -2.8448 784 0.254 21
DA 6.5532 -1.143 6.35 0 861 0.254 21
DA 7.0104 1.524 5.3848 1.27 576 0.254 21
DA 3.6322 1.1176 5.3848 1.27 792 0.254 21
DS 3.81 2.8702 2.54 2.8702 0.254 21
DA 2.4892 2.4638 2.54 2.8702 655 0.254 21
DA 0.254 3.4798 1.905 2.2352 139 0.254 21
DS 1.905 2.2352 -1.905 2.2352 0.254 21
DS -1.905 2.2352 -2.159 2.667 0.254 21
DA -2.5146 2.4638 -2.159 2.667 638 0.254 21
DS -2.54 2.8702 -3.81 2.8702 0.254 21
DS 6.35 0 8.89 0 0.254 26
DS -8.89 0 -6.35 0 0.254 26
DS 6.35 0 8.89 0 0.254 21
DS -8.89 0 -6.35 0 0.254 21
DS -1.905 2.159 -1.905 -2.159 0.0508 26
$PAD
Sh "1" R 1.524 1.524 0 0 0
Dr 0.9144 0 0
At STD N 00E0FFFF
Ne 0 ""
Po -10.16 0
$EndPAD
$PAD
Sh "2" C 1.524 1.524 0 0 0
Dr 0.9144 0 0
At STD N 00E0FFFF
Ne 0 ""
Po 10.16 0
$EndPAD
$EndMODULE FASTRONAX-800
$MODULE FASTRONAX-M
Po 0 0 0 15 4EA5377C 00000000 ~~
Li FASTRONAX-M
Sc 0
AR 
Op 0 0 0
T0 0 -2.54 0.8001 0.8001 0 0.14986 N V 21 N "FASTRON-AX-M"
T1 0 2.54 0.8001 0.8001 0 0.14986 N I 21 N "Val**"
DS -3.81 0 -5.08 0 0.254 21
DS -2.8702 1.6002 -2.2352 1.6002 0.254 21
DS -2.2352 1.6002 -1.905 1.27 0.254 21
DS -1.905 1.27 1.905 1.27 0.254 21
DS 1.905 1.27 2.2098 1.6002 0.254 21
DS 2.2098 1.6002 2.8448 1.6002 0.254 21
DA 2.8194 0.9398 3.4798 0.9652 855 0.254 21
DA 4.572 0.7874 3.4798 0.9652 551 0.254 21
DA 4.572 -0.762 3.81 0 542 0.254 21
DA 2.8194 -0.9144 2.8448 -1.5748 855 0.254 21
DS 2.8448 -1.5748 2.2098 -1.5748 0.254 21
DS 2.2098 -1.5748 1.905 -1.27 0.254 21
DS 1.905 -1.27 -1.905 -1.27 0.254 21
DS -1.905 -1.27 -2.2352 -1.5748 0.254 21
DS -2.2352 -1.5748 -2.8702 -1.5748 0.254 21
DA -2.8448 -0.9144 -3.5052 -0.9398 855 0.254 21
DA -4.4196 -0.7112 -3.5052 -0.9398 634 0.254 21
DA -5.08 0.9652 -3.81 0 372 0.254 21
DA -2.8448 0.9398 -2.8702 1.6002 855 0.254 21
DS 1.905 -1.27 1.905 1.27 0.0508 21
DS -1.905 -1.27 -1.905 1.27 0.0508 21
DS 3.81 0 5.08 0 0.254 21
DS -3.81 0 -5.08 0 0.254 26
DS -2.8702 1.6002 -2.2352 1.6002 0.254 26
DS -2.2352 1.6002 -1.905 1.27 0.254 26
DS -1.905 1.27 1.905 1.27 0.254 26
DS 1.905 1.27 2.2098 1.6002 0.254 26
DS 2.2098 1.6002 2.8448 1.6002 0.254 26
DA 2.8194 0.9398 3.4798 0.9652 855 0.254 26
DA 4.572 0.7874 3.4798 0.9652 551 0.254 26
DA 4.572 -0.762 3.81 0 542 0.254 26
DA 2.8194 -0.9144 2.8448 -1.5748 855 0.254 26
DS 2.8448 -1.5748 2.2098 -1.5748 0.254 26
DS 2.2098 -1.5748 1.905 -1.27 0.254 26
DS 1.905 -1.27 -1.905 -1.27 0.254 26
DS -1.905 -1.27 -2.2352 -1.5748 0.254 26
DS -2.2352 -1.5748 -2.8702 -1.5748 0.254 26
DA -2.8448 -0.9144 -3.5052 -0.9398 855 0.254 26
DA -4.4196 -0.7112 -3.5052 -0.9398 634 0.254 26
DA -5.08 0.9652 -3.81 0 372 0.254 26
DA -2.8448 0.9398 -2.8702 1.6002 855 0.254 26
DS 1.905 -1.27 1.905 1.27 0.0508 26
DS -1.905 -1.27 -1.905 1.27 0.0508 26
DS 3.81 0 5.08 0 0.254 26
$PAD
Sh "1" R 1.524 1.524 0 0 0
Dr 0.9144 0 0
At STD N 00E0FFFF
Ne 0 ""
Po -6.35 0
$EndPAD
$PAD
Sh "2" C 1.524 1.524 0 0 0
Dr 0.9144 0 0
At STD N 00E0FFFF
Ne 0 ""
Po 6.35 0
$EndPAD
$EndMODULE FASTRONAX-M
$MODULE FASTRONRAD-L
Po 0 0 0 15 4EA537E5 00000000 ~~
Li FASTRONRAD-L
Sc 0
AR 
Op 0 0 0
T0 0 -19.304 0.8001 0.8001 0 0.14986 N V 21 N "FASTRON-RAD-L"
T1 0 -16.764 0.8001 0.8001 0 0.14986 N I 21 N "Val**"
DS 2.54 -1.4732 2.54 -3.9878 0.4826 26
DS -2.54 -1.4732 -2.54 -3.9878 0.4826 26
DS -4.5466 -18.161 4.7498 -18.161 0.2794 26
DS 4.7498 -18.161 4.7498 -16.383 0.2794 26
DA 14.7828 -12.0142 4.7498 -7.6708 469 0.2794 26
DS 4.7498 -7.6708 4.7498 -5.8928 0.2794 26
DA 5.5118 -3.7084 3.2512 -4.0894 612 0.2794 26
DS 3.2512 -4.0894 -3.1496 -4.0894 0.2794 26
DA -5.4356 -3.4036 -4.7498 -5.6896 566 0.2794 26
DS -4.7498 -5.6896 -4.7498 -7.5692 0.2794 26
DA -12.954 -11.9634 -4.7498 -16.383 564 0.2794 26
DS -4.7498 -16.383 -4.7498 -18.161 0.2794 26
DS -4.7498 -18.161 -4.5466 -18.161 0.2794 26
DS 2.54 -1.4732 2.54 -3.9878 0.4826 21
DS -2.54 -1.4732 -2.54 -3.9878 0.4826 21
DS -4.5466 -18.161 4.7498 -18.161 0.2794 21
DS 4.7498 -18.161 4.7498 -16.383 0.2794 21
DA 14.7828 -12.0142 4.7498 -7.6708 469 0.2794 21
DS 4.7498 -7.6708 4.7498 -5.8928 0.2794 21
DA 5.5118 -3.7084 3.2512 -4.0894 612 0.2794 21
DS 3.2512 -4.0894 -3.1496 -4.0894 0.2794 21
DA -5.4356 -3.4036 -4.7498 -5.6896 566 0.2794 21
DS -4.7498 -5.6896 -4.7498 -7.5692 0.2794 21
DA -12.954 -11.9634 -4.7498 -16.383 564 0.2794 21
DS -4.7498 -16.383 -4.7498 -18.161 0.2794 21
DS -4.7498 -18.161 -4.5466 -18.161 0.2794 21
$PAD
Sh "1" R 1.524 1.524 0 0 0
Dr 0.9144 0 0
At STD N 00E0FFFF
Ne 0 ""
Po -2.54 0
$EndPAD
$PAD
Sh "2" C 1.524 1.524 0 0 0
Dr 0.9144 0 0
At STD N 00E0FFFF
Ne 0 ""
Po 2.54 0
$EndPAD
$SHAPE3D
Na "Vlastni\\09P-L.wrl"
Sc 1 1 1
Of 0 0 0
Ro 0 0 0
$EndSHAPE3D
$EndMODULE FASTRONRAD-L
$MODULE SC105F
Po 0 0 0 15 50C3745D 00000000 ~~
Li SC105F
Sc 0
AR 
Op 0 0 0
T0 0 -7.112 0.8001 0.8001 0 0.14986 N V 21 N "SC105F"
T1 0.508 0 0.8001 0.8001 0 0.14986 N I 21 N "Val**"
DS -5.6134 -2.8956 -5.6134 2.8194 0.2794 21
DA 0 -0.0508 5.588 2.8448 1253 0.2794 21
DA 0 0.0254 -5.6134 -2.8956 1249 0.2794 21
DS 5.588 -2.8956 5.588 2.8194 0.2794 21
$PAD
Sh "1" R 4.1656 2.9972 0 0 0
Dr 0 0 0
At SMD N 00888000
Ne 0 ""
Po 6.985 0
$EndPAD
$PAD
Sh "2" R 4.1656 2.9972 0 0 0
Dr 0 0 0
At SMD N 00888000
Ne 0 ""
Po -7.0104 0
$EndPAD
$SHAPE3D
Na "Inductor/SC105F.wrl"
Sc 1 1 1
Of 0 0 0
Ro 0 0 0
$EndSHAPE3D
$EndMODULE SC105F
$MODULE SC75F
Po 0 0 0 15 50C3741F 00000000 ~~
Li SC75F
Sc 0
AR 
Op 0 0 0
T0 0 -5.588 0.8001 0.8001 0 0.14986 N V 21 N "SC75F"
T1 0 0 0.8001 0.8001 0 0.14986 N I 21 N "Val**"
DS 4.2926 -2.5908 4.2926 2.5146 0.2794 21
DS -4.318 2.6162 -4.318 -2.5908 0.2794 21
DA 0 -0.0762 4.2926 2.5908 1164 0.2794 21
DA 0 0.0762 -4.318 -2.5908 1164 0.2794 21
$PAD
Sh "1" R 4.1656 2.9972 0 0 0
Dr 0 0 0
At SMD N 04888000
Ne 0 ""
Po 5.6896 0
$EndPAD
$PAD
Sh "2" R 4.1656 2.9972 0 0 0
Dr 0 0 0
At SMD N 04888000
Ne 0 ""
Po -5.715 0
$EndPAD
$SHAPE3D
Na "Inductor/SC75F.wrl"
Sc 1 1 1
Of 0 0 0
Ro 0 0 0
$EndSHAPE3D
$EndMODULE SC75F
$MODULE SFT1030
Po 0 0 0 15 4EA53897 00000000 ~~
Li SFT1030
Sc 0
AR 
Op 0 0 0
T0 0 -12.7 0.8001 0.8001 0 0.14986 N V 21 N "SFT1030"
T1 0 12.7 0.8001 0.8001 0 0.14986 N I 21 N "Val**"
DS -6.35 -11.43 6.35 -11.43 0.127 26
DS 6.35 -11.43 6.35 11.43 0.127 26
DS 6.35 11.43 -6.35 11.43 0.127 26
DS -6.35 11.43 -6.35 -11.43 0.127 26
DS -6.35 -1.27 -6.35 -11.43 0.127 21
DS -6.35 -11.43 6.35 -11.43 0.127 21
DS 6.35 -11.43 6.35 11.43 0.127 21
DS 6.35 11.43 -6.35 11.43 0.127 21
DS -6.35 11.43 -6.35 -1.27 0.127 21
$PAD
Sh "1" R 1.524 1.524 0 0 0
Dr 0.9144 0 0
At STD N 00E0FFFF
Ne 0 ""
Po -7.62 0
$EndPAD
$PAD
Sh "2" C 1.524 1.524 0 0 0
Dr 0.9144 0 0
At STD N 00E0FFFF
Ne 0 ""
Po 7.62 0
$EndPAD
$EndMODULE SFT1030
$MODULE SMT43
Po 0 0 0 15 4EA538D5 00000000 ~~
Li SMT43
Sc 0
AR 
Op 0 0 0
T0 0 -3.2004 0.8001 0.8001 0 0.14986 N V 21 N "SMT43"
T1 0 3.29946 0.8001 0.8001 0 0.14986 N I 21 N "Val**"
DA -0.00254 -0.0762 0.98806 2.286 460 0.1778 26
DA -0.00254 0.0762 -1.01854 -2.286 460 0.1778 26
DA -0.00254 -0.0762 0.98806 2.286 460 0.1778 21
DA -0.00254 0.0762 -1.01854 -2.286 460 0.1778 21
$PAD
Sh "1" R 1.6764 4.2164 0 0 0
Dr 0 0 0
At SMD N 04888000
Ne 0 ""
Po -1.39954 0
$EndPAD
$PAD
Sh "2" R 1.6764 4.2164 0 0 0
Dr 0 0 0
At SMD N 04888000
Ne 0 ""
Po 1.39446 0
$EndPAD
$SHAPE3D
Na "Inductor/SMT43.wrl"
Sc 1 1 1
Of 0 0 0
Ro 0 0 0
$EndSHAPE3D
$EndMODULE SMT43
$MODULE TL.SMT75
Po 0 0 0 15 4FE76BD0 00000000 ~~
Li TL.SMT75
Sc 0
AR 
Op 0 0 0
T0 -4.8006 0 0.8001 0.8001 900 0.14986 N V 21 N "TL.SMT75"
T1 0 0 0.8001 0.8001 0 0.14986 N I 21 N "Value"
DA 0.5842 -0.1524 2.5908 3.5814 296 0.0762 25
DA 0 4.191 -0.508 4.0894 1568 0.0762 25
DA -0.6096 -1.0922 -0.508 4.0894 239 0.0762 25
DS -2.6162 3.683 -2.6162 1.3716 0.0762 25
DS -2.6162 1.3716 2.5908 1.3716 0.0762 25
DS 2.5908 1.3716 2.5908 3.5814 0.0762 25
DS -2.6162 -3.5814 -2.6162 -1.397 0.0762 25
DS -2.6162 -1.397 2.5908 -1.397 0.0762 25
DS 2.5908 -1.397 2.5908 -3.683 0.0762 25
DA 0.5842 1.0922 0.4826 -4.0894 239 0.0762 25
DA 0 -4.191 0.4826 -4.0894 1568 0.0762 25
DA -0.6096 0.1524 -2.6162 -3.5814 296 0.0762 25
DS -4.0132 -2.4892 -4.0132 2.5146 0.2794 21
DA -0.7112 -0.0508 -0.508 4.1148 549 0.2794 21
DA 0 4.2164 -0.508 4.1148 1568 0.2794 21
DA 0.6858 -0.0508 3.9878 2.5146 549 0.2794 21
DS 3.9878 2.5146 3.9878 -2.4892 0.2794 21
DA 0.6858 0.0762 0.4826 -4.0894 549 0.2794 21
DA 0 -4.191 0.4826 -4.0894 1568 0.2794 21
DA -0.7112 0.0762 -4.0132 -2.4892 549 0.2794 21
$PAD
Sh "1" R 7.2136 3.7084 0 0 0
Dr 0 0 0
At SMD N 00888000
Ne 0 ""
Po 0 3.0226
$EndPAD
$PAD
Sh "2" R 7.2136 3.7084 0 0 0
Dr 0 0 0
At SMD N 00888000
Ne 0 ""
Po 0 -2.9972
$EndPAD
$SHAPE3D
Na "Inductor/SMT75.wrl"
Sc 1 1 1
Of 0 0 0
Ro 0 0 0
$EndSHAPE3D
$EndMODULE TL.SMT75
$MODULE TL.XXXSM4
Po 0 0 0 15 4EA53936 00000000 ~~
Li TL.XXXSM4
Sc 0
AR 
Op 0 0 0
T0 0 -2.54 0.8001 0.8001 0 0.14986 N V 21 N "TL.XXXSM4"
T1 0 2.54 0.8001 0.8001 0 0.14986 N I 21 N "Val**"
DS -2.54 -1.6764 2.4638 -1.6764 0.1778 21
DS 2.4638 -1.6764 2.4638 1.7018 0.1778 21
DS 2.4638 1.7018 -2.54 1.7018 0.1778 21
DS -2.54 1.7018 -2.54 -1.6764 0.1778 21
DS -2.54 -1.6764 2.4638 -1.6764 0.1778 26
DS 2.4638 -1.6764 2.4638 1.7018 0.1778 26
DS 2.4638 1.7018 -2.54 1.7018 0.1778 26
DS -2.54 1.7018 -2.54 -1.6764 0.1778 26
$PAD
Sh "1" R 1.4732 2.9972 0 0 0
Dr 0 0 0
At SMD N 00888000
Ne 0 ""
Po -1.524 0
$EndPAD
$PAD
Sh "2" R 1.4732 2.9972 0 0 0
Dr 0 0 0
At SMD N 00888000
Ne 0 ""
Po 1.4732 0
$EndPAD
$EndMODULE TL.XXXSM4
$MODULE TL.XXXSMD
Po 0 0 0 15 4EA5397A 00000000 ~~
Li TL.XXXSMD
Sc 0
AR 
Op 0 0 0
T0 0 -2.032 0.8001 0.8001 0 0.14986 N V 21 N "TL.XXXSMD"
T1 0 2.032 0.8001 0.8001 0 0.14986 N I 21 N "Val**"
DS -1.5113 -1.2954 1.4859 -1.2954 0.127 26
DS 1.4859 -1.2954 1.4859 1.3208 0.127 26
DS 1.4859 1.3208 -1.5113 1.3208 0.127 26
DS -1.5113 1.3208 -1.5113 -1.2954 0.127 26
DS -1.5113 -1.2954 1.4859 -1.2954 0.127 21
DS 1.4859 -1.2954 1.4859 1.3208 0.127 21
DS 1.4859 1.3208 -1.5113 1.3208 0.127 21
DS -1.5113 1.3208 -1.5113 -1.2954 0.127 21
$PAD
Sh "1" R 0.8636 2.286 0 0 0
Dr 0 0 0
At SMD N 00888000
Ne 0 ""
Po -0.6985 0
$EndPAD
$PAD
Sh "2" R 0.8636 2.286 0 0 0
Dr 0 0 0
At SMD N 00888000
Ne 0 ""
Po 0.6985 0
$EndPAD
$EndMODULE TL.XXXSMD
$MODULE TLEC
Po 0 0 0 15 4EA539A4 00000000 ~~
Li TLEC
Sc 0
AR 
Op 0 0 0
T0 0 -2.286 0.8001 0.8001 0 0.14986 N V 21 N "TLEC"
T1 0 2.54 0.8001 0.8001 0 0.14986 N I 21 N "Val**"
DS 1.27 -1.27 1.27 1.27 0.0508 26
DS -1.27 -1.27 -1.27 1.27 0.0508 26
DA -5.2578 -2.8448 -3.302 -0.762 447 0.254 26
DA -1.651 0.381 -3.302 -0.762 368 0.254 26
DS -2.286 -1.524 -1.524 -1.524 0.254 26
DS -1.524 -1.524 -1.27 -1.27 0.254 26
DS -1.27 -1.27 1.27 -1.27 0.254 26
DS 1.27 -1.27 1.524 -1.524 0.254 26
DS 1.524 -1.524 2.286 -1.524 0.254 26
DA 1.651 0.381 2.286 -1.524 368 0.254 26
DA 5.2324 -2.8448 5.334 0 448 0.254 26
DA 5.2324 2.8702 3.302 0.762 445 0.254 26
DA 0.889 -1.397 3.302 0.762 226 0.254 26
DS 2.286 1.524 1.524 1.524 0.254 26
DS 1.524 1.524 1.27 1.27 0.254 26
DS 1.27 1.27 -1.27 1.27 0.254 26
DS -1.27 1.27 -1.524 1.524 0.254 26
DS -1.524 1.524 -2.286 1.524 0.254 26
DA -1.651 -0.381 -2.286 1.524 368 0.254 26
DA -5.2578 2.8702 -5.334 0 443 0.254 26
DS 1.27 -1.27 1.27 1.27 0.0508 21
DS -1.27 -1.27 -1.27 1.27 0.0508 21
DA -5.2578 -2.8448 -3.302 -0.762 447 0.254 21
DA -1.651 0.381 -3.302 -0.762 368 0.254 21
DS -2.286 -1.524 -1.524 -1.524 0.254 21
DS -1.524 -1.524 -1.27 -1.27 0.254 21
DS -1.27 -1.27 1.27 -1.27 0.254 21
DS 1.27 -1.27 1.524 -1.524 0.254 21
DS 1.524 -1.524 2.286 -1.524 0.254 21
DA 1.651 0.381 2.286 -1.524 368 0.254 21
DA 5.2324 -2.8448 5.334 0 448 0.254 21
DA 5.2324 2.8702 3.302 0.762 445 0.254 21
DA 0.889 -1.397 3.302 0.762 226 0.254 21
DS 2.286 1.524 1.524 1.524 0.254 21
DS 1.524 1.524 1.27 1.27 0.254 21
DS 1.27 1.27 -1.27 1.27 0.254 21
DS -1.27 1.27 -1.524 1.524 0.254 21
DS -1.524 1.524 -2.286 1.524 0.254 21
DA -1.651 -0.381 -2.286 1.524 368 0.254 21
DA -5.2578 2.8702 -5.334 0 443 0.254 21
$PAD
Sh "1" R 1.524 1.524 0 0 0
Dr 0.9144 0 0
At STD N 00E0FFFF
Ne 0 ""
Po -6.35 0
$EndPAD
$PAD
Sh "2" C 1.524 1.524 0 0 0
Dr 0.9144 0 0
At STD N 00E0FFFF
Ne 0 ""
Po 6.35 0
$EndPAD
$EndMODULE TLEC
$MODULE TLEC-1000
Po 0 0 0 15 4EA53A18 00000000 ~~
Li TLEC-1000
Sc 0
AR 
Op 0 0 0
T0 0 -2.54 0.8001 0.8001 0 0.14986 N V 21 N "TLEC 1000"
T1 0 2.54 0.8001 0.8001 0 0.14986 N I 21 N "Val**"
DS 11.43 0 5.334 0 0.254 26
DS -11.43 0 -5.334 0 0.254 26
DS -11.43 0 -5.334 0 0.254 21
DS 11.43 0 5.334 0 0.254 21
DS 1.27 -1.27 1.27 1.27 0.0508 26
DS -1.27 -1.27 -1.27 1.27 0.0508 26
DA -5.2578 -2.8448 -3.302 -0.762 447 0.254 26
DA -1.651 0.381 -3.302 -0.762 368 0.254 26
DS -2.286 -1.524 -1.524 -1.524 0.254 26
DS -1.524 -1.524 -1.27 -1.27 0.254 26
DS -1.27 -1.27 1.27 -1.27 0.254 26
DS 1.27 -1.27 1.524 -1.524 0.254 26
DS 1.524 -1.524 2.286 -1.524 0.254 26
DA 1.651 0.381 2.286 -1.524 368 0.254 26
DA 5.2324 -2.8448 5.334 0 448 0.254 26
DA 5.2324 2.8702 3.302 0.762 445 0.254 26
DA 0.889 -1.397 3.302 0.762 226 0.254 26
DS 2.286 1.524 1.524 1.524 0.254 26
DS 1.524 1.524 1.27 1.27 0.254 26
DS 1.27 1.27 -1.27 1.27 0.254 26
DS -1.27 1.27 -1.524 1.524 0.254 26
DS -1.524 1.524 -2.286 1.524 0.254 26
DA -1.651 -0.381 -2.286 1.524 368 0.254 26
DA -5.2578 2.8702 -5.334 0 443 0.254 26
DS 1.27 -1.27 1.27 1.27 0.0508 21
DS -1.27 -1.27 -1.27 1.27 0.0508 21
DA -5.2578 -2.8448 -3.302 -0.762 447 0.254 21
DA -1.651 0.381 -3.302 -0.762 368 0.254 21
DS -2.286 -1.524 -1.524 -1.524 0.254 21
DS -1.524 -1.524 -1.27 -1.27 0.254 21
DS -1.27 -1.27 1.27 -1.27 0.254 21
DS 1.27 -1.27 1.524 -1.524 0.254 21
DS 1.524 -1.524 2.286 -1.524 0.254 21
DA 1.651 0.381 2.286 -1.524 368 0.254 21
DA 5.2324 -2.8448 5.334 0 448 0.254 21
DA 5.2324 2.8702 3.302 0.762 445 0.254 21
DA 0.889 -1.397 3.302 0.762 226 0.254 21
DS 2.286 1.524 1.524 1.524 0.254 21
DS 1.524 1.524 1.27 1.27 0.254 21
DS 1.27 1.27 -1.27 1.27 0.254 21
DS -1.27 1.27 -1.524 1.524 0.254 21
DS -1.524 1.524 -2.286 1.524 0.254 21
DA -1.651 -0.381 -2.286 1.524 368 0.254 21
DA -5.2578 2.8702 -5.334 0 443 0.254 21
$PAD
Sh "1" R 1.524 1.524 0 0 0
Dr 0.9144 0 0
At STD N 00E0FFFF
Ne 0 ""
Po -12.7 0
$EndPAD
$PAD
Sh "2" C 1.524 1.524 0 0 0
Dr 0.9144 0 0
At STD N 00E0FFFF
Ne 0 ""
Po 12.7 0
$EndPAD
$EndMODULE TLEC-1000
$MODULE TLEC-800
Po 0 0 0 15 4EA539DC 00000000 ~~
Li TLEC-800
Sc 0
AR 
Op 0 0 0
T0 0 -2.54 0.8001 0.8001 0 0.14986 N V 21 N "TLEC 800"
T1 0 2.54 0.8001 0.8001 0 0.14986 N I 21 N "Val**"
DA -5.2578 -2.8448 -3.302 -0.762 447 0.254 21
DA -1.651 0.381 -3.302 -0.762 368 0.254 21
DS -2.286 -1.524 -1.524 -1.524 0.254 21
DS -1.524 -1.524 -1.27 -1.27 0.254 21
DS -1.27 -1.27 1.27 -1.27 0.254 21
DS 1.27 -1.27 1.524 -1.524 0.254 21
DS 1.524 -1.524 2.286 -1.524 0.254 21
DA 1.651 0.381 2.286 -1.524 368 0.254 21
DA 5.2324 -2.8448 5.334 0 448 0.254 21
DA 5.2324 2.8702 3.302 0.762 445 0.254 21
DA 0.889 -1.397 3.302 0.762 226 0.254 21
DS 2.286 1.524 1.524 1.524 0.254 21
DS 1.524 1.524 1.27 1.27 0.254 21
DS 1.27 1.27 -1.27 1.27 0.254 21
DS -1.27 1.27 -1.524 1.524 0.254 21
DS -1.524 1.524 -2.286 1.524 0.254 21
DA -1.651 -0.381 -2.286 1.524 368 0.254 21
DA -5.2578 2.8702 -5.334 0 443 0.254 21
DS 5.334 0 8.89 0 0.254 26
DS -8.89 0 -5.334 0 0.254 26
DS -5.334 0 -8.89 0 0.254 21
DS 5.334 0 8.89 0 0.254 21
DS 1.27 -1.27 1.27 1.27 0.0508 26
DS -1.27 -1.27 -1.27 1.27 0.0508 26
DA -5.2578 -2.8448 -3.302 -0.762 447 0.254 26
DA -1.651 0.381 -3.302 -0.762 368 0.254 26
DS -2.286 -1.524 -1.524 -1.524 0.254 26
DS -1.524 -1.524 -1.27 -1.27 0.254 26
DS -1.27 -1.27 1.27 -1.27 0.254 26
DS 1.27 -1.27 1.524 -1.524 0.254 26
DS 1.524 -1.524 2.286 -1.524 0.254 26
DA 1.651 0.381 2.286 -1.524 368 0.254 26
DA 5.2324 -2.8448 5.334 0 448 0.254 26
DA 5.2324 2.8702 3.302 0.762 445 0.254 26
DA 0.889 -1.397 3.302 0.762 226 0.254 26
DS 2.286 1.524 1.524 1.524 0.254 26
DS 1.524 1.524 1.27 1.27 0.254 26
DS 1.27 1.27 -1.27 1.27 0.254 26
DS -1.27 1.27 -1.524 1.524 0.254 26
DS -1.524 1.524 -2.286 1.524 0.254 26
DA -1.651 -0.381 -2.286 1.524 368 0.254 26
DA -5.2578 2.8702 -5.334 0 443 0.254 26
DS 1.27 -1.27 1.27 1.27 0.0508 21
DS -1.27 -1.27 -1.27 1.27 0.0508 21
$PAD
Sh "1" R 1.524 1.524 0 0 0
Dr 0.9144 0 0
At STD N 00E0FFFF
Ne 0 ""
Po -10.16 0
$EndPAD
$PAD
Sh "2" C 1.524 1.524 0 0 0
Dr 0.9144 0 0
At STD N 00E0FFFF
Ne 0 ""
Po 10.16 0
$EndPAD
$EndMODULE TLEC-800
$MODULE TR_EI20-1X
Po 0 0 0 15 51597908 00000000 ~~
Li TR_EI20-1X
Sc 0
AR 
Op 0 0 0
T0 0 -11.5 0.8001 0.8001 0 0.14986 N V 21 N "TR_EI20-1X"
T1 0 0 0.8001 0.8001 0 0.14986 N I 21 N "Val**"
DS -10.795 10.795 -10.795 -10.795 0.1778 21
DS -10.795 -10.795 10.795 -10.795 0.1778 21
DS 10.795 -10.795 10.795 10.795 0.1778 21
DS 10.795 10.795 -10.795 10.795 0.1778 21
$PAD
Sh "1" C 3 3 0 0 0
Dr 0.9144 0 0
At STD N 00E0FFFF
Ne 0 ""
Po -7.5 7.5
$EndPAD
$PAD
Sh "2" C 3 3 0 0 0
Dr 0.9144 0 0
At STD N 00E0FFFF
Ne 0 ""
Po 7.5 7.5
$EndPAD
$PAD
Sh "4" C 3 3 0 0 0
Dr 0.9144 0 0
At STD N 00E0FFFF
Ne 0 ""
Po -2.5 -7.5
$EndPAD
$PAD
Sh "3" C 3 3 0 0 0
Dr 0.9144 0 0
At STD N 00E0FFFF
Ne 0 ""
Po 2.5 -7.5
$EndPAD
$SHAPE3D
Na "Inductor/EI201.wrl"
Sc 1 1 1
Of 0 0 0
Ro 0 0 0
$EndSHAPE3D
$EndMODULE TR_EI20-1X
$MODULE TR_EI20-2X
Po 0 0 0 15 51597B3A 00000000 ~~
Li TR_EI20-2X
Sc 0
AR 
Op 0 0 0
T0 0 -12.7 0.8001 0.8001 0 0.14986 N V 21 N "TR EI20-2X"
T1 0 0 0.8001 0.8001 0 0.14986 N I 21 N "Val**"
DS -10.795 10.795 -10.795 -10.795 0.1778 21
DS -10.795 -10.795 10.795 -10.795 0.1778 21
DS 10.795 -10.795 10.795 10.795 0.1778 21
DS 10.795 10.795 -10.795 10.795 0.1778 21
$PAD
Sh "1" C 2 2 0 0 0
Dr 0.9144 0 0
At STD N 00E0FFFF
Ne 0 ""
Po -7.5 7.5
$EndPAD
$PAD
Sh "2" C 2 2 0 0 0
Dr 0.9144 0 0
At STD N 00E0FFFF
Ne 0 ""
Po 7.5 7.5
$EndPAD
$PAD
Sh "6" C 2 2 0 0 0
Dr 0.9144 0 0
At STD N 00E0FFFF
Ne 0 ""
Po -7.5 -7.5
$EndPAD
$PAD
Sh "3" C 2 2 0 0 0
Dr 0.9144 0 0
At STD N 00E0FFFF
Ne 0 ""
Po 7.5 -7.5
$EndPAD
$PAD
Sh "5" C 2 2 0 0 0
Dr 0.9144 0 0
At STD N 00E0FFFF
Ne 0 ""
Po -2.5 -7.5
$EndPAD
$PAD
Sh "4" C 2 2 0 0 0
Dr 0.9144 0 0
At STD N 00E0FFFF
Ne 0 ""
Po 2.5 -7.5
$EndPAD
$SHAPE3D
Na "Inductor/EI201b.wrl"
Sc 1 1 1
Of 0 0 0
Ro 0 0 0
$EndSHAPE3D
$EndMODULE TR_EI20-2X
$MODULE TR_EI303-1X
Po 0 0 0 15 51598374 00000000 ~~
Li TR_EI303-1X
Sc 0
AR 
Op 0 0 0
T0 0 -15.24 0.8001 0.8001 0 0.14986 N V 21 N "TR EI303-1X"
T1 0 15.24 0.8001 0.8001 0 0.14986 N I 21 N "Val**"
DS -16.4592 13.97 16.1036 13.97 0.2286 21
DS 16.1036 13.97 16.1036 -13.6144 0.2286 21
DS 16.1036 -13.6144 -16.4592 -13.6144 0.2286 21
DS -16.4592 -13.6144 -16.4592 13.97 0.2286 21
$PAD
Sh "1" R 3 3 0 0 0
Dr 0.9652 0 0
At STD N 00E0FFFF
Ne 0 ""
Po -10 10
$EndPAD
$PAD
Sh "2" C 3 3 0 0 0
Dr 0.9652 0 0
At STD N 00E0FFFF
Ne 0 ""
Po 10 10
$EndPAD
$PAD
Sh "4" C 3 3 0 0 0
Dr 0.9652 0 0
At STD N 00E0FFFF
Ne 0 ""
Po -5 -10
$EndPAD
$PAD
Sh "3" C 3 3 0 0 0
Dr 0.9652 0 0
At STD N 00E0FFFF
Ne 0 ""
Po 5 -10
$EndPAD
$SHAPE3D
Na "Inductor/EI303.wrl"
Sc 1 1 1
Of 0 0 0
Ro 0 0 0
$EndSHAPE3D
$EndMODULE TR_EI303-1X
$MODULE TR_EI303-2X
Po 0 0 0 15 5159840A 00000000 ~~
Li TR_EI303-2X
Sc 0
AR 
Op 0 0 0
T0 0 -15.24 0.8001 0.8001 0 0.14986 N V 21 N "TR EI303-2X"
T1 0 15.24 0.8001 0.8001 0 0.14986 N I 21 N "Val**"
DS -16.4592 13.97 16.1036 13.97 0.2286 21
DS 16.1036 13.97 16.1036 -13.6144 0.2286 21
DS 16.1036 -13.6144 -16.4592 -13.6144 0.2286 21
DS -16.4592 -13.6144 -16.4592 13.97 0.2286 21
$PAD
Sh "1" R 3 3 0 0 0
Dr 0.9652 0 0
At STD N 00E0FFFF
Ne 0 ""
Po -10 10
$EndPAD
$PAD
Sh "2" C 3 3 0 0 0
Dr 0.9652 0 0
At STD N 00E0FFFF
Ne 0 ""
Po 10 10
$EndPAD
$PAD
Sh "4" C 3 3 0 0 0
Dr 0.9652 0 0
At STD N 00E0FFFF
Ne 0 ""
Po 5 -10
$EndPAD
$PAD
Sh "3" C 3 3 0 0 0
Dr 0.9652 0 0
At STD N 00E0FFFF
Ne 0 ""
Po 10 -10
$EndPAD
$PAD
Sh "5" C 3 3 0 0 0
Dr 0.9652 0 0
At STD N 00E0FFFF
Ne 0 ""
Po -5 -10
$EndPAD
$PAD
Sh "6" C 3 3 0 0 0
Dr 0.9652 0 0
At STD N 00E0FFFF
Ne 0 ""
Po -10 -10
$EndPAD
$SHAPE3D
Na "Inductor/EI303b.wrl"
Sc 1 1 1
Of 0 0 0
Ro 0 0 0
$EndSHAPE3D
$EndMODULE TR_EI303-2X
$MODULE TR_EI382-1X
Po 0 0 0 15 51598556 00000000 ~~
Li TR_EI382-1X
Sc 0
AR 
Op 0 0 0
T0 0 -20.32 0.8001 0.8001 0 0.14986 N V 21 N "TR EI382-1X"
T1 0 0 0.8001 0.8001 0 0.14986 N I 21 N "Val**"
DS -20.6502 17.8054 20.2946 17.8054 0.4826 21
DS 20.2946 17.8054 20.2946 -17.272 0.4826 21
DS 20.2946 -17.272 -20.6502 -17.272 0.4826 21
DS -20.6502 -17.272 -20.6502 17.8054 0.4826 21
$PAD
Sh "1" R 3 3 0 0 0
Dr 0.9652 0 0
At STD N 00E0FFFF
Ne 0 ""
Po -10 12.5
$EndPAD
$PAD
Sh "2" C 3 3 0 0 0
Dr 0.9652 0 0
At STD N 00E0FFFF
Ne 0 ""
Po 10 12.5
$EndPAD
$PAD
Sh "3" C 3 3 0 0 0
Dr 0.9652 0 0
At STD N 00E0FFFF
Ne 0 ""
Po 5 -12.5
$EndPAD
$PAD
Sh "4" C 3 3 0 0 0
Dr 0.9652 0 0
At STD N 00E0FFFF
Ne 0 ""
Po -5 -12.5
$EndPAD
$SHAPE3D
Na "Inductor/EI382.wrl"
Sc 1 1 1
Of 0 0 0
Ro 0 0 0
$EndSHAPE3D
$EndMODULE TR_EI382-1X
$MODULE TR_EI382-2X
Po 0 0 0 15 5159857A 00000000 ~~
Li TR_EI382-2X
Sc 0
AR 
Op 0 0 0
T0 0 -20.32 0.8001 0.8001 0 0.14986 N V 21 N "TR EI382-2X"
T1 0 0 0.8001 0.8001 0 0.14986 N I 21 N "Val**"
DS -20.6502 17.8054 20.2946 17.8054 0.4826 21
DS 20.2946 17.8054 20.2946 -17.272 0.4826 21
DS 20.2946 -17.272 -20.6502 -17.272 0.4826 21
DS -20.6502 -17.272 -20.6502 17.8054 0.4826 21
$PAD
Sh "1" R 3 3 0 0 0
Dr 0.9652 0 0
At STD N 00E0FFFF
Ne 0 ""
Po -10 12.5
$EndPAD
$PAD
Sh "2" C 3 3 0 0 0
Dr 0.9652 0 0
At STD N 00E0FFFF
Ne 0 ""
Po 10 12.5
$EndPAD
$PAD
Sh "3" C 3 3 0 0 0
Dr 0.9652 0 0
At STD N 00E0FFFF
Ne 0 ""
Po 10 -12.5
$EndPAD
$PAD
Sh "4" C 3 3 0 0 0
Dr 0.9652 0 0
At STD N 00E0FFFF
Ne 0 ""
Po 5 -12.5
$EndPAD
$PAD
Sh "5" C 3 3 0 0 0
Dr 0.9652 0 0
At STD N 00E0FFFF
Ne 0 ""
Po -5 -12.5
$EndPAD
$PAD
Sh "6" C 3 3 0 0 0
Dr 0.9652 0 0
At STD N 00E0FFFF
Ne 0 ""
Po -10 -12.5
$EndPAD
$SHAPE3D
Na "Inductor/EI382b.wrl"
Sc 1 1 1
Of 0 0 0
Ro 0 0 0
$EndSHAPE3D
$EndMODULE TR_EI382-2X
$MODULE TR_EI422
Po 0 0 0 15 515986DE 00000000 ~~
Li TR_EI422
Sc 0
AR 
Op 0 0 0
T0 0 -20.32 0.8001 0.8001 0 0.14986 N V 21 N "TR EI422"
T1 0 0 0.8001 0.8001 0 0.14986 N I 21 N "Val**"
DC 31.8516 0.2286 36.0426 0.2286 0.9906 21
DC -32.1818 0.2286 -27.9908 0.2286 0.9906 21
DS -23.1902 18.7 -23.1902 9.2202 0.9906 21
DS -23.1902 9.2202 -39.1922 9.2202 0.9906 21
DA -20.7518 0.1778 -39.1922 9.2202 522 0.9906 21
DS -39.1922 -8.8646 -23.1902 -8.8646 0.9906 21
DS -23.1902 -8.8646 -23.1902 -18.2626 0.9906 21
DS -23.1902 -18.2626 22.86 -18.2626 0.9906 21
DS 22.86 -18.2626 22.86 -8.763 0.9906 21
DS 22.86 -8.763 38.8366 -8.763 0.9906 21
DA 20.3962 0.2794 38.8366 -8.763 522 0.9906 21
DS 38.8366 9.3218 22.86 9.3218 0.9906 21
DS 22.86 9.3218 22.86 18.6944 0.9906 21
DS 22.86 18.6944 -23.1902 18.6944 0.9906 21
$PAD
Sh "1" R 1.7272 1.7272 0 0 0
Dr 1.1176 0 0
At STD N 00E0FFFF
Ne 0 ""
Po -12.5 12.5
$EndPAD
$PAD
Sh "2" C 1.7272 1.7272 0 0 0
Dr 1.1176 0 0
At STD N 00E0FFFF
Ne 0 ""
Po -7.5 12.5
$EndPAD
$PAD
Sh "A" C 1.7272 1.7272 0 0 0
Dr 1.1176 0 0
At STD N 00E0FFFF
Ne 0 ""
Po -2.5 12.5
$EndPAD
$PAD
Sh "3" C 1.7272 1.7272 0 0 0
Dr 1.1176 0 0
At STD N 00E0FFFF
Ne 0 ""
Po 0 12.5
$EndPAD
$PAD
Sh "B" C 1.7272 1.7272 0 0 0
Dr 1.1176 0 0
At STD N 00E0FFFF
Ne 0 ""
Po 2.5 12.5
$EndPAD
$PAD
Sh "4" C 1.7272 1.7272 0 0 0
Dr 1.1176 0 0
At STD N 00E0FFFF
Ne 0 ""
Po 7.5 12.5
$EndPAD
$PAD
Sh "5" C 1.7272 1.7272 0 0 0
Dr 1.1176 0 0
At STD N 00E0FFFF
Ne 0 ""
Po 12.5 12.5
$EndPAD
$PAD
Sh "6" C 1.7272 1.7272 0 0 0
Dr 1.1176 0 0
At STD N 00E0FFFF
Ne 0 ""
Po 12.5 -12.5
$EndPAD
$PAD
Sh "7" C 1.7272 1.7272 0 0 0
Dr 1.1176 0 0
At STD N 00E0FFFF
Ne 0 ""
Po 7.5 -12.5
$EndPAD
$PAD
Sh "8" C 1.7272 1.7272 0 0 0
Dr 1.1176 0 0
At STD N 00E0FFFF
Ne 0 ""
Po 0 -12.5
$EndPAD
$PAD
Sh "9" C 1.7272 1.7272 0 0 0
Dr 1.1176 0 0
At STD N 00E0FFFF
Ne 0 ""
Po -7.5 -12.5
$EndPAD
$PAD
Sh "10" C 1.7272 1.7272 0 0 0
Dr 1.1176 0 0
At STD N 00E0FFFF
Ne 0 ""
Po -12 -12.5
$EndPAD
$PAD
Sh "C" C 1.7272 1.7272 0 0 0
Dr 1.1176 0 0
At STD N 00E0FFFF
Ne 0 ""
Po 2.5 -12.5
$EndPAD
$PAD
Sh "D" C 1.7272 1.7272 0 0 0
Dr 1.1176 0 0
At STD N 00E0FFFF
Ne 0 ""
Po -2.5 -12.5
$EndPAD
$SHAPE3D
Na "Inductor/EI422.wrl"
Sc 1 1 1
Of 0 0 0
Ro 0 0 0
$EndSHAPE3D
$EndMODULE TR_EI422
$EndLIBRARY
