PCBNEW-LibModule-V1  dom 26 dic 2010 19:05:08 CET
$INDEX
mors_2p
mors_3p
mors_4p
mors_5p
mors_6p
mors_7p
mors_8p
mors_9p
mors_10p
mors_11p
mors_12p
mors_13p
mors_14p
mors_15p
mors_16p
mors_17p
mors_18p
mors_19p
mors_20p
mstbva_2,5/12-g-5,08
mstbva_2,5/11-g-5,08
mstbva_2,5/10-g-5,08
mstbva_2,5/9-g-5,08
mstbva_2,5/8-g-5,08
mstbva_2,5/7-g-5,08
mstbva_2,5/6-g-5,08
mstbva_2,5/5-g-5,08
mstbva_2,5/4-g-5,08
mstbva_2,5/3-g-5,08
mstbva_2,5/2-g-5,08
mstba_2,5/2-g-5,08
mstba_2,5/3-g-5,08
mstba_2,5/4-g-5,08
mstba_2,5/5-g-5,08
mstba_2,5/6-g-5,08
mstba_2,5/7-g-5,08
mstba_2,5/8-g-5,08
mstba_2,5/9-g-5,08
mstba_2,5/10-g-5,08
mstba_2,5/11-g-5,08
mstba_2,5/12-g-5,08
$EndINDEX
$MODULE mstbva_2,5/3-g-5,08
Po 0 0 0 15 4A8695FF 00000000 ~~
Li mstbva_2,5/3-g-5,08
Cd Terminal block 3 pins, Phoenix MSTBVA 2,5/3-G-5,08
Kw DEV
Sc 00000000
AR
Op 0 0 0
T0 0 -2300 600 600 0 120 N V 21 N"MSTBVA 2,5/3-G-5,08"
T1 0 2600 600 600 0 120 N V 21 N"JP***"
DS 3400 2000 -3400 2000 120 21
DS -3400 1600 3400 1600 120 21
DS 3400 -1500 -3400 -1500 120 21
DS -3400 -1500 -3400 2000 120 21
DS 3400 2000 3400 -1500 120 21
DA -2000 0 -3000 -1000 900 120 21
DA 0 0 -1000 -1000 900 120 21
DS 3000 -1000 3000 1600 120 21
DS -3000 -1000 -3000 1600 120 21
DA 2000 0 1000 -1000 900 120 21
$PAD
Sh "1" R 1181 1181 0 0 0
Dr 551 0 0
At STD N 00E0FFFF
Ne 0 ""
Po -2000 0
$EndPAD
$PAD
Sh "3" C 1181 1181 0 0 0
Dr 551 0 0
At STD N 00E0FFFF
Ne 0 ""
Po 2000 0
$EndPAD
$PAD
Sh "2" C 1181 1181 0 0 0
Dr 551 0 0
At STD N 00E0FFFF
Ne 0 ""
Po 0 0
$EndPAD
$SHAPE3D
Na "walter\conn_screw\mstbva_2,5-3-g-5,08.wrl"
Sc 1.000000 1.000000 1.000000
Of 0.000000 0.000000 0.000000
Ro 0.000000 0.000000 0.000000
$EndSHAPE3D
$EndMODULE  mstbva_2,5/3-g-5,08
$MODULE mstbva_2,5/2-g-5,08
Po 0 0 0 15 4A869612 00000000 ~~
Li mstbva_2,5/2-g-5,08
Cd Terminal block 2 pins, Phoenix MSTBVA 2,5/2-G-5,08
Kw DEV
Sc 00000000
AR
Op 0 0 0
T0 0 -2300 600 600 0 120 N V 21 N"MSTBVA 2,5/2-G-5,08"
T1 0 2600 600 600 0 120 N V 21 N"JP***"
DS -2400 2000 2400 2000 120 21
DS 2400 1600 -2400 1600 120 21
DS -2400 -1500 2400 -1500 120 21
DS -2400 -1500 -2400 2000 120 21
DS 2400 2000 2400 -1500 120 21
DA -1000 0 -2000 -1000 900 120 21
DA 1000 0 0 -1000 900 120 21
DS 2000 -1000 2000 1600 120 21
DS -2000 -1000 -2000 1600 120 21
$PAD
Sh "1" R 1181 1181 0 0 0
Dr 551 0 0
At STD N 00E0FFFF
Ne 0 ""
Po -1000 0
$EndPAD
$PAD
Sh "2" C 1181 1181 0 0 0
Dr 551 0 0
At STD N 00E0FFFF
Ne 0 ""
Po 1000 0
$EndPAD
$SHAPE3D
Na "walter\conn_screw\mstbva_2,5-2-g-5,08.wrl"
Sc 1.000000 1.000000 1.000000
Of 0.000000 0.000000 0.000000
Ro 0.000000 0.000000 0.000000
$EndSHAPE3D
$EndMODULE  mstbva_2,5/2-g-5,08
$MODULE mstbva_2,5/4-g-5,08
Po 0 0 0 15 4A86962C 00000000 ~~
Li mstbva_2,5/4-g-5,08
Cd Terminal block 4 pins, Phoenix MSTBVA 2,5/4-G-5,08
Kw DEV
Sc 00000000
AR
Op 0 0 0
T0 0 -2300 600 600 0 120 N V 21 N"MSTBVA 2,5/4-G-5,08"
T1 0 2600 600 600 0 120 N V 21 N"JP***"
DS 4400 2000 -4400 2000 120 21
DS -4400 1600 4400 1600 120 21
DS 4400 -1500 -4400 -1500 120 21
DS -4400 -1500 -4400 2000 120 21
DS 4400 2000 4400 -1500 120 21
DA -3000 0 -4000 -1000 900 120 21
DA -1000 0 -2000 -1000 900 120 21
DS 4000 -1000 4000 1600 120 21
DS -4000 -1000 -4000 1600 120 21
DA 1000 0 0 -1000 900 120 21
DA 3000 0 2000 -1000 900 120 21
$PAD
Sh "1" R 1181 1181 0 0 0
Dr 551 0 0
At STD N 00E0FFFF
Ne 0 ""
Po -3000 0
$EndPAD
$PAD
Sh "4" C 1181 1181 0 0 0
Dr 551 0 0
At STD N 00E0FFFF
Ne 0 ""
Po 3000 0
$EndPAD
$PAD
Sh "3" C 1181 1181 0 0 0
Dr 551 0 0
At STD N 00E0FFFF
Ne 0 ""
Po 1000 0
$EndPAD
$PAD
Sh "2" C 1181 1181 0 0 0
Dr 551 0 0
At STD N 00E0FFFF
Ne 0 ""
Po -1000 0
$EndPAD
$SHAPE3D
Na "walter\conn_screw\mstbva_2,5-4-g-5,08.wrl"
Sc 1.000000 1.000000 1.000000
Of 0.000000 0.000000 0.000000
Ro 0.000000 0.000000 0.000000
$EndSHAPE3D
$EndMODULE  mstbva_2,5/4-g-5,08
$MODULE mstbva_2,5/5-g-5,08
Po 0 0 0 15 4A869648 00000000 ~~
Li mstbva_2,5/5-g-5,08
Cd Terminal block 5 pins, Phoenix MSTBVA 2,5/5-G-5,08
Kw DEV
Sc 00000000
AR
Op 0 0 0
T0 0 -2300 600 600 0 120 N V 21 N"MSTBVA 2,5/5-G-5,08"
T1 0 2600 600 600 0 120 N V 21 N"JP***"
DS 5400 2000 -5400 2000 120 21
DS -5400 1600 5400 1600 120 21
DS 5400 -1500 -5400 -1500 120 21
DS -5400 -1500 -5400 2000 120 21
DS 5400 2000 5400 -1500 120 21
DA -4000 0 -5000 -1000 900 120 21
DA -2000 0 -3000 -1000 900 120 21
DS 5000 -1000 5000 1600 120 21
DS -5000 -1000 -5000 1600 120 21
DA 0 0 -1000 -1000 900 120 21
DA 2000 0 1000 -1000 900 120 21
DA 4000 0 3000 -1000 900 120 21
$PAD
Sh "1" R 1181 1181 0 0 0
Dr 551 0 0
At STD N 00E0FFFF
Ne 0 ""
Po -4000 0
$EndPAD
$PAD
Sh "4" C 1181 1181 0 0 0
Dr 551 0 0
At STD N 00E0FFFF
Ne 0 ""
Po 2000 0
$EndPAD
$PAD
Sh "5" C 1181 1181 0 0 0
Dr 551 0 0
At STD N 00E0FFFF
Ne 0 ""
Po 4000 0
$EndPAD
$PAD
Sh "3" C 1181 1181 0 0 0
Dr 551 0 0
At STD N 00E0FFFF
Ne 0 ""
Po 0 0
$EndPAD
$PAD
Sh "2" C 1181 1181 0 0 0
Dr 551 0 0
At STD N 00E0FFFF
Ne 0 ""
Po -2000 0
$EndPAD
$SHAPE3D
Na "walter\conn_screw\mstbva_2,5-5-g-5,08.wrl"
Sc 1.000000 1.000000 1.000000
Of 0.000000 0.000000 0.000000
Ro 0.000000 0.000000 0.000000
$EndSHAPE3D
$EndMODULE  mstbva_2,5/5-g-5,08
$MODULE mstbva_2,5/6-g-5,08
Po 0 0 0 15 4A869662 00000000 ~~
Li mstbva_2,5/6-g-5,08
Cd Terminal block 6 pins, Phoenix MSTBVA 2,5/6-G-5,08
Kw DEV
Sc 00000000
AR
Op 0 0 0
T0 0 -2300 600 600 0 120 N V 21 N"MSTBVA 2,5/6-G-5,08"
T1 0 2600 600 600 0 120 N V 21 N"JP***"
DS 6400 2000 -6400 2000 120 21
DS -6400 1600 6400 1600 120 21
DS 6400 -1500 -6400 -1500 120 21
DS -6400 -1500 -6400 2000 120 21
DS 6400 2000 6400 -1500 120 21
DA -5000 0 -6000 -1000 900 120 21
DA -3000 0 -4000 -1000 900 120 21
DS 6000 -1000 6000 1600 120 21
DS -6000 -1000 -6000 1600 120 21
DA -1000 0 -2000 -1000 900 120 21
DA 1000 0 0 -1000 900 120 21
DA 3000 0 2000 -1000 900 120 21
DA 5000 0 4000 -1000 900 120 21
$PAD
Sh "1" R 1181 1181 0 0 0
Dr 551 0 0
At STD N 00E0FFFF
Ne 0 ""
Po -5000 0
$EndPAD
$PAD
Sh "4" C 1181 1181 0 0 0
Dr 551 0 0
At STD N 00E0FFFF
Ne 0 ""
Po 1000 0
$EndPAD
$PAD
Sh "5" C 1181 1181 0 0 0
Dr 551 0 0
At STD N 00E0FFFF
Ne 0 ""
Po 3000 0
$EndPAD
$PAD
Sh "6" C 1181 1181 0 0 0
Dr 551 0 0
At STD N 00E0FFFF
Ne 0 ""
Po 5000 0
$EndPAD
$PAD
Sh "3" C 1181 1181 0 0 0
Dr 551 0 0
At STD N 00E0FFFF
Ne 0 ""
Po -1000 0
$EndPAD
$PAD
Sh "2" C 1181 1181 0 0 0
Dr 551 0 0
At STD N 00E0FFFF
Ne 0 ""
Po -3000 0
$EndPAD
$SHAPE3D
Na "walter\conn_screw\mstbva_2,5-6-g-5,08.wrl"
Sc 1.000000 1.000000 1.000000
Of 0.000000 0.000000 0.000000
Ro 0.000000 0.000000 0.000000
$EndSHAPE3D
$EndMODULE  mstbva_2,5/6-g-5,08
$MODULE mstbva_2,5/7-g-5,08
Po 0 0 0 15 4A86968B 00000000 ~~
Li mstbva_2,5/7-g-5,08
Cd Terminal block 7 pins, Phoenix MSTBVA 2,5/7-G-5,08
Kw DEV
Sc 00000000
AR
Op 0 0 0
T0 0 -2300 600 600 0 120 N V 21 N"MSTBVA 2,5/7-G-5,08"
T1 0 2600 600 600 0 120 N V 21 N"JP***"
DS 7400 2000 -7400 2000 120 21
DS -7400 1600 7400 1600 120 21
DS 7400 -1500 -7400 -1500 120 21
DS -7400 -1500 -7400 2000 120 21
DS 7400 2000 7400 -1500 120 21
DA -6000 0 -7000 -1000 900 120 21
DA -4000 0 -5000 -1000 900 120 21
DS 7000 -1000 7000 1600 120 21
DS -7000 -1000 -7000 1600 120 21
DA -2000 0 -3000 -1000 900 120 21
DA 0 0 -1000 -1000 900 120 21
DA 2000 0 1000 -1000 900 120 21
DA 4000 0 3000 -1000 900 120 21
DA 6000 0 5000 -1000 900 120 21
$PAD
Sh "1" R 1181 1181 0 0 0
Dr 551 0 0
At STD N 00E0FFFF
Ne 0 ""
Po -6000 0
$EndPAD
$PAD
Sh "4" C 1181 1181 0 0 0
Dr 551 0 0
At STD N 00E0FFFF
Ne 0 ""
Po 0 0
$EndPAD
$PAD
Sh "5" C 1181 1181 0 0 0
Dr 551 0 0
At STD N 00E0FFFF
Ne 0 ""
Po 2000 0
$EndPAD
$PAD
Sh "6" C 1181 1181 0 0 0
Dr 551 0 0
At STD N 00E0FFFF
Ne 0 ""
Po 4000 0
$EndPAD
$PAD
Sh "7" C 1181 1181 0 0 0
Dr 551 0 0
At STD N 00E0FFFF
Ne 0 ""
Po 6000 0
$EndPAD
$PAD
Sh "3" C 1181 1181 0 0 0
Dr 551 0 0
At STD N 00E0FFFF
Ne 0 ""
Po -2000 0
$EndPAD
$PAD
Sh "2" C 1181 1181 0 0 0
Dr 551 0 0
At STD N 00E0FFFF
Ne 0 ""
Po -4000 0
$EndPAD
$SHAPE3D
Na "walter\conn_screw\mstbva_2,5-7-g-5,08.wrl"
Sc 1.000000 1.000000 1.000000
Of 0.000000 0.000000 0.000000
Ro 0.000000 0.000000 0.000000
$EndSHAPE3D
$EndMODULE  mstbva_2,5/7-g-5,08
$MODULE mstbva_2,5/8-g-5,08
Po 0 0 0 15 4A8696A1 00000000 ~~
Li mstbva_2,5/8-g-5,08
Cd Terminal block 8 pins, Phoenix MSTBVA 2,5/8-G-5,08
Kw DEV
Sc 00000000
AR
Op 0 0 0
T0 0 -2300 600 600 0 120 N V 21 N"MSTBVA 2,5/8-G-5,08"
T1 0 2600 600 600 0 120 N V 21 N"JP***"
DS 8400 1600 -8400 1600 120 21
DS -8400 2000 8400 2000 120 21
DS 8400 -1500 -8400 -1500 120 21
DS -8400 -1500 -8400 2000 120 21
DS 8400 2000 8400 -1500 120 21
DA -7000 0 -8000 -1000 900 120 21
DA -5000 0 -6000 -1000 900 120 21
DS 8000 -1000 8000 1600 120 21
DS -8000 -1000 -8000 1600 120 21
DA -3000 0 -4000 -1000 900 120 21
DA -1000 0 -2000 -1000 900 120 21
DA 1000 0 0 -1000 900 120 21
DA 3000 0 2000 -1000 900 120 21
DA 5000 0 4000 -1000 900 120 21
DA 7000 0 6000 -1000 900 120 21
$PAD
Sh "1" R 1181 1181 0 0 0
Dr 551 0 0
At STD N 00E0FFFF
Ne 0 ""
Po -7000 0
$EndPAD
$PAD
Sh "4" C 1181 1181 0 0 0
Dr 551 0 0
At STD N 00E0FFFF
Ne 0 ""
Po -1000 0
$EndPAD
$PAD
Sh "5" C 1181 1181 0 0 0
Dr 551 0 0
At STD N 00E0FFFF
Ne 0 ""
Po 1000 0
$EndPAD
$PAD
Sh "6" C 1181 1181 0 0 0
Dr 551 0 0
At STD N 00E0FFFF
Ne 0 ""
Po 3000 0
$EndPAD
$PAD
Sh "7" C 1181 1181 0 0 0
Dr 551 0 0
At STD N 00E0FFFF
Ne 0 ""
Po 5000 0
$EndPAD
$PAD
Sh "8" C 1181 1181 0 0 0
Dr 551 0 0
At STD N 00E0FFFF
Ne 0 ""
Po 7000 0
$EndPAD
$PAD
Sh "3" C 1181 1181 0 0 0
Dr 551 0 0
At STD N 00E0FFFF
Ne 0 ""
Po -3000 0
$EndPAD
$PAD
Sh "2" C 1181 1181 0 0 0
Dr 551 0 0
At STD N 00E0FFFF
Ne 0 ""
Po -5000 0
$EndPAD
$SHAPE3D
Na "walter\conn_screw\mstbva_2,5-8-g-5,08.wrl"
Sc 1.000000 1.000000 1.000000
Of 0.000000 0.000000 0.000000
Ro 0.000000 0.000000 0.000000
$EndSHAPE3D
$EndMODULE  mstbva_2,5/8-g-5,08
$MODULE mstbva_2,5/9-g-5,08
Po 0 0 0 15 4A8696B9 00000000 ~~
Li mstbva_2,5/9-g-5,08
Cd Terminal block 9 pins, Phoenix MSTBVA 2,5/9-G-5,08
Kw DEV
Sc 00000000
AR
Op 0 0 0
T0 0 -2300 600 600 0 120 N V 21 N"MSTBVA 2,5/9-G-5,08"
T1 0 2600 600 600 0 120 N V 21 N"JP***"
DS 9400 2000 -9400 2000 120 21
DS -9400 1600 9400 1600 120 21
DS 9400 -1500 -9400 -1500 120 21
DS -9400 -1500 -9400 2000 120 21
DS 9400 2000 9400 -1500 120 21
DA -8000 0 -9000 -1000 900 120 21
DA -6000 0 -7000 -1000 900 120 21
DS 9000 -1000 9000 1600 120 21
DS -9000 -1000 -9000 1600 120 21
DA 8000 0 7000 -1000 900 120 21
DA -4000 0 -5000 -1000 900 120 21
DA -2000 0 -3000 -1000 900 120 21
DA 0 0 -1000 -1000 900 120 21
DA 2000 0 1000 -1000 900 120 21
DA 4000 0 3000 -1000 900 120 21
DA 6000 0 5000 -1000 900 120 21
$PAD
Sh "1" R 1181 1181 0 0 0
Dr 551 0 0
At STD N 00E0FFFF
Ne 0 ""
Po -8000 0
$EndPAD
$PAD
Sh "4" C 1181 1181 0 0 0
Dr 551 0 0
At STD N 00E0FFFF
Ne 0 ""
Po -2000 0
$EndPAD
$PAD
Sh "5" C 1181 1181 0 0 0
Dr 551 0 0
At STD N 00E0FFFF
Ne 0 ""
Po 0 0
$EndPAD
$PAD
Sh "6" C 1181 1181 0 0 0
Dr 551 0 0
At STD N 00E0FFFF
Ne 0 ""
Po 2000 0
$EndPAD
$PAD
Sh "7" C 1181 1181 0 0 0
Dr 551 0 0
At STD N 00E0FFFF
Ne 0 ""
Po 4000 0
$EndPAD
$PAD
Sh "8" C 1181 1181 0 0 0
Dr 551 0 0
At STD N 00E0FFFF
Ne 0 ""
Po 6000 0
$EndPAD
$PAD
Sh "9" C 1181 1181 0 0 0
Dr 551 0 0
At STD N 00E0FFFF
Ne 0 ""
Po 8000 0
$EndPAD
$PAD
Sh "3" C 1181 1181 0 0 0
Dr 551 0 0
At STD N 00E0FFFF
Ne 0 ""
Po -4000 0
$EndPAD
$PAD
Sh "2" C 1181 1181 0 0 0
Dr 551 0 0
At STD N 00E0FFFF
Ne 0 ""
Po -6000 0
$EndPAD
$SHAPE3D
Na "walter\conn_screw\mstbva_2,5-9-g-5,08.wrl"
Sc 1.000000 1.000000 1.000000
Of 0.000000 0.000000 0.000000
Ro 0.000000 0.000000 0.000000
$EndSHAPE3D
$EndMODULE  mstbva_2,5/9-g-5,08
$MODULE mstbva_2,5/10-g-5,08
Po 0 0 0 15 4A86975F 00000000 ~~
Li mstbva_2,5/10-g-5,08
Cd Terminal block 10 pins, Phoenix MSTBVA 2,5/10-G-5,08
Kw DEV
Sc 00000000
AR
Op 0 0 0
T0 0 -2300 600 600 0 120 N V 21 N"MSTBVA 2,5/10-G-5,08"
T1 0 2600 600 600 0 120 N V 21 N"JP***"
DS 10400 2000 -10400 2000 120 21
DS -10400 1600 10400 1600 120 21
DS 10400 -1500 -10400 -1500 120 21
DA 9000 0 8000 -1000 900 120 21
DS -10400 -1500 -10400 2000 120 21
DS 10400 2000 10400 -1500 120 21
DA -9000 0 -10000 -1000 900 120 21
DA -7000 0 -8000 -1000 900 120 21
DS 10000 -1000 10000 1600 120 21
DS -10000 -1000 -10000 1600 120 21
DA 7000 0 6000 -1000 900 120 21
DA -5000 0 -6000 -1000 900 120 21
DA -3000 0 -4000 -1000 900 120 21
DA -1000 0 -2000 -1000 900 120 21
DA 1000 0 0 -1000 900 120 21
DA 3000 0 2000 -1000 900 120 21
DA 5000 0 4000 -1000 900 120 21
$PAD
Sh "1" R 1181 1181 0 0 0
Dr 551 0 0
At STD N 00E0FFFF
Ne 0 ""
Po -9000 0
$EndPAD
$PAD
Sh "4" C 1181 1181 0 0 0
Dr 551 0 0
At STD N 00E0FFFF
Ne 0 ""
Po -3000 0
$EndPAD
$PAD
Sh "5" C 1181 1181 0 0 0
Dr 551 0 0
At STD N 00E0FFFF
Ne 0 ""
Po -1000 0
$EndPAD
$PAD
Sh "6" C 1181 1181 0 0 0
Dr 551 0 0
At STD N 00E0FFFF
Ne 0 ""
Po 1000 0
$EndPAD
$PAD
Sh "7" C 1181 1181 0 0 0
Dr 551 0 0
At STD N 00E0FFFF
Ne 0 ""
Po 3000 0
$EndPAD
$PAD
Sh "8" C 1181 1181 0 0 0
Dr 551 0 0
At STD N 00E0FFFF
Ne 0 ""
Po 5000 0
$EndPAD
$PAD
Sh "9" C 1181 1181 0 0 0
Dr 551 0 0
At STD N 00E0FFFF
Ne 0 ""
Po 7000 0
$EndPAD
$PAD
Sh "3" C 1181 1181 0 0 0
Dr 551 0 0
At STD N 00E0FFFF
Ne 0 ""
Po -5000 0
$EndPAD
$PAD
Sh "2" C 1181 1181 0 0 0
Dr 551 0 0
At STD N 00E0FFFF
Ne 0 ""
Po -7000 0
$EndPAD
$PAD
Sh "10" C 1181 1181 0 0 0
Dr 551 0 0
At STD N 00E0FFFF
Ne 0 ""
Po 9000 0
$EndPAD
$SHAPE3D
Na "walter\conn_screw\mstbva_2,5-10-g-5,08.wrl"
Sc 1.000000 1.000000 1.000000
Of 0.000000 0.000000 0.000000
Ro 0.000000 0.000000 0.000000
$EndSHAPE3D
$EndMODULE  mstbva_2,5/10-g-5,08
$MODULE mstbva_2,5/11-g-5,08
Po 0 0 0 15 4A8697C7 00000000 ~~
Li mstbva_2,5/11-g-5,08
Cd Terminal block 11 pins, Phoenix MSTBVA 2,5/11-G-5,08
Kw DEV
Sc 00000000
AR
Op 0 0 0
T0 0 -2300 600 600 0 120 N V 21 N"MSTBVA 2,5/11-G-5,08"
T1 0 2600 600 600 0 120 N V 21 N"JP***"
DS 11400 2000 -11400 2000 120 21
DS -11400 1600 11400 1600 120 21
DS 11400 -1500 -11400 -1500 120 21
DA 10000 0 9000 -1000 900 120 21
DA 8000 0 7000 -1000 900 120 21
DS -11400 -1500 -11400 2000 120 21
DS 11400 2000 11400 -1500 120 21
DA -10000 0 -11000 -1000 900 120 21
DA -8000 0 -9000 -1000 900 120 21
DS 11000 -1000 11000 1600 120 21
DS -11000 -1000 -11000 1600 120 21
DA 6000 0 5000 -1000 900 120 21
DA -6000 0 -7000 -1000 900 120 21
DA -4000 0 -5000 -1000 900 120 21
DA -2000 0 -3000 -1000 900 120 21
DA 0 0 -1000 -1000 900 120 21
DA 2000 0 1000 -1000 900 120 21
DA 4000 0 3000 -1000 900 120 21
$PAD
Sh "1" R 1181 1181 0 0 0
Dr 551 0 0
At STD N 00E0FFFF
Ne 0 ""
Po -10000 0
$EndPAD
$PAD
Sh "4" C 1181 1181 0 0 0
Dr 551 0 0
At STD N 00E0FFFF
Ne 0 ""
Po -4000 0
$EndPAD
$PAD
Sh "5" C 1181 1181 0 0 0
Dr 551 0 0
At STD N 00E0FFFF
Ne 0 ""
Po -2000 0
$EndPAD
$PAD
Sh "6" C 1181 1181 0 0 0
Dr 551 0 0
At STD N 00E0FFFF
Ne 0 ""
Po 0 0
$EndPAD
$PAD
Sh "7" C 1181 1181 0 0 0
Dr 551 0 0
At STD N 00E0FFFF
Ne 0 ""
Po 2000 0
$EndPAD
$PAD
Sh "8" C 1181 1181 0 0 0
Dr 551 0 0
At STD N 00E0FFFF
Ne 0 ""
Po 4000 0
$EndPAD
$PAD
Sh "9" C 1181 1181 0 0 0
Dr 551 0 0
At STD N 00E0FFFF
Ne 0 ""
Po 6000 0
$EndPAD
$PAD
Sh "3" C 1181 1181 0 0 0
Dr 551 0 0
At STD N 00E0FFFF
Ne 0 ""
Po -6000 0
$EndPAD
$PAD
Sh "2" C 1181 1181 0 0 0
Dr 551 0 0
At STD N 00E0FFFF
Ne 0 ""
Po -8000 0
$EndPAD
$PAD
Sh "10" C 1181 1181 0 0 0
Dr 551 0 0
At STD N 00E0FFFF
Ne 0 ""
Po 8000 0
$EndPAD
$PAD
Sh "11" C 1181 1181 0 0 0
Dr 551 0 0
At STD N 00E0FFFF
Ne 0 ""
Po 10000 0
$EndPAD
$SHAPE3D
Na "walter\conn_screw\mstbva_2,5-11-g-5,08.wrl"
Sc 1.000000 1.000000 1.000000
Of 0.000000 0.000000 0.000000
Ro 0.000000 0.000000 0.000000
$EndSHAPE3D
$EndMODULE  mstbva_2,5/11-g-5,08
$MODULE mstbva_2,5/12-g-5,08
Po 0 0 0 15 4A869839 00000000 ~~
Li mstbva_2,5/12-g-5,08
Cd Terminal block 12 pins, Phoenix MSTBVA 2,5/12-G-5,08
Kw DEV
Sc 00000000
AR
Op 0 0 0
T0 0 -2300 600 600 0 120 N V 21 N"MSTBVA 2,5/12-G-5,08"
T1 0 2600 600 600 0 120 N V 21 N"JP***"
DS 12400 2000 -12400 2000 120 21
DS -12400 1600 12400 1600 120 21
DS 12400 -1500 -12400 -1500 120 21
DA 11000 0 10000 -1000 900 120 21
DA 9000 0 8000 -1000 900 120 21
DA 7000 0 6000 -1000 900 120 21
DS -12400 -1500 -12400 2000 120 21
DS 12400 2000 12400 -1500 120 21
DA -11000 0 -12000 -1000 900 120 21
DA -9000 0 -10000 -1000 900 120 21
DS 12000 -1000 12000 1600 120 21
DS -12000 -1000 -12000 1600 120 21
DA 5000 0 4000 -1000 900 120 21
DA -7000 0 -8000 -1000 900 120 21
DA -5000 0 -6000 -1000 900 120 21
DA -3000 0 -4000 -1000 900 120 21
DA -1000 0 -2000 -1000 900 120 21
DA 1000 0 0 -1000 900 120 21
DA 3000 0 2000 -1000 900 120 21
$PAD
Sh "1" R 1181 1181 0 0 0
Dr 551 0 0
At STD N 00E0FFFF
Ne 0 ""
Po -11000 0
$EndPAD
$PAD
Sh "4" C 1181 1181 0 0 0
Dr 551 0 0
At STD N 00E0FFFF
Ne 0 ""
Po -5000 0
$EndPAD
$PAD
Sh "5" C 1181 1181 0 0 0
Dr 551 0 0
At STD N 00E0FFFF
Ne 0 ""
Po -3000 0
$EndPAD
$PAD
Sh "6" C 1181 1181 0 0 0
Dr 551 0 0
At STD N 00E0FFFF
Ne 0 ""
Po -1000 0
$EndPAD
$PAD
Sh "7" C 1181 1181 0 0 0
Dr 551 0 0
At STD N 00E0FFFF
Ne 0 ""
Po 1000 0
$EndPAD
$PAD
Sh "8" C 1181 1181 0 0 0
Dr 551 0 0
At STD N 00E0FFFF
Ne 0 ""
Po 3000 0
$EndPAD
$PAD
Sh "9" C 1181 1181 0 0 0
Dr 551 0 0
At STD N 00E0FFFF
Ne 0 ""
Po 5000 0
$EndPAD
$PAD
Sh "3" C 1181 1181 0 0 0
Dr 551 0 0
At STD N 00E0FFFF
Ne 0 ""
Po -7000 0
$EndPAD
$PAD
Sh "2" C 1181 1181 0 0 0
Dr 551 0 0
At STD N 00E0FFFF
Ne 0 ""
Po -9000 0
$EndPAD
$PAD
Sh "10" C 1181 1181 0 0 0
Dr 551 0 0
At STD N 00E0FFFF
Ne 0 ""
Po 7000 0
$EndPAD
$PAD
Sh "11" C 1181 1181 0 0 0
Dr 551 0 0
At STD N 00E0FFFF
Ne 0 ""
Po 9000 0
$EndPAD
$PAD
Sh "12" C 1181 1181 0 0 0
Dr 551 0 0
At STD N 00E0FFFF
Ne 0 ""
Po 11000 0
$EndPAD
$SHAPE3D
Na "walter\conn_screw\mstbva_2,5-12-g-5,08.wrl"
Sc 1.000000 1.000000 1.000000
Of 0.000000 0.000000 0.000000
Ro 0.000000 0.000000 0.000000
$EndSHAPE3D
$EndMODULE  mstbva_2,5/12-g-5,08
$MODULE mors_20p
Po 0 0 0 15 4B90D86F 00000000 ~~
Li mors_20p
Cd Terminal block 20 pins
Kw DEV
Sc 00000000
AR
Op 0 0 0
T0 0 -2300 600 600 0 120 N V 21 N"MORS_20P"
T1 0 2300 600 600 0 120 N V 21 N"JP***"
DS 20000 -1800 -19900 -1800 100 21
DS -19900 1800 20000 1800 100 21
DS 20000 1400 -19900 1400 100 21
DS 20000 -1800 20000 1800 100 21
DS -19900 1800 -19900 1400 100 21
DS -19900 -1800 -19900 -1500 100 21
DS -19900 1500 -19900 -1500 100 21
$PAD
Sh "1" R 1181 1181 0 0 0
Dr 492 0 0
At STD N 00E0FFFF
Ne 0 ""
Po -19000 0
$EndPAD
$PAD
Sh "2" C 1181 1181 0 0 0
Dr 492 0 0
At STD N 00E0FFFF
Ne 0 ""
Po -17000 0
$EndPAD
$PAD
Sh "3" C 1181 1181 0 0 0
Dr 492 0 0
At STD N 00E0FFFF
Ne 0 ""
Po -15000 0
$EndPAD
$PAD
Sh "4" C 1181 1181 0 0 0
Dr 492 0 0
At STD N 00E0FFFF
Ne 0 ""
Po -13000 0
$EndPAD
$PAD
Sh "5" C 1181 1181 0 0 0
Dr 492 0 0
At STD N 00E0FFFF
Ne 0 ""
Po -11000 0
$EndPAD
$PAD
Sh "6" C 1181 1181 0 0 0
Dr 492 0 0
At STD N 00E0FFFF
Ne 0 ""
Po -9000 0
$EndPAD
$PAD
Sh "7" C 1181 1181 0 0 0
Dr 492 0 0
At STD N 00E0FFFF
Ne 0 ""
Po -7000 0
$EndPAD
$PAD
Sh "8" C 1181 1181 0 0 0
Dr 492 0 0
At STD N 00E0FFFF
Ne 0 ""
Po -5000 0
$EndPAD
$PAD
Sh "9" C 1181 1181 0 0 0
Dr 492 0 0
At STD N 00E0FFFF
Ne 0 ""
Po -3000 0
$EndPAD
$PAD
Sh "10" C 1181 1181 0 0 0
Dr 492 0 0
At STD N 00E0FFFF
Ne 0 ""
Po -1000 0
$EndPAD
$PAD
Sh "11" C 1181 1181 0 0 0
Dr 492 0 0
At STD N 00E0FFFF
Ne 0 ""
Po 1000 0
$EndPAD
$PAD
Sh "12" C 1181 1181 0 0 0
Dr 492 0 0
At STD N 00E0FFFF
Ne 0 ""
Po 3000 0
$EndPAD
$PAD
Sh "13" C 1181 1181 0 0 0
Dr 492 0 0
At STD N 00E0FFFF
Ne 0 ""
Po 5000 0
$EndPAD
$PAD
Sh "14" C 1181 1181 0 0 0
Dr 492 0 0
At STD N 00E0FFFF
Ne 0 ""
Po 7000 0
$EndPAD
$PAD
Sh "15" C 1181 1181 0 0 0
Dr 492 0 0
At STD N 00E0FFFF
Ne 0 ""
Po 9000 0
$EndPAD
$PAD
Sh "16" C 1181 1181 0 0 0
Dr 492 0 0
At STD N 00E0FFFF
Ne 0 ""
Po 11000 0
$EndPAD
$PAD
Sh "17" C 1181 1181 0 0 0
Dr 492 0 0
At STD N 00E0FFFF
Ne 0 ""
Po 13000 0
$EndPAD
$PAD
Sh "18" C 1181 1181 0 0 0
Dr 492 0 0
At STD N 00E0FFFF
Ne 0 ""
Po 15000 0
$EndPAD
$PAD
Sh "19" C 1181 1181 0 0 0
Dr 492 0 0
At STD N 00E0FFFF
Ne 0 ""
Po 17000 0
$EndPAD
$PAD
Sh "20" C 1181 1181 0 0 0
Dr 492 0 0
At STD N 00E0FFFF
Ne 0 ""
Po 19000 0
$EndPAD
$SHAPE3D
Na "walter\conn_screw\mors_20p.wrl"
Sc 1.000000 1.000000 1.000000
Of 0.000000 0.000000 0.000000
Ro 0.000000 0.000000 0.000000
$EndSHAPE3D
$EndMODULE  mors_20p
$MODULE mors_19p
Po 0 0 0 15 4B90D88B 00000000 ~~
Li mors_19p
Cd Terminal block 19 pins
Kw DEV
Sc 00000000
AR
Op 0 0 0
T0 0 -2300 600 600 0 120 N V 21 N"MORS_19P"
T1 0 2300 600 600 0 120 N V 21 N"JP***"
DS 19000 -1800 -18900 -1800 100 21
DS -18900 1800 19000 1800 100 21
DS 19000 1400 -18900 1400 100 21
DS 19000 -1800 19000 1800 100 21
DS -18900 1800 -18900 1400 100 21
DS -18900 -1800 -18900 -1500 100 21
DS -18900 1500 -18900 -1500 100 21
$PAD
Sh "1" R 1181 1181 0 0 0
Dr 492 0 0
At STD N 00E0FFFF
Ne 0 ""
Po -18000 0
$EndPAD
$PAD
Sh "2" C 1181 1181 0 0 0
Dr 492 0 0
At STD N 00E0FFFF
Ne 0 ""
Po -16000 0
$EndPAD
$PAD
Sh "3" C 1181 1181 0 0 0
Dr 492 0 0
At STD N 00E0FFFF
Ne 0 ""
Po -14000 0
$EndPAD
$PAD
Sh "4" C 1181 1181 0 0 0
Dr 492 0 0
At STD N 00E0FFFF
Ne 0 ""
Po -12000 0
$EndPAD
$PAD
Sh "5" C 1181 1181 0 0 0
Dr 492 0 0
At STD N 00E0FFFF
Ne 0 ""
Po -10000 0
$EndPAD
$PAD
Sh "6" C 1181 1181 0 0 0
Dr 492 0 0
At STD N 00E0FFFF
Ne 0 ""
Po -8000 0
$EndPAD
$PAD
Sh "7" C 1181 1181 0 0 0
Dr 492 0 0
At STD N 00E0FFFF
Ne 0 ""
Po -6000 0
$EndPAD
$PAD
Sh "8" C 1181 1181 0 0 0
Dr 492 0 0
At STD N 00E0FFFF
Ne 0 ""
Po -4000 0
$EndPAD
$PAD
Sh "9" C 1181 1181 0 0 0
Dr 492 0 0
At STD N 00E0FFFF
Ne 0 ""
Po -2000 0
$EndPAD
$PAD
Sh "10" C 1181 1181 0 0 0
Dr 492 0 0
At STD N 00E0FFFF
Ne 0 ""
Po 0 0
$EndPAD
$PAD
Sh "11" C 1181 1181 0 0 0
Dr 492 0 0
At STD N 00E0FFFF
Ne 0 ""
Po 2000 0
$EndPAD
$PAD
Sh "12" C 1181 1181 0 0 0
Dr 492 0 0
At STD N 00E0FFFF
Ne 0 ""
Po 4000 0
$EndPAD
$PAD
Sh "13" C 1181 1181 0 0 0
Dr 492 0 0
At STD N 00E0FFFF
Ne 0 ""
Po 6000 0
$EndPAD
$PAD
Sh "14" C 1181 1181 0 0 0
Dr 492 0 0
At STD N 00E0FFFF
Ne 0 ""
Po 8000 0
$EndPAD
$PAD
Sh "15" C 1181 1181 0 0 0
Dr 492 0 0
At STD N 00E0FFFF
Ne 0 ""
Po 10000 0
$EndPAD
$PAD
Sh "16" C 1181 1181 0 0 0
Dr 492 0 0
At STD N 00E0FFFF
Ne 0 ""
Po 12000 0
$EndPAD
$PAD
Sh "17" C 1181 1181 0 0 0
Dr 492 0 0
At STD N 00E0FFFF
Ne 0 ""
Po 14000 0
$EndPAD
$PAD
Sh "18" C 1181 1181 0 0 0
Dr 492 0 0
At STD N 00E0FFFF
Ne 0 ""
Po 16000 0
$EndPAD
$PAD
Sh "19" C 1181 1181 0 0 0
Dr 492 0 0
At STD N 00E0FFFF
Ne 0 ""
Po 18000 0
$EndPAD
$SHAPE3D
Na "walter\conn_screw\mors_19p.wrl"
Sc 1.000000 1.000000 1.000000
Of 0.000000 0.000000 0.000000
Ro 0.000000 0.000000 0.000000
$EndSHAPE3D
$EndMODULE  mors_19p
$MODULE mors_18p
Po 0 0 0 15 4B90D8BB 00000000 ~~
Li mors_18p
Cd Terminal block 18 pins
Kw DEV
Sc 00000000
AR
Op 0 0 0
T0 0 -2300 600 600 0 120 N V 21 N"MORS_18P"
T1 0 2300 600 600 0 120 N V 21 N"JP***"
DS 18000 -1800 -17900 -1800 100 21
DS -17900 1800 18000 1800 100 21
DS 18000 1400 -17900 1400 100 21
DS 18000 -1800 18000 1800 100 21
DS -17900 1800 -17900 1400 100 21
DS -17900 -1800 -17900 -1500 100 21
DS -17900 1500 -17900 -1500 100 21
$PAD
Sh "1" R 1181 1181 0 0 0
Dr 492 0 0
At STD N 00E0FFFF
Ne 0 ""
Po -17000 0
$EndPAD
$PAD
Sh "2" C 1181 1181 0 0 0
Dr 492 0 0
At STD N 00E0FFFF
Ne 0 ""
Po -15000 0
$EndPAD
$PAD
Sh "3" C 1181 1181 0 0 0
Dr 492 0 0
At STD N 00E0FFFF
Ne 0 ""
Po -13000 0
$EndPAD
$PAD
Sh "4" C 1181 1181 0 0 0
Dr 492 0 0
At STD N 00E0FFFF
Ne 0 ""
Po -11000 0
$EndPAD
$PAD
Sh "5" C 1181 1181 0 0 0
Dr 492 0 0
At STD N 00E0FFFF
Ne 0 ""
Po -9000 0
$EndPAD
$PAD
Sh "6" C 1181 1181 0 0 0
Dr 492 0 0
At STD N 00E0FFFF
Ne 0 ""
Po -7000 0
$EndPAD
$PAD
Sh "7" C 1181 1181 0 0 0
Dr 492 0 0
At STD N 00E0FFFF
Ne 0 ""
Po -5000 0
$EndPAD
$PAD
Sh "8" C 1181 1181 0 0 0
Dr 492 0 0
At STD N 00E0FFFF
Ne 0 ""
Po -3000 0
$EndPAD
$PAD
Sh "9" C 1181 1181 0 0 0
Dr 492 0 0
At STD N 00E0FFFF
Ne 0 ""
Po -1000 0
$EndPAD
$PAD
Sh "10" C 1181 1181 0 0 0
Dr 492 0 0
At STD N 00E0FFFF
Ne 0 ""
Po 1000 0
$EndPAD
$PAD
Sh "11" C 1181 1181 0 0 0
Dr 492 0 0
At STD N 00E0FFFF
Ne 0 ""
Po 3000 0
$EndPAD
$PAD
Sh "12" C 1181 1181 0 0 0
Dr 492 0 0
At STD N 00E0FFFF
Ne 0 ""
Po 5000 0
$EndPAD
$PAD
Sh "13" C 1181 1181 0 0 0
Dr 492 0 0
At STD N 00E0FFFF
Ne 0 ""
Po 7000 0
$EndPAD
$PAD
Sh "14" C 1181 1181 0 0 0
Dr 492 0 0
At STD N 00E0FFFF
Ne 0 ""
Po 9000 0
$EndPAD
$PAD
Sh "15" C 1181 1181 0 0 0
Dr 492 0 0
At STD N 00E0FFFF
Ne 0 ""
Po 11000 0
$EndPAD
$PAD
Sh "16" C 1181 1181 0 0 0
Dr 492 0 0
At STD N 00E0FFFF
Ne 0 ""
Po 13000 0
$EndPAD
$PAD
Sh "17" C 1181 1181 0 0 0
Dr 492 0 0
At STD N 00E0FFFF
Ne 0 ""
Po 15000 0
$EndPAD
$PAD
Sh "18" C 1181 1181 0 0 0
Dr 492 0 0
At STD N 00E0FFFF
Ne 0 ""
Po 17000 0
$EndPAD
$SHAPE3D
Na "walter\conn_screw\mors_18p.wrl"
Sc 1.000000 1.000000 1.000000
Of 0.000000 0.000000 0.000000
Ro 0.000000 0.000000 0.000000
$EndSHAPE3D
$EndMODULE  mors_18p
$MODULE mors_17p
Po 0 0 0 15 4B90D8CE 00000000 ~~
Li mors_17p
Cd Terminal block 17 pins
Kw DEV
Sc 00000000
AR
Op 0 0 0
T0 0 -2300 600 600 0 120 N V 21 N"MORS_17P"
T1 0 2300 600 600 0 120 N V 21 N"JP***"
DS 17000 -1800 -16900 -1800 100 21
DS -16900 1800 17000 1800 100 21
DS 17000 1400 -16900 1400 100 21
DS 17000 -1800 17000 1800 100 21
DS -16900 1800 -16900 1400 100 21
DS -16900 -1800 -16900 -1500 100 21
DS -16900 1500 -16900 -1500 100 21
$PAD
Sh "1" R 1181 1181 0 0 0
Dr 492 0 0
At STD N 00E0FFFF
Ne 0 ""
Po -16000 0
$EndPAD
$PAD
Sh "2" C 1181 1181 0 0 0
Dr 492 0 0
At STD N 00E0FFFF
Ne 0 ""
Po -14000 0
$EndPAD
$PAD
Sh "3" C 1181 1181 0 0 0
Dr 492 0 0
At STD N 00E0FFFF
Ne 0 ""
Po -12000 0
$EndPAD
$PAD
Sh "4" C 1181 1181 0 0 0
Dr 492 0 0
At STD N 00E0FFFF
Ne 0 ""
Po -10000 0
$EndPAD
$PAD
Sh "5" C 1181 1181 0 0 0
Dr 492 0 0
At STD N 00E0FFFF
Ne 0 ""
Po -8000 0
$EndPAD
$PAD
Sh "6" C 1181 1181 0 0 0
Dr 492 0 0
At STD N 00E0FFFF
Ne 0 ""
Po -6000 0
$EndPAD
$PAD
Sh "7" C 1181 1181 0 0 0
Dr 492 0 0
At STD N 00E0FFFF
Ne 0 ""
Po -4000 0
$EndPAD
$PAD
Sh "8" C 1181 1181 0 0 0
Dr 492 0 0
At STD N 00E0FFFF
Ne 0 ""
Po -2000 0
$EndPAD
$PAD
Sh "9" C 1181 1181 0 0 0
Dr 492 0 0
At STD N 00E0FFFF
Ne 0 ""
Po 0 0
$EndPAD
$PAD
Sh "10" C 1181 1181 0 0 0
Dr 492 0 0
At STD N 00E0FFFF
Ne 0 ""
Po 2000 0
$EndPAD
$PAD
Sh "11" C 1181 1181 0 0 0
Dr 492 0 0
At STD N 00E0FFFF
Ne 0 ""
Po 4000 0
$EndPAD
$PAD
Sh "12" C 1181 1181 0 0 0
Dr 492 0 0
At STD N 00E0FFFF
Ne 0 ""
Po 6000 0
$EndPAD
$PAD
Sh "13" C 1181 1181 0 0 0
Dr 492 0 0
At STD N 00E0FFFF
Ne 0 ""
Po 8000 0
$EndPAD
$PAD
Sh "14" C 1181 1181 0 0 0
Dr 492 0 0
At STD N 00E0FFFF
Ne 0 ""
Po 10000 0
$EndPAD
$PAD
Sh "15" C 1181 1181 0 0 0
Dr 492 0 0
At STD N 00E0FFFF
Ne 0 ""
Po 12000 0
$EndPAD
$PAD
Sh "16" C 1181 1181 0 0 0
Dr 492 0 0
At STD N 00E0FFFF
Ne 0 ""
Po 14000 0
$EndPAD
$PAD
Sh "17" C 1181 1181 0 0 0
Dr 492 0 0
At STD N 00E0FFFF
Ne 0 ""
Po 16000 0
$EndPAD
$SHAPE3D
Na "walter\conn_screw\mors_17p.wrl"
Sc 1.000000 1.000000 1.000000
Of 0.000000 0.000000 0.000000
Ro 0.000000 0.000000 0.000000
$EndSHAPE3D
$EndMODULE  mors_17p
$MODULE mors_16p
Po 0 0 0 15 4B90D8E2 00000000 ~~
Li mors_16p
Cd Terminal block 16 pins
Kw DEV
Sc 00000000
AR
Op 0 0 0
T0 0 -2300 600 600 0 120 N V 21 N"MORS_16P"
T1 0 2300 600 600 0 120 N V 21 N"JP***"
DS 16000 -1800 -15900 -1800 100 21
DS -15900 1800 16000 1800 100 21
DS 16000 1400 -15900 1400 100 21
DS 16000 -1800 16000 1800 100 21
DS -15900 1800 -15900 1400 100 21
DS -15900 -1800 -15900 -1500 100 21
DS -15900 1500 -15900 -1500 100 21
$PAD
Sh "1" R 1181 1181 0 0 0
Dr 492 0 0
At STD N 00E0FFFF
Ne 0 ""
Po -15000 0
$EndPAD
$PAD
Sh "2" C 1181 1181 0 0 0
Dr 492 0 0
At STD N 00E0FFFF
Ne 0 ""
Po -13000 0
$EndPAD
$PAD
Sh "3" C 1181 1181 0 0 0
Dr 492 0 0
At STD N 00E0FFFF
Ne 0 ""
Po -11000 0
$EndPAD
$PAD
Sh "4" C 1181 1181 0 0 0
Dr 492 0 0
At STD N 00E0FFFF
Ne 0 ""
Po -9000 0
$EndPAD
$PAD
Sh "5" C 1181 1181 0 0 0
Dr 492 0 0
At STD N 00E0FFFF
Ne 0 ""
Po -7000 0
$EndPAD
$PAD
Sh "6" C 1181 1181 0 0 0
Dr 492 0 0
At STD N 00E0FFFF
Ne 0 ""
Po -5000 0
$EndPAD
$PAD
Sh "7" C 1181 1181 0 0 0
Dr 492 0 0
At STD N 00E0FFFF
Ne 0 ""
Po -3000 0
$EndPAD
$PAD
Sh "8" C 1181 1181 0 0 0
Dr 492 0 0
At STD N 00E0FFFF
Ne 0 ""
Po -1000 0
$EndPAD
$PAD
Sh "9" C 1181 1181 0 0 0
Dr 492 0 0
At STD N 00E0FFFF
Ne 0 ""
Po 1000 0
$EndPAD
$PAD
Sh "10" C 1181 1181 0 0 0
Dr 492 0 0
At STD N 00E0FFFF
Ne 0 ""
Po 3000 0
$EndPAD
$PAD
Sh "11" C 1181 1181 0 0 0
Dr 492 0 0
At STD N 00E0FFFF
Ne 0 ""
Po 5000 0
$EndPAD
$PAD
Sh "12" C 1181 1181 0 0 0
Dr 492 0 0
At STD N 00E0FFFF
Ne 0 ""
Po 7000 0
$EndPAD
$PAD
Sh "13" C 1181 1181 0 0 0
Dr 492 0 0
At STD N 00E0FFFF
Ne 0 ""
Po 9000 0
$EndPAD
$PAD
Sh "14" C 1181 1181 0 0 0
Dr 492 0 0
At STD N 00E0FFFF
Ne 0 ""
Po 11000 0
$EndPAD
$PAD
Sh "15" C 1181 1181 0 0 0
Dr 492 0 0
At STD N 00E0FFFF
Ne 0 ""
Po 13000 0
$EndPAD
$PAD
Sh "16" C 1181 1181 0 0 0
Dr 492 0 0
At STD N 00E0FFFF
Ne 0 ""
Po 15000 0
$EndPAD
$SHAPE3D
Na "walter\conn_screw\mors_16p.wrl"
Sc 1.000000 1.000000 1.000000
Of 0.000000 0.000000 0.000000
Ro 0.000000 0.000000 0.000000
$EndSHAPE3D
$EndMODULE  mors_16p
$MODULE mors_15p
Po 0 0 0 15 4B90D8F5 00000000 ~~
Li mors_15p
Cd Terminal block 15 pins
Kw DEV
Sc 00000000
AR
Op 0 0 0
T0 0 -2300 600 600 0 120 N V 21 N"MORS_15P"
T1 0 2300 600 600 0 120 N V 21 N"JP***"
DS 15000 -1800 -14900 -1800 100 21
DS -14900 1800 15000 1800 100 21
DS 15000 1400 -14900 1400 100 21
DS 15000 -1800 15000 1800 100 21
DS -14900 1800 -14900 1400 100 21
DS -14900 -1800 -14900 -1500 100 21
DS -14900 1500 -14900 -1500 100 21
$PAD
Sh "1" R 1181 1181 0 0 0
Dr 492 0 0
At STD N 00E0FFFF
Ne 0 ""
Po -14000 0
$EndPAD
$PAD
Sh "2" C 1181 1181 0 0 0
Dr 492 0 0
At STD N 00E0FFFF
Ne 0 ""
Po -12000 0
$EndPAD
$PAD
Sh "3" C 1181 1181 0 0 0
Dr 492 0 0
At STD N 00E0FFFF
Ne 0 ""
Po -10000 0
$EndPAD
$PAD
Sh "4" C 1181 1181 0 0 0
Dr 492 0 0
At STD N 00E0FFFF
Ne 0 ""
Po -8000 0
$EndPAD
$PAD
Sh "5" C 1181 1181 0 0 0
Dr 492 0 0
At STD N 00E0FFFF
Ne 0 ""
Po -6000 0
$EndPAD
$PAD
Sh "6" C 1181 1181 0 0 0
Dr 492 0 0
At STD N 00E0FFFF
Ne 0 ""
Po -4000 0
$EndPAD
$PAD
Sh "7" C 1181 1181 0 0 0
Dr 492 0 0
At STD N 00E0FFFF
Ne 0 ""
Po -2000 0
$EndPAD
$PAD
Sh "8" C 1181 1181 0 0 0
Dr 492 0 0
At STD N 00E0FFFF
Ne 0 ""
Po 0 0
$EndPAD
$PAD
Sh "9" C 1181 1181 0 0 0
Dr 492 0 0
At STD N 00E0FFFF
Ne 0 ""
Po 2000 0
$EndPAD
$PAD
Sh "10" C 1181 1181 0 0 0
Dr 492 0 0
At STD N 00E0FFFF
Ne 0 ""
Po 4000 0
$EndPAD
$PAD
Sh "11" C 1181 1181 0 0 0
Dr 492 0 0
At STD N 00E0FFFF
Ne 0 ""
Po 6000 0
$EndPAD
$PAD
Sh "12" C 1181 1181 0 0 0
Dr 492 0 0
At STD N 00E0FFFF
Ne 0 ""
Po 8000 0
$EndPAD
$PAD
Sh "13" C 1181 1181 0 0 0
Dr 492 0 0
At STD N 00E0FFFF
Ne 0 ""
Po 10000 0
$EndPAD
$PAD
Sh "14" C 1181 1181 0 0 0
Dr 492 0 0
At STD N 00E0FFFF
Ne 0 ""
Po 12000 0
$EndPAD
$PAD
Sh "15" C 1181 1181 0 0 0
Dr 492 0 0
At STD N 00E0FFFF
Ne 0 ""
Po 14000 0
$EndPAD
$SHAPE3D
Na "walter\conn_screw\mors_15p.wrl"
Sc 1.000000 1.000000 1.000000
Of 0.000000 0.000000 0.000000
Ro 0.000000 0.000000 0.000000
$EndSHAPE3D
$EndMODULE  mors_15p
$MODULE mors_14p
Po 0 0 0 15 4B90D905 00000000 ~~
Li mors_14p
Cd Terminal block 14 pins
Kw DEV
Sc 00000000
AR
Op 0 0 0
T0 0 -2300 600 600 0 120 N V 21 N"MORS_14P"
T1 0 2300 600 600 0 120 N V 21 N"JP***"
DS 14000 -1800 -13900 -1800 100 21
DS -13900 1800 14000 1800 100 21
DS 14000 1400 -13900 1400 100 21
DS 14000 -1800 14000 1800 100 21
DS -13900 1800 -13900 1400 100 21
DS -13900 -1800 -13900 -1500 100 21
DS -13900 1500 -13900 -1500 100 21
$PAD
Sh "1" R 1181 1181 0 0 0
Dr 492 0 0
At STD N 00E0FFFF
Ne 0 ""
Po -13000 0
$EndPAD
$PAD
Sh "2" C 1181 1181 0 0 0
Dr 492 0 0
At STD N 00E0FFFF
Ne 0 ""
Po -11000 0
$EndPAD
$PAD
Sh "3" C 1181 1181 0 0 0
Dr 492 0 0
At STD N 00E0FFFF
Ne 0 ""
Po -9000 0
$EndPAD
$PAD
Sh "4" C 1181 1181 0 0 0
Dr 492 0 0
At STD N 00E0FFFF
Ne 0 ""
Po -7000 0
$EndPAD
$PAD
Sh "5" C 1181 1181 0 0 0
Dr 492 0 0
At STD N 00E0FFFF
Ne 0 ""
Po -5000 0
$EndPAD
$PAD
Sh "6" C 1181 1181 0 0 0
Dr 492 0 0
At STD N 00E0FFFF
Ne 0 ""
Po -3000 0
$EndPAD
$PAD
Sh "7" C 1181 1181 0 0 0
Dr 492 0 0
At STD N 00E0FFFF
Ne 0 ""
Po -1000 0
$EndPAD
$PAD
Sh "8" C 1181 1181 0 0 0
Dr 492 0 0
At STD N 00E0FFFF
Ne 0 ""
Po 1000 0
$EndPAD
$PAD
Sh "9" C 1181 1181 0 0 0
Dr 492 0 0
At STD N 00E0FFFF
Ne 0 ""
Po 3000 0
$EndPAD
$PAD
Sh "10" C 1181 1181 0 0 0
Dr 492 0 0
At STD N 00E0FFFF
Ne 0 ""
Po 5000 0
$EndPAD
$PAD
Sh "11" C 1181 1181 0 0 0
Dr 492 0 0
At STD N 00E0FFFF
Ne 0 ""
Po 7000 0
$EndPAD
$PAD
Sh "12" C 1181 1181 0 0 0
Dr 492 0 0
At STD N 00E0FFFF
Ne 0 ""
Po 9000 0
$EndPAD
$PAD
Sh "13" C 1181 1181 0 0 0
Dr 492 0 0
At STD N 00E0FFFF
Ne 0 ""
Po 11000 0
$EndPAD
$PAD
Sh "14" C 1181 1181 0 0 0
Dr 492 0 0
At STD N 00E0FFFF
Ne 0 ""
Po 13000 0
$EndPAD
$SHAPE3D
Na "walter\conn_screw\mors_14p.wrl"
Sc 1.000000 1.000000 1.000000
Of 0.000000 0.000000 0.000000
Ro 0.000000 0.000000 0.000000
$EndSHAPE3D
$EndMODULE  mors_14p
$MODULE mors_13p
Po 0 0 0 15 4B90D920 00000000 ~~
Li mors_13p
Cd Terminal block 13 pins
Kw DEV
Sc 00000000
AR
Op 0 0 0
T0 0 -2300 600 600 0 120 N V 21 N"MORS_13P"
T1 0 2300 600 600 0 120 N V 21 N"JP***"
DS 13000 -1800 -12900 -1800 100 21
DS -12900 1800 13000 1800 100 21
DS 13000 1400 -12900 1400 100 21
DS 13000 -1800 13000 1800 100 21
DS -12900 1800 -12900 1400 100 21
DS -12900 -1800 -12900 -1500 100 21
DS -12900 1500 -12900 -1500 100 21
$PAD
Sh "1" R 1181 1181 0 0 0
Dr 492 0 0
At STD N 00E0FFFF
Ne 0 ""
Po -12000 0
$EndPAD
$PAD
Sh "2" C 1181 1181 0 0 0
Dr 492 0 0
At STD N 00E0FFFF
Ne 0 ""
Po -10000 0
$EndPAD
$PAD
Sh "3" C 1181 1181 0 0 0
Dr 492 0 0
At STD N 00E0FFFF
Ne 0 ""
Po -8000 0
$EndPAD
$PAD
Sh "4" C 1181 1181 0 0 0
Dr 492 0 0
At STD N 00E0FFFF
Ne 0 ""
Po -6000 0
$EndPAD
$PAD
Sh "5" C 1181 1181 0 0 0
Dr 492 0 0
At STD N 00E0FFFF
Ne 0 ""
Po -4000 0
$EndPAD
$PAD
Sh "6" C 1181 1181 0 0 0
Dr 492 0 0
At STD N 00E0FFFF
Ne 0 ""
Po -2000 0
$EndPAD
$PAD
Sh "7" C 1181 1181 0 0 0
Dr 492 0 0
At STD N 00E0FFFF
Ne 0 ""
Po 0 0
$EndPAD
$PAD
Sh "8" C 1181 1181 0 0 0
Dr 492 0 0
At STD N 00E0FFFF
Ne 0 ""
Po 2000 0
$EndPAD
$PAD
Sh "9" C 1181 1181 0 0 0
Dr 492 0 0
At STD N 00E0FFFF
Ne 0 ""
Po 4000 0
$EndPAD
$PAD
Sh "10" C 1181 1181 0 0 0
Dr 492 0 0
At STD N 00E0FFFF
Ne 0 ""
Po 6000 0
$EndPAD
$PAD
Sh "11" C 1181 1181 0 0 0
Dr 492 0 0
At STD N 00E0FFFF
Ne 0 ""
Po 8000 0
$EndPAD
$PAD
Sh "12" C 1181 1181 0 0 0
Dr 492 0 0
At STD N 00E0FFFF
Ne 0 ""
Po 10000 0
$EndPAD
$PAD
Sh "13" C 1181 1181 0 0 0
Dr 492 0 0
At STD N 00E0FFFF
Ne 0 ""
Po 12000 0
$EndPAD
$SHAPE3D
Na "walter\conn_screw\mors_13p.wrl"
Sc 1.000000 1.000000 1.000000
Of 0.000000 0.000000 0.000000
Ro 0.000000 0.000000 0.000000
$EndSHAPE3D
$EndMODULE  mors_13p
$MODULE mors_12p
Po 0 0 0 15 4B90D92C 00000000 ~~
Li mors_12p
Cd Terminal block 12 pins
Kw DEV
Sc 00000000
AR
Op 0 0 0
T0 0 -2300 600 600 0 120 N V 21 N"MORS_12P"
T1 0 2300 600 600 0 120 N V 21 N"JP***"
DS 12000 -1800 -11900 -1800 100 21
DS -11900 1800 12000 1800 100 21
DS 12000 1400 -11900 1400 100 21
DS 12000 -1800 12000 1800 100 21
DS -11900 1800 -11900 1400 100 21
DS -11900 -1800 -11900 -1500 100 21
DS -11900 1500 -11900 -1500 100 21
$PAD
Sh "1" R 1181 1181 0 0 0
Dr 492 0 0
At STD N 00E0FFFF
Ne 0 ""
Po -11000 0
$EndPAD
$PAD
Sh "2" C 1181 1181 0 0 0
Dr 492 0 0
At STD N 00E0FFFF
Ne 0 ""
Po -9000 0
$EndPAD
$PAD
Sh "3" C 1181 1181 0 0 0
Dr 492 0 0
At STD N 00E0FFFF
Ne 0 ""
Po -7000 0
$EndPAD
$PAD
Sh "4" C 1181 1181 0 0 0
Dr 492 0 0
At STD N 00E0FFFF
Ne 0 ""
Po -5000 0
$EndPAD
$PAD
Sh "5" C 1181 1181 0 0 0
Dr 492 0 0
At STD N 00E0FFFF
Ne 0 ""
Po -3000 0
$EndPAD
$PAD
Sh "6" C 1181 1181 0 0 0
Dr 492 0 0
At STD N 00E0FFFF
Ne 0 ""
Po -1000 0
$EndPAD
$PAD
Sh "7" C 1181 1181 0 0 0
Dr 492 0 0
At STD N 00E0FFFF
Ne 0 ""
Po 1000 0
$EndPAD
$PAD
Sh "8" C 1181 1181 0 0 0
Dr 492 0 0
At STD N 00E0FFFF
Ne 0 ""
Po 3000 0
$EndPAD
$PAD
Sh "9" C 1181 1181 0 0 0
Dr 492 0 0
At STD N 00E0FFFF
Ne 0 ""
Po 5000 0
$EndPAD
$PAD
Sh "10" C 1181 1181 0 0 0
Dr 492 0 0
At STD N 00E0FFFF
Ne 0 ""
Po 7000 0
$EndPAD
$PAD
Sh "11" C 1181 1181 0 0 0
Dr 492 0 0
At STD N 00E0FFFF
Ne 0 ""
Po 9000 0
$EndPAD
$PAD
Sh "12" C 1181 1181 0 0 0
Dr 492 0 0
At STD N 00E0FFFF
Ne 0 ""
Po 11000 0
$EndPAD
$SHAPE3D
Na "walter\conn_screw\mors_12p.wrl"
Sc 1.000000 1.000000 1.000000
Of 0.000000 0.000000 0.000000
Ro 0.000000 0.000000 0.000000
$EndSHAPE3D
$EndMODULE  mors_12p
$MODULE mors_11p
Po 0 0 0 15 4B90D93D 00000000 ~~
Li mors_11p
Cd Terminal block 11 pins
Kw DEV
Sc 00000000
AR
Op 0 0 0
T0 0 -2300 600 600 0 120 N V 21 N"MORS_11P"
T1 0 2300 600 600 0 120 N V 21 N"JP***"
DS 11000 -1800 -10900 -1800 100 21
DS -10900 1800 11000 1800 100 21
DS 11000 1400 -10900 1400 100 21
DS 11000 -1800 11000 1800 100 21
DS -10900 1800 -10900 1400 100 21
DS -10900 -1800 -10900 -1500 100 21
DS -10900 1500 -10900 -1500 100 21
$PAD
Sh "1" R 1181 1181 0 0 0
Dr 492 0 0
At STD N 00E0FFFF
Ne 0 ""
Po -10000 0
$EndPAD
$PAD
Sh "2" C 1181 1181 0 0 0
Dr 492 0 0
At STD N 00E0FFFF
Ne 0 ""
Po -8000 0
$EndPAD
$PAD
Sh "3" C 1181 1181 0 0 0
Dr 492 0 0
At STD N 00E0FFFF
Ne 0 ""
Po -6000 0
$EndPAD
$PAD
Sh "4" C 1181 1181 0 0 0
Dr 492 0 0
At STD N 00E0FFFF
Ne 0 ""
Po -4000 0
$EndPAD
$PAD
Sh "5" C 1181 1181 0 0 0
Dr 492 0 0
At STD N 00E0FFFF
Ne 0 ""
Po -2000 0
$EndPAD
$PAD
Sh "6" C 1181 1181 0 0 0
Dr 492 0 0
At STD N 00E0FFFF
Ne 0 ""
Po 0 0
$EndPAD
$PAD
Sh "7" C 1181 1181 0 0 0
Dr 492 0 0
At STD N 00E0FFFF
Ne 0 ""
Po 2000 0
$EndPAD
$PAD
Sh "8" C 1181 1181 0 0 0
Dr 492 0 0
At STD N 00E0FFFF
Ne 0 ""
Po 4000 0
$EndPAD
$PAD
Sh "9" C 1181 1181 0 0 0
Dr 492 0 0
At STD N 00E0FFFF
Ne 0 ""
Po 6000 0
$EndPAD
$PAD
Sh "10" C 1181 1181 0 0 0
Dr 492 0 0
At STD N 00E0FFFF
Ne 0 ""
Po 8000 0
$EndPAD
$PAD
Sh "11" C 1181 1181 0 0 0
Dr 492 0 0
At STD N 00E0FFFF
Ne 0 ""
Po 10000 0
$EndPAD
$SHAPE3D
Na "walter\conn_screw\mors_11p.wrl"
Sc 1.000000 1.000000 1.000000
Of 0.000000 0.000000 0.000000
Ro 0.000000 0.000000 0.000000
$EndSHAPE3D
$EndMODULE  mors_11p
$MODULE mors_10p
Po 0 0 0 15 4B90D949 00000000 ~~
Li mors_10p
Cd Terminal block 10 pins
Kw DEV
Sc 00000000
AR
Op 0 0 0
T0 0 -2300 600 600 0 120 N V 21 N"MORS_10P"
T1 0 2300 600 600 0 120 N V 21 N"JP***"
DS -9900 -1800 10000 -1800 100 21
DS -9900 1800 10000 1800 100 21
DS 10000 1400 -9900 1400 100 21
DS 10000 -1800 10000 1800 100 21
DS -9900 1800 -9900 1400 100 21
DS -9900 -1800 -9900 -1500 100 21
DS -9900 1500 -9900 -1500 100 21
$PAD
Sh "1" R 1181 1181 0 0 0
Dr 492 0 0
At STD N 00E0FFFF
Ne 0 ""
Po -9000 0
$EndPAD
$PAD
Sh "2" C 1181 1181 0 0 0
Dr 492 0 0
At STD N 00E0FFFF
Ne 0 ""
Po -7000 0
$EndPAD
$PAD
Sh "3" C 1181 1181 0 0 0
Dr 492 0 0
At STD N 00E0FFFF
Ne 0 ""
Po -5000 0
$EndPAD
$PAD
Sh "4" C 1181 1181 0 0 0
Dr 492 0 0
At STD N 00E0FFFF
Ne 0 ""
Po -3000 0
$EndPAD
$PAD
Sh "5" C 1181 1181 0 0 0
Dr 492 0 0
At STD N 00E0FFFF
Ne 0 ""
Po -1000 0
$EndPAD
$PAD
Sh "6" C 1181 1181 0 0 0
Dr 492 0 0
At STD N 00E0FFFF
Ne 0 ""
Po 1000 0
$EndPAD
$PAD
Sh "7" C 1181 1181 0 0 0
Dr 492 0 0
At STD N 00E0FFFF
Ne 0 ""
Po 3000 0
$EndPAD
$PAD
Sh "8" C 1181 1181 0 0 0
Dr 492 0 0
At STD N 00E0FFFF
Ne 0 ""
Po 5000 0
$EndPAD
$PAD
Sh "9" C 1181 1181 0 0 0
Dr 492 0 0
At STD N 00E0FFFF
Ne 0 ""
Po 7000 0
$EndPAD
$PAD
Sh "10" C 1181 1181 0 0 0
Dr 492 0 0
At STD N 00E0FFFF
Ne 0 ""
Po 9000 0
$EndPAD
$SHAPE3D
Na "walter\conn_screw\mors_10p.wrl"
Sc 1.000000 1.000000 1.000000
Of 0.000000 0.000000 0.000000
Ro 0.000000 0.000000 0.000000
$EndSHAPE3D
$EndMODULE  mors_10p
$MODULE mors_9p
Po 0 0 0 15 4B90D957 00000000 ~~
Li mors_9p
Cd Terminal block 9 pins
Kw DEV
Sc 00000000
AR
Op 0 0 0
T0 0 -2300 600 600 0 120 N V 21 N"MORS_9P"
T1 0 2300 600 600 0 120 N V 21 N"JP***"
DS -9000 1800 9000 1800 100 21
DS 9000 1400 -9000 1400 100 21
DS 9000 -1800 -9000 -1800 100 21
DS 9000 -1800 9000 1800 100 21
DS -9000 1800 -9000 1400 100 21
DS -9000 -1800 -9000 -1500 100 21
DS -9000 1500 -9000 -1500 100 21
$PAD
Sh "1" R 1181 1181 0 0 0
Dr 492 0 0
At STD N 00E0FFFF
Ne 0 ""
Po -8000 0
$EndPAD
$PAD
Sh "2" C 1181 1181 0 0 0
Dr 492 0 0
At STD N 00E0FFFF
Ne 0 ""
Po -6000 0
$EndPAD
$PAD
Sh "3" C 1181 1181 0 0 0
Dr 492 0 0
At STD N 00E0FFFF
Ne 0 ""
Po -4000 0
$EndPAD
$PAD
Sh "4" C 1181 1181 0 0 0
Dr 492 0 0
At STD N 00E0FFFF
Ne 0 ""
Po -2000 0
$EndPAD
$PAD
Sh "5" C 1181 1181 0 0 0
Dr 492 0 0
At STD N 00E0FFFF
Ne 0 ""
Po 0 0
$EndPAD
$PAD
Sh "6" C 1181 1181 0 0 0
Dr 492 0 0
At STD N 00E0FFFF
Ne 0 ""
Po 2000 0
$EndPAD
$PAD
Sh "7" C 1181 1181 0 0 0
Dr 492 0 0
At STD N 00E0FFFF
Ne 0 ""
Po 4000 0
$EndPAD
$PAD
Sh "8" C 1181 1181 0 0 0
Dr 492 0 0
At STD N 00E0FFFF
Ne 0 ""
Po 6000 0
$EndPAD
$PAD
Sh "9" C 1181 1181 0 0 0
Dr 492 0 0
At STD N 00E0FFFF
Ne 0 ""
Po 8000 0
$EndPAD
$SHAPE3D
Na "walter\conn_screw\mors_9p.wrl"
Sc 1.000000 1.000000 1.000000
Of 0.000000 0.000000 0.000000
Ro 0.000000 0.000000 0.000000
$EndSHAPE3D
$EndMODULE  mors_9p
$MODULE mors_8p
Po 0 0 0 15 4B90D960 00000000 ~~
Li mors_8p
Cd Terminal block 8 pins
Kw DEV
Sc 00000000
AR
Op 0 0 0
T0 0 -2300 600 600 0 120 N V 21 N"MORS_8P"
T1 0 2300 600 600 0 120 N V 21 N"JP***"
DS 8000 1800 7800 1800 100 21
DS 7800 1400 8000 1400 100 21
DS 7800 -1800 8000 -1800 100 21
DS -8000 -1800 7800 -1800 100 21
DS 7800 1800 -8000 1800 100 21
DS -8000 1400 7800 1400 100 21
DS 8000 -1800 8000 1800 100 21
DS -8000 1800 -8000 1400 100 21
DS -8000 -1800 -8000 -1500 100 21
DS -8000 1500 -8000 -1500 100 21
$PAD
Sh "1" R 1181 1181 0 0 0
Dr 492 0 0
At STD N 00E0FFFF
Ne 0 ""
Po -7000 0
$EndPAD
$PAD
Sh "2" C 1181 1181 0 0 0
Dr 492 0 0
At STD N 00E0FFFF
Ne 0 ""
Po -5000 0
$EndPAD
$PAD
Sh "3" C 1181 1181 0 0 0
Dr 492 0 0
At STD N 00E0FFFF
Ne 0 ""
Po -3000 0
$EndPAD
$PAD
Sh "4" C 1181 1181 0 0 0
Dr 492 0 0
At STD N 00E0FFFF
Ne 0 ""
Po -1000 0
$EndPAD
$PAD
Sh "5" C 1181 1181 0 0 0
Dr 492 0 0
At STD N 00E0FFFF
Ne 0 ""
Po 1000 0
$EndPAD
$PAD
Sh "6" C 1181 1181 0 0 0
Dr 492 0 0
At STD N 00E0FFFF
Ne 0 ""
Po 3000 0
$EndPAD
$PAD
Sh "7" C 1181 1181 0 0 0
Dr 492 0 0
At STD N 00E0FFFF
Ne 0 ""
Po 5000 0
$EndPAD
$PAD
Sh "8" C 1181 1181 0 0 0
Dr 492 0 0
At STD N 00E0FFFF
Ne 0 ""
Po 7000 0
$EndPAD
$SHAPE3D
Na "walter\conn_screw\mors_8p.wrl"
Sc 1.000000 1.000000 1.000000
Of 0.000000 0.000000 0.000000
Ro 0.000000 0.000000 0.000000
$EndSHAPE3D
$EndMODULE  mors_8p
$MODULE mors_7p
Po 0 0 0 15 4B90D96F 00000000 ~~
Li mors_7p
Cd Terminal block 7 pins
Kw DEV
Sc 00000000
AR
Op 0 0 0
T0 0 -2300 600 600 0 120 N V 21 N"MORS_7P"
T1 0 2300 600 600 0 120 N V 21 N"JP***"
DS 6800 -1800 7000 -1800 100 21
DS 6800 1800 7000 1800 100 21
DS 6800 1400 7000 1400 100 21
DS 6800 1800 -7000 1800 100 21
DS -7000 -1800 6800 -1800 100 21
DS 6800 1400 -7000 1400 100 21
DS 7000 -1800 7000 1800 100 21
DS -7000 1800 -7000 1400 100 21
DS -7000 -1800 -7000 -1500 100 21
DS -7000 1500 -7000 -1500 100 21
$PAD
Sh "1" R 1181 1181 0 0 0
Dr 492 0 0
At STD N 00E0FFFF
Ne 0 ""
Po -6000 0
$EndPAD
$PAD
Sh "2" C 1181 1181 0 0 0
Dr 492 0 0
At STD N 00E0FFFF
Ne 0 ""
Po -4000 0
$EndPAD
$PAD
Sh "3" C 1181 1181 0 0 0
Dr 492 0 0
At STD N 00E0FFFF
Ne 0 ""
Po -2000 0
$EndPAD
$PAD
Sh "4" C 1181 1181 0 0 0
Dr 492 0 0
At STD N 00E0FFFF
Ne 0 ""
Po 0 0
$EndPAD
$PAD
Sh "5" C 1181 1181 0 0 0
Dr 492 0 0
At STD N 00E0FFFF
Ne 0 ""
Po 2000 0
$EndPAD
$PAD
Sh "6" C 1181 1181 0 0 0
Dr 492 0 0
At STD N 00E0FFFF
Ne 0 ""
Po 4000 0
$EndPAD
$PAD
Sh "7" C 1181 1181 0 0 0
Dr 492 0 0
At STD N 00E0FFFF
Ne 0 ""
Po 6000 0
$EndPAD
$SHAPE3D
Na "walter\conn_screw\mors_7p.wrl"
Sc 1.000000 1.000000 1.000000
Of 0.000000 0.000000 0.000000
Ro 0.000000 0.000000 0.000000
$EndSHAPE3D
$EndMODULE  mors_7p
$MODULE mors_6p
Po 0 0 0 15 4B90D979 00000000 ~~
Li mors_6p
Cd Terminal block 6 pins
Kw DEV
Sc 00000000
AR
Op 0 0 0
T0 0 -2300 600 600 0 120 N V 21 N"MORS_6P"
T1 0 2300 600 600 0 120 N V 21 N"JP***"
DS 5800 1800 6000 1800 100 21
DS 6000 1400 5800 1400 100 21
DS 5800 -1800 6000 -1800 100 21
DS 5800 -1800 -6000 -1800 100 21
DS -6000 1800 5800 1800 100 21
DS 5800 1400 -6000 1400 100 21
DS 6000 -1800 6000 1800 100 21
DS -6000 1800 -6000 1400 100 21
DS -6000 -1800 -6000 -1500 100 21
DS -6000 1500 -6000 -1500 100 21
$PAD
Sh "1" R 1181 1181 0 0 0
Dr 492 0 0
At STD N 00E0FFFF
Ne 0 ""
Po -5000 0
$EndPAD
$PAD
Sh "2" C 1181 1181 0 0 0
Dr 492 0 0
At STD N 00E0FFFF
Ne 0 ""
Po -3000 0
$EndPAD
$PAD
Sh "3" C 1181 1181 0 0 0
Dr 492 0 0
At STD N 00E0FFFF
Ne 0 ""
Po -1000 0
$EndPAD
$PAD
Sh "4" C 1181 1181 0 0 0
Dr 492 0 0
At STD N 00E0FFFF
Ne 0 ""
Po 1000 0
$EndPAD
$PAD
Sh "5" C 1181 1181 0 0 0
Dr 492 0 0
At STD N 00E0FFFF
Ne 0 ""
Po 3000 0
$EndPAD
$PAD
Sh "6" C 1181 1181 0 0 0
Dr 492 0 0
At STD N 00E0FFFF
Ne 0 ""
Po 5000 0
$EndPAD
$SHAPE3D
Na "walter\conn_screw\mors_6p.wrl"
Sc 1.000000 1.000000 1.000000
Of 0.000000 0.000000 0.000000
Ro 0.000000 0.000000 0.000000
$EndSHAPE3D
$EndMODULE  mors_6p
$MODULE mors_5p
Po 0 0 0 15 4B90D989 00000000 ~~
Li mors_5p
Cd Terminal block 5 pins
Kw DEV
Sc 00000000
AR
Op 0 0 0
T0 0 -2300 600 600 0 120 N V 21 N"MORS_5P"
T1 0 2300 600 600 0 120 N V 21 N"JP***"
DS 5000 -1800 4900 -1800 100 21
DS 5000 1800 4900 1800 100 21
DS 5000 1400 4900 1400 100 21
DS 4900 1800 -5000 1800 100 21
DS -5000 -1800 4900 -1800 100 21
DS 4900 1400 -5000 1400 100 21
DS 5000 -1800 5000 1800 100 21
DS -5000 1800 -5000 1400 100 21
DS -5000 -1800 -5000 -1500 100 21
DS -5000 1500 -5000 -1500 100 21
$PAD
Sh "1" R 1181 1181 0 0 0
Dr 492 0 0
At STD N 00E0FFFF
Ne 0 ""
Po -4000 0
$EndPAD
$PAD
Sh "2" C 1181 1181 0 0 0
Dr 492 0 0
At STD N 00E0FFFF
Ne 0 ""
Po -2000 0
$EndPAD
$PAD
Sh "3" C 1181 1181 0 0 0
Dr 492 0 0
At STD N 00E0FFFF
Ne 0 ""
Po 0 0
$EndPAD
$PAD
Sh "4" C 1181 1181 0 0 0
Dr 492 0 0
At STD N 00E0FFFF
Ne 0 ""
Po 2000 0
$EndPAD
$PAD
Sh "5" C 1181 1181 0 0 0
Dr 492 0 0
At STD N 00E0FFFF
Ne 0 ""
Po 4000 0
$EndPAD
$SHAPE3D
Na "walter\conn_screw\mors_5p.wrl"
Sc 1.000000 1.000000 1.000000
Of 0.000000 0.000000 0.000000
Ro 0.000000 0.000000 0.000000
$EndSHAPE3D
$EndMODULE  mors_5p
$MODULE mors_4p
Po 0 0 0 15 4B90D993 00000000 ~~
Li mors_4p
Cd Terminal block 4 pins
Kw DEV
Sc 00000000
AR
Op 0 0 0
T0 0 -2300 600 600 0 120 N V 21 N"MORS_4P"
T1 0 2300 600 600 0 120 N V 21 N"JP***"
DS 4000 1800 -4000 1800 100 21
DS 4000 -1800 -4000 -1800 100 21
DS -4000 1400 4000 1400 100 21
DS 4000 -1800 4000 1800 100 21
DS -4000 1800 -4000 1400 100 21
DS -4000 -1800 -4000 -1500 100 21
DS -4000 1500 -4000 -1500 100 21
$PAD
Sh "1" R 1181 1181 0 0 0
Dr 492 0 0
At STD N 00E0FFFF
Ne 0 ""
Po -3000 0
$EndPAD
$PAD
Sh "2" C 1181 1181 0 0 0
Dr 492 0 0
At STD N 00E0FFFF
Ne 0 ""
Po -1000 0
$EndPAD
$PAD
Sh "3" C 1181 1181 0 0 0
Dr 492 0 0
At STD N 00E0FFFF
Ne 0 ""
Po 1000 0
$EndPAD
$PAD
Sh "4" C 1181 1181 0 0 0
Dr 492 0 0
At STD N 00E0FFFF
Ne 0 ""
Po 3000 0
$EndPAD
$SHAPE3D
Na "walter\conn_screw\mors_4p.wrl"
Sc 1.000000 1.000000 1.000000
Of 0.000000 0.000000 0.000000
Ro 0.000000 0.000000 0.000000
$EndSHAPE3D
$EndMODULE  mors_4p
$MODULE mors_3p
Po 0 0 0 15 4B90D9A1 00000000 ~~
Li mors_3p
Cd Terminal block 3 pins
Kw DEV
Sc 00000000
AR
Op 0 0 0
T0 0 -2300 600 600 0 120 N V 21 N"MORS_3P"
T1 0 2300 600 600 0 120 N V 21 N"JP***"
DS -3000 1800 -3000 1400 100 21
DS -3000 1400 3000 1400 100 21
DS 3000 1400 3000 1800 100 21
DS 3000 1800 -3000 1800 100 21
DS -3000 -1800 -3000 -1500 100 21
DS -3000 -1800 3000 -1800 100 21
DS 3000 -1800 3000 -1500 100 21
DS -3000 1500 -3000 -1500 100 21
DS 3000 1500 3000 -1500 100 21
$PAD
Sh "1" R 1181 1181 0 0 0
Dr 492 0 0
At STD N 00E0FFFF
Ne 0 ""
Po -2000 0
$EndPAD
$PAD
Sh "2" C 1181 1181 0 0 0
Dr 492 0 0
At STD N 00E0FFFF
Ne 0 ""
Po 0 0
$EndPAD
$PAD
Sh "3" C 1181 1181 0 0 0
Dr 492 0 0
At STD N 00E0FFFF
Ne 0 ""
Po 2000 0
$EndPAD
$SHAPE3D
Na "walter\conn_screw\mors_3p.wrl"
Sc 1.000000 1.000000 1.000000
Of 0.000000 0.000000 0.000000
Ro 0.000000 0.000000 0.000000
$EndSHAPE3D
$EndMODULE  mors_3p
$MODULE mors_2p
Po 0 0 0 15 4B90D9AA 00000000 ~~
Li mors_2p
Cd Terminal block 2 pins
Kw DEV
Sc 00000000
AR
Op 0 0 0
T0 0 -2300 600 600 0 120 N V 21 N"MORS_2P"
T1 0 2300 600 600 0 120 N V 21 N"JP***"
DS 2000 -1500 2000 -1800 100 21
DS 2000 -1800 -2000 -1800 100 21
DS -2000 -1800 -2000 -1500 100 21
DS 2000 1800 -2000 1800 100 21
DS -2000 1800 -2000 1400 100 21
DS -2000 1400 2000 1400 100 21
DS 2000 1400 2000 1800 100 21
DS 2000 1500 2000 -1500 100 21
DS -2000 -1500 -2000 1500 100 21
$PAD
Sh "1" R 1181 1181 0 0 0
Dr 492 0 0
At STD N 00E0FFFF
Ne 0 ""
Po -1000 0
$EndPAD
$PAD
Sh "2" C 1181 1181 0 0 0
Dr 492 0 0
At STD N 00E0FFFF
Ne 0 ""
Po 1000 0
$EndPAD
$SHAPE3D
Na "walter\conn_screw\mors_2p.wrl"
Sc 1.000000 1.000000 1.000000
Of 0.000000 0.000000 0.000000
Ro 0.000000 0.000000 0.000000
$EndSHAPE3D
$EndMODULE  mors_2p
$MODULE mstba_2,5/2-g-5,08
Po 0 0 0 15 4D177697 00000000 ~~
Li mstba_2,5/2-g-5,08
Cd Terminal block 2 pins, Phoenix MSTBA 2,5/2-G-5,08
Sc 00000000
AR
Op 0 0 0
T0 0 1476 600 600 0 120 N V 21 N"MSTBA 2,5/2-G-5,08"
T1 0 -1673 600 600 0 120 N V 21 N"JP***"
DS -2382 -3622 2382 -3622 100 21
DS 2382 787 -2382 787 100 21
DS -2382 787 -2382 -3937 100 21
DS 2382 -3937 -2382 -3937 100 21
DS 2382 787 2382 -3937 100 21
$PAD
Sh "1" R 1181 1181 0 0 0
Dr 551 0 0
At STD N 00E0FFFF
Ne 0 ""
Po -1000 0
$EndPAD
$PAD
Sh "2" C 1181 1181 0 0 0
Dr 551 0 0
At STD N 00E0FFFF
Ne 0 ""
Po 1000 0
$EndPAD
$SHAPE3D
Na "walter\conn_screw\mstba_2,5-2-g-5,08.wrl"
Sc 1.000000 1.000000 1.000000
Of 0.000000 0.000000 0.000000
Ro 0.000000 0.000000 0.000000
$EndSHAPE3D
$EndMODULE  mstba_2,5/2-g-5,08
$MODULE mstba_2,5/3-g-5,08
Po 0 0 0 15 4D177784 00000000 ~~
Li mstba_2,5/3-g-5,08
Cd Terminal block 2 pins, Phoenix MSTBA 2,5/3-G-5,08
Sc 00000000
AR
Op 0 0 0
T0 0 1476 600 600 0 120 N V 21 N"MSTBA 2,5/3-G-5,08"
T1 0 -1673 600 600 0 120 N V 21 N"JP***"
DS 3386 -3937 -3386 -3937 100 21
DS -3386 -3622 3386 -3622 100 21
DS -3386 787 3386 787 100 21
DS -3386 787 -3386 -3937 100 21
DS 3386 787 3386 -3937 100 21
$PAD
Sh "1" R 1181 1181 0 0 0
Dr 551 0 0
At STD N 00E0FFFF
Ne 0 ""
Po -2000 0
$EndPAD
$PAD
Sh "2" C 1181 1181 0 0 0
Dr 551 0 0
At STD N 00E0FFFF
Ne 0 ""
Po 0 0
$EndPAD
$PAD
Sh "3" C 1181 1181 0 0 0
Dr 551 0 0
At STD N 00E0FFFF
Ne 0 ""
Po 2000 0
$EndPAD
$SHAPE3D
Na "walter\conn_screw\mstba_2,5-3-g-5,08.wrl"
Sc 1.000000 1.000000 1.000000
Of 0.000000 0.000000 0.000000
Ro 0.000000 0.000000 0.000000
$EndSHAPE3D
$EndMODULE  mstba_2,5/3-g-5,08
$MODULE mstba_2,5/4-g-5,08
Po 0 0 0 15 4D177999 00000000 ~~
Li mstba_2,5/4-g-5,08
Cd Terminal block 2 pins, Phoenix MSTBA 2,5/4-G-5,08
Sc 00000000
AR
Op 0 0 0
T0 0 1476 600 600 0 120 N V 21 N"MSTBA 2,5/4-G-5,08"
T1 0 -1673 600 600 0 120 N V 21 N"JP***"
DS 4390 -3937 -4390 -3937 100 21
DS -4390 -3622 4390 -3622 100 21
DS -4390 787 4390 787 100 21
DS -4390 787 -4390 -3937 100 21
DS 4390 787 4390 -3937 100 21
$PAD
Sh "1" R 1181 1181 0 0 0
Dr 551 0 0
At STD N 00E0FFFF
Ne 0 ""
Po -3000 0
$EndPAD
$PAD
Sh "2" C 1181 1181 0 0 0
Dr 551 0 0
At STD N 00E0FFFF
Ne 0 ""
Po -1000 0
$EndPAD
$PAD
Sh "4" C 1181 1181 0 0 0
Dr 551 0 0
At STD N 00E0FFFF
Ne 0 ""
Po 3000 0
$EndPAD
$PAD
Sh "3" C 1181 1181 0 0 0
Dr 551 0 0
At STD N 00E0FFFF
Ne 0 ""
Po 1000 0
$EndPAD
$SHAPE3D
Na "walter\conn_screw\mstba_2,5-4-g-5,08.wrl"
Sc 1.000000 1.000000 1.000000
Of 0.000000 0.000000 0.000000
Ro 0.000000 0.000000 0.000000
$EndSHAPE3D
$EndMODULE  mstba_2,5/4-g-5,08
$MODULE mstba_2,5/5-g-5,08
Po 0 0 0 15 4D177DF8 00000000 ~~
Li mstba_2,5/5-g-5,08
Cd Terminal block 2 pins, Phoenix MSTBA 2,5/5-G-5,08
Sc 00000000
AR
Op 0 0 0
T0 0 1476 600 600 0 120 N V 21 N"MSTBA 2,5/5-G-5,08"
T1 0 -1673 600 600 0 120 N V 21 N"JP***"
DS -5394 787 -5394 -3937 100 21
DS 5394 -3937 5394 787 100 21
DS -5394 -3937 5394 -3937 100 21
DS 5394 -3622 -5394 -3622 100 21
DS -5394 787 5394 787 100 21
$PAD
Sh "1" R 1181 1181 0 0 0
Dr 551 0 0
At STD N 00E0FFFF
Ne 0 ""
Po -4000 0
$EndPAD
$PAD
Sh "2" C 1181 1181 0 0 0
Dr 551 0 0
At STD N 00E0FFFF
Ne 0 ""
Po -2000 0
$EndPAD
$PAD
Sh "4" C 1181 1181 0 0 0
Dr 551 0 0
At STD N 00E0FFFF
Ne 0 ""
Po 2000 0
$EndPAD
$PAD
Sh "3" C 1181 1181 0 0 0
Dr 551 0 0
At STD N 00E0FFFF
Ne 0 ""
Po 0 0
$EndPAD
$PAD
Sh "5" C 1181 1181 0 0 0
Dr 551 0 0
At STD N 00E0FFFF
Ne 0 ""
Po 4000 0
$EndPAD
$SHAPE3D
Na "walter\conn_screw\mstba_2,5-5-g-5,08.wrl"
Sc 1.000000 1.000000 1.000000
Of 0.000000 0.000000 0.000000
Ro 0.000000 0.000000 0.000000
$EndSHAPE3D
$EndMODULE  mstba_2,5/5-g-5,08
$MODULE mstba_2,5/6-g-5,08
Po 0 0 0 15 4D177EAC 00000000 ~~
Li mstba_2,5/6-g-5,08
Cd Terminal block 2 pins, Phoenix MSTBA 2,5/6-G-5,08
Sc 00000000
AR
Op 0 0 0
T0 0 1476 600 600 0 120 N V 21 N"MSTBA 2,5/6-G-5,08"
T1 0 -1673 600 600 0 120 N V 21 N"JP***"
DS -6378 787 -6378 -3937 100 21
DS 6378 -3937 6378 787 100 21
DS -6378 -3937 6378 -3937 100 21
DS 6378 -3622 -6378 -3622 100 21
DS -6378 787 6378 787 100 21
DS 6378 787 6339 787 100 21
$PAD
Sh "1" R 1181 1181 0 0 0
Dr 551 0 0
At STD N 00E0FFFF
Ne 0 ""
Po -5000 0
$EndPAD
$PAD
Sh "2" C 1181 1181 0 0 0
Dr 551 0 0
At STD N 00E0FFFF
Ne 0 ""
Po -3000 0
$EndPAD
$PAD
Sh "4" C 1181 1181 0 0 0
Dr 551 0 0
At STD N 00E0FFFF
Ne 0 ""
Po 1000 0
$EndPAD
$PAD
Sh "3" C 1181 1181 0 0 0
Dr 551 0 0
At STD N 00E0FFFF
Ne 0 ""
Po -1000 0
$EndPAD
$PAD
Sh "5" C 1181 1181 0 0 0
Dr 551 0 0
At STD N 00E0FFFF
Ne 0 ""
Po 3000 0
$EndPAD
$PAD
Sh "6" C 1181 1181 0 0 0
Dr 551 0 0
At STD N 00E0FFFF
Ne 0 ""
Po 5000 0
$EndPAD
$SHAPE3D
Na "walter\conn_screw\mstba_2,5-6-g-5,08.wrl"
Sc 1.000000 1.000000 1.000000
Of 0.000000 0.000000 0.000000
Ro 0.000000 0.000000 0.000000
$EndSHAPE3D
$EndMODULE  mstba_2,5/6-g-5,08
$MODULE mstba_2,5/7-g-5,08
Po 0 0 0 15 4D177F9F 00000000 ~~
Li mstba_2,5/7-g-5,08
Cd Terminal block 2 pins, Phoenix MSTBA 2,5/7-G-5,08
Sc 00000000
AR
Op 0 0 0
T0 0 1476 600 600 0 120 N V 21 N"MSTBA 2,5/7-G-5,08"
T1 0 -1673 600 600 0 120 N V 21 N"JP***"
DS -7402 -3937 -7402 787 100 21
DS -7402 787 7402 787 100 21
DS 7402 787 7402 -3937 100 21
DS 7402 -3622 -7402 -3622 100 21
DS -7402 -3937 7402 -3937 100 21
$PAD
Sh "1" R 1181 1181 0 0 0
Dr 551 0 0
At STD N 00E0FFFF
Ne 0 ""
Po -6000 0
$EndPAD
$PAD
Sh "2" C 1181 1181 0 0 0
Dr 551 0 0
At STD N 00E0FFFF
Ne 0 ""
Po -4000 0
$EndPAD
$PAD
Sh "4" C 1181 1181 0 0 0
Dr 551 0 0
At STD N 00E0FFFF
Ne 0 ""
Po 0 0
$EndPAD
$PAD
Sh "3" C 1181 1181 0 0 0
Dr 551 0 0
At STD N 00E0FFFF
Ne 0 ""
Po -2000 0
$EndPAD
$PAD
Sh "5" C 1181 1181 0 0 0
Dr 551 0 0
At STD N 00E0FFFF
Ne 0 ""
Po 2000 0
$EndPAD
$PAD
Sh "6" C 1181 1181 0 0 0
Dr 551 0 0
At STD N 00E0FFFF
Ne 0 ""
Po 4000 0
$EndPAD
$PAD
Sh "7" C 1181 1181 0 0 0
Dr 551 0 0
At STD N 00E0FFFF
Ne 0 ""
Po 6000 0
$EndPAD
$SHAPE3D
Na "walter\conn_screw\mstba_2,5-7-g-5,08.wrl"
Sc 1.000000 1.000000 1.000000
Of 0.000000 0.000000 0.000000
Ro 0.000000 0.000000 0.000000
$EndSHAPE3D
$EndMODULE  mstba_2,5/7-g-5,08
$MODULE mstba_2,5/8-g-5,08
Po 0 0 0 15 4D178042 00000000 ~~
Li mstba_2,5/8-g-5,08
Cd Terminal block 2 pins, Phoenix MSTBA 2,5/8-G-5,08
Sc 00000000
AR
Op 0 0 0
T0 0 1476 600 600 0 120 N V 21 N"MSTBA 2,5/8-G-5,08"
T1 0 -1673 600 600 0 120 N V 21 N"JP***"
DS -8386 -3622 8386 -3622 100 21
DS -8386 787 8386 787 100 21
DS 8386 787 8386 -3937 100 21
DS 8386 -3937 -8386 -3937 100 21
DS -8386 -3937 -8386 787 100 21
$PAD
Sh "1" R 1181 1181 0 0 0
Dr 551 0 0
At STD N 00E0FFFF
Ne 0 ""
Po -7000 0
$EndPAD
$PAD
Sh "2" C 1181 1181 0 0 0
Dr 551 0 0
At STD N 00E0FFFF
Ne 0 ""
Po -5000 0
$EndPAD
$PAD
Sh "4" C 1181 1181 0 0 0
Dr 551 0 0
At STD N 00E0FFFF
Ne 0 ""
Po -1000 0
$EndPAD
$PAD
Sh "3" C 1181 1181 0 0 0
Dr 551 0 0
At STD N 00E0FFFF
Ne 0 ""
Po -3000 0
$EndPAD
$PAD
Sh "5" C 1181 1181 0 0 0
Dr 551 0 0
At STD N 00E0FFFF
Ne 0 ""
Po 1000 0
$EndPAD
$PAD
Sh "6" C 1181 1181 0 0 0
Dr 551 0 0
At STD N 00E0FFFF
Ne 0 ""
Po 3000 0
$EndPAD
$PAD
Sh "7" C 1181 1181 0 0 0
Dr 551 0 0
At STD N 00E0FFFF
Ne 0 ""
Po 5000 0
$EndPAD
$PAD
Sh "8" C 1181 1181 0 0 0
Dr 551 0 0
At STD N 00E0FFFF
Ne 0 ""
Po 7000 0
$EndPAD
$SHAPE3D
Na "walter\conn_screw\mstba_2,5-8-g-5,08.wrl"
Sc 1.000000 1.000000 1.000000
Of 0.000000 0.000000 0.000000
Ro 0.000000 0.000000 0.000000
$EndSHAPE3D
$EndMODULE  mstba_2,5/8-g-5,08
$MODULE mstba_2,5/9-g-5,08
Po 0 0 0 15 4D17810F 00000000 ~~
Li mstba_2,5/9-g-5,08
Cd Terminal block 2 pins, Phoenix MSTBA 2,5/9-G-5,08
Sc 00000000
AR
Op 0 0 0
T0 0 1476 600 600 0 120 N V 21 N"MSTBA 2,5/9-G-5,08"
T1 0 -1673 600 600 0 120 N V 21 N"JP***"
DS -9370 -3622 9370 -3622 100 21
DS -9370 787 9370 787 100 21
DS 9370 787 9370 -3937 100 21
DS 9370 -3937 -9370 -3937 100 21
DS -9370 -3937 -9370 787 100 21
$PAD
Sh "1" R 1181 1181 0 0 0
Dr 551 0 0
At STD N 00E0FFFF
Ne 0 ""
Po -8000 0
$EndPAD
$PAD
Sh "2" C 1181 1181 0 0 0
Dr 551 0 0
At STD N 00E0FFFF
Ne 0 ""
Po -6000 0
$EndPAD
$PAD
Sh "4" C 1181 1181 0 0 0
Dr 551 0 0
At STD N 00E0FFFF
Ne 0 ""
Po -2000 0
$EndPAD
$PAD
Sh "3" C 1181 1181 0 0 0
Dr 551 0 0
At STD N 00E0FFFF
Ne 0 ""
Po -4000 0
$EndPAD
$PAD
Sh "5" C 1181 1181 0 0 0
Dr 551 0 0
At STD N 00E0FFFF
Ne 0 ""
Po 0 0
$EndPAD
$PAD
Sh "6" C 1181 1181 0 0 0
Dr 551 0 0
At STD N 00E0FFFF
Ne 0 ""
Po 2000 0
$EndPAD
$PAD
Sh "7" C 1181 1181 0 0 0
Dr 551 0 0
At STD N 00E0FFFF
Ne 0 ""
Po 4000 0
$EndPAD
$PAD
Sh "8" C 1181 1181 0 0 0
Dr 551 0 0
At STD N 00E0FFFF
Ne 0 ""
Po 6000 0
$EndPAD
$PAD
Sh "9" C 1181 1181 0 0 0
Dr 551 0 0
At STD N 00E0FFFF
Ne 0 ""
Po 8000 0
$EndPAD
$SHAPE3D
Na "walter\conn_screw\mstba_2,5-9-g-5,08.wrl"
Sc 1.000000 1.000000 1.000000
Of 0.000000 0.000000 0.000000
Ro 0.000000 0.000000 0.000000
$EndSHAPE3D
$EndMODULE  mstba_2,5/9-g-5,08
$MODULE mstba_2,5/10-g-5,08
Po 0 0 0 15 4D178204 00000000 ~~
Li mstba_2,5/10-g-5,08
Cd Terminal block 2 pins, Phoenix MSTBA 2,5/10-G-5,08
Sc 00000000
AR
Op 0 0 0
T0 0 1476 600 600 0 120 N V 21 N"MSTBA 2,5/10-G-5,08"
T1 0 -1673 600 600 0 120 N V 21 N"JP***"
DS -10394 -3622 10394 -3622 100 21
DS -10394 787 10394 787 100 21
DS 10394 787 10394 -3937 100 21
DS 10394 -3937 -10394 -3937 100 21
DS -10394 -3937 -10394 787 100 21
$PAD
Sh "1" R 1181 1181 0 0 0
Dr 551 0 0
At STD N 00E0FFFF
Ne 0 ""
Po -9000 0
$EndPAD
$PAD
Sh "2" C 1181 1181 0 0 0
Dr 551 0 0
At STD N 00E0FFFF
Ne 0 ""
Po -7000 0
$EndPAD
$PAD
Sh "4" C 1181 1181 0 0 0
Dr 551 0 0
At STD N 00E0FFFF
Ne 0 ""
Po -3000 0
$EndPAD
$PAD
Sh "3" C 1181 1181 0 0 0
Dr 551 0 0
At STD N 00E0FFFF
Ne 0 ""
Po -5000 0
$EndPAD
$PAD
Sh "5" C 1181 1181 0 0 0
Dr 551 0 0
At STD N 00E0FFFF
Ne 0 ""
Po -1000 0
$EndPAD
$PAD
Sh "6" C 1181 1181 0 0 0
Dr 551 0 0
At STD N 00E0FFFF
Ne 0 ""
Po 1000 0
$EndPAD
$PAD
Sh "7" C 1181 1181 0 0 0
Dr 551 0 0
At STD N 00E0FFFF
Ne 0 ""
Po 3000 0
$EndPAD
$PAD
Sh "8" C 1181 1181 0 0 0
Dr 551 0 0
At STD N 00E0FFFF
Ne 0 ""
Po 5000 0
$EndPAD
$PAD
Sh "9" C 1181 1181 0 0 0
Dr 551 0 0
At STD N 00E0FFFF
Ne 0 ""
Po 7000 0
$EndPAD
$PAD
Sh "10" C 1181 1181 0 0 0
Dr 551 0 0
At STD N 00E0FFFF
Ne 0 ""
Po 9000 0
$EndPAD
$SHAPE3D
Na "walter\conn_screw\mstba_2,5-10-g-5,08.wrl"
Sc 1.000000 1.000000 1.000000
Of 0.000000 0.000000 0.000000
Ro 0.000000 0.000000 0.000000
$EndSHAPE3D
$EndMODULE  mstba_2,5/10-g-5,08
$MODULE mstba_2,5/11-g-5,08
Po 0 0 0 15 4D1782DE 00000000 ~~
Li mstba_2,5/11-g-5,08
Cd Terminal block 2 pins, Phoenix MSTBA 2,5/11-G-5,08
Sc 00000000
AR
Op 0 0 0
T0 0 1476 600 600 0 120 N V 21 N"MSTBA 2,5/11-G-5,08"
T1 0 -1673 600 600 0 120 N V 21 N"JP***"
DS -11378 -3622 11378 -3622 100 21
DS -11378 787 -11378 -3937 100 21
DS -11378 -3937 11378 -3937 100 21
DS 11378 -3937 11378 787 100 21
DS 11378 787 -11378 787 100 21
$PAD
Sh "1" R 1181 1181 0 0 0
Dr 551 0 0
At STD N 00E0FFFF
Ne 0 ""
Po -10000 0
$EndPAD
$PAD
Sh "2" C 1181 1181 0 0 0
Dr 551 0 0
At STD N 00E0FFFF
Ne 0 ""
Po -8000 0
$EndPAD
$PAD
Sh "4" C 1181 1181 0 0 0
Dr 551 0 0
At STD N 00E0FFFF
Ne 0 ""
Po -4000 0
$EndPAD
$PAD
Sh "3" C 1181 1181 0 0 0
Dr 551 0 0
At STD N 00E0FFFF
Ne 0 ""
Po -6000 0
$EndPAD
$PAD
Sh "5" C 1181 1181 0 0 0
Dr 551 0 0
At STD N 00E0FFFF
Ne 0 ""
Po -2000 0
$EndPAD
$PAD
Sh "6" C 1181 1181 0 0 0
Dr 551 0 0
At STD N 00E0FFFF
Ne 0 ""
Po 0 0
$EndPAD
$PAD
Sh "7" C 1181 1181 0 0 0
Dr 551 0 0
At STD N 00E0FFFF
Ne 0 ""
Po 2000 0
$EndPAD
$PAD
Sh "8" C 1181 1181 0 0 0
Dr 551 0 0
At STD N 00E0FFFF
Ne 0 ""
Po 4000 0
$EndPAD
$PAD
Sh "9" C 1181 1181 0 0 0
Dr 551 0 0
At STD N 00E0FFFF
Ne 0 ""
Po 6000 0
$EndPAD
$PAD
Sh "10" C 1181 1181 0 0 0
Dr 551 0 0
At STD N 00E0FFFF
Ne 0 ""
Po 8000 0
$EndPAD
$PAD
Sh "11" C 1181 1181 0 0 0
Dr 551 0 0
At STD N 00E0FFFF
Ne 0 ""
Po 10000 0
$EndPAD
$SHAPE3D
Na "walter\conn_screw\mstba_2,5-11-g-5,08.wrl"
Sc 1.000000 1.000000 1.000000
Of 0.000000 0.000000 0.000000
Ro 0.000000 0.000000 0.000000
$EndSHAPE3D
$EndMODULE  mstba_2,5/11-g-5,08
$MODULE mstba_2,5/12-g-5,08
Po 0 0 0 15 4D1783CF 00000000 ~~
Li mstba_2,5/12-g-5,08
Cd Terminal block 2 pins, Phoenix MSTBA 2,5/12-G-5,08
Sc 00000000
AR 
Op 0 0 0
T0 0 1476 600 600 0 120 N V 21 N"MSTBA 2,5/12-G-5,08"
T1 0 -1673 600 600 0 120 N V 21 N"JP***"
DS -12362 -3622 12362 -3622 100 21
DS -12362 787 12362 787 100 21
DS 12362 787 12362 -3937 100 21
DS 12362 -3937 -12362 -3937 100 21
DS -12362 -3937 -12362 787 100 21
$PAD
Sh "1" R 1181 1181 0 0 0
Dr 551 0 0
At STD N 00E0FFFF
Ne 0 ""
Po -11000 0
$EndPAD
$PAD
Sh "2" C 1181 1181 0 0 0
Dr 551 0 0
At STD N 00E0FFFF
Ne 0 ""
Po -9000 0
$EndPAD
$PAD
Sh "4" C 1181 1181 0 0 0
Dr 551 0 0
At STD N 00E0FFFF
Ne 0 ""
Po -5000 0
$EndPAD
$PAD
Sh "3" C 1181 1181 0 0 0
Dr 551 0 0
At STD N 00E0FFFF
Ne 0 ""
Po -7000 0
$EndPAD
$PAD
Sh "5" C 1181 1181 0 0 0
Dr 551 0 0
At STD N 00E0FFFF
Ne 0 ""
Po -3000 0
$EndPAD
$PAD
Sh "6" C 1181 1181 0 0 0
Dr 551 0 0
At STD N 00E0FFFF
Ne 0 ""
Po -1000 0
$EndPAD
$PAD
Sh "7" C 1181 1181 0 0 0
Dr 551 0 0
At STD N 00E0FFFF
Ne 0 ""
Po 1000 0
$EndPAD
$PAD
Sh "8" C 1181 1181 0 0 0
Dr 551 0 0
At STD N 00E0FFFF
Ne 0 ""
Po 3000 0
$EndPAD
$PAD
Sh "9" C 1181 1181 0 0 0
Dr 551 0 0
At STD N 00E0FFFF
Ne 0 ""
Po 5000 0
$EndPAD
$PAD
Sh "10" C 1181 1181 0 0 0
Dr 551 0 0
At STD N 00E0FFFF
Ne 0 ""
Po 7000 0
$EndPAD
$PAD
Sh "11" C 1181 1181 0 0 0
Dr 551 0 0
At STD N 00E0FFFF
Ne 0 ""
Po 9000 0
$EndPAD
$PAD
Sh "12" C 1181 1181 0 0 0
Dr 551 0 0
At STD N 00E0FFFF
Ne 0 ""
Po 11000 0
$EndPAD
$SHAPE3D
Na "walter\conn_screw\mstba_2,5-12-g-5,08.wrl"
Sc 1.000000 1.000000 1.000000
Of 0.000000 0.000000 0.000000
Ro 0.000000 0.000000 0.000000
$EndSHAPE3D
$EndMODULE  mstba_2,5/12-g-5,08
$EndLIBRARY
