PCBNEW-LibModule-V1  ven 05 mar 2010 11:17:50 CET
$INDEX
vasch_strip_5x2
vasch_strip_7x2
vasch_strip_8x2
vasch_strip_10x2
vasch_strip_13x2
vasch_strip_17x2
vasch_strip_20x2
vasch_strip_25x2
vasch_strip_32x2
$EndINDEX
$MODULE vasch_strip_32x2
Po 0 0 0 15 4B90D9BE 00000000 ~~
Li vasch_strip_32x2
Cd Vaschetta strip 32x2pin
Kw CONN DEV
Sc 00000000
AR
Op 0 0 0
T0 0 -2150 400 400 0 80 N V 21 N"VASCH_STRIP_32x2"
T1 0 2150 400 350 0 80 N I 21 N"JP***"
DS -17500 1800 17500 1800 120 21
DS 17500 -1800 -17500 -1800 120 21
DS -17500 -1800 -17500 1800 118 21
DS 17500 -1800 17500 1800 118 21
DS 500 1800 500 1300 118 21
DS 500 1300 -500 1300 118 21
DS -500 1300 -500 1800 118 21
$PAD
Sh "1" R 600 600 0 0 0
Dr 394 0 0
At STD N 00E0FFFF
Ne 0 ""
Po -15500 500
$EndPAD
$PAD
Sh "2" C 600 600 0 0 0
Dr 394 0 0
At STD N 00E0FFFF
Ne 0 ""
Po -15500 -500
$EndPAD
$PAD
Sh "3" C 600 600 0 0 0
Dr 394 0 0
At STD N 00E0FFFF
Ne 0 ""
Po -14500 500
$EndPAD
$PAD
Sh "4" C 600 600 0 0 0
Dr 394 0 0
At STD N 00E0FFFF
Ne 0 ""
Po -14500 -500
$EndPAD
$PAD
Sh "5" C 600 600 0 0 0
Dr 394 0 0
At STD N 00E0FFFF
Ne 0 ""
Po -13500 500
$EndPAD
$PAD
Sh "6" C 600 600 0 0 0
Dr 394 0 0
At STD N 00E0FFFF
Ne 0 ""
Po -13500 -500
$EndPAD
$PAD
Sh "7" C 600 600 0 0 0
Dr 394 0 0
At STD N 00E0FFFF
Ne 0 ""
Po -12500 500
$EndPAD
$PAD
Sh "8" C 600 600 0 0 0
Dr 394 0 0
At STD N 00E0FFFF
Ne 0 ""
Po -12500 -500
$EndPAD
$PAD
Sh "9" C 600 600 0 0 0
Dr 394 0 0
At STD N 00E0FFFF
Ne 0 ""
Po -11500 500
$EndPAD
$PAD
Sh "10" C 600 600 0 0 0
Dr 394 0 0
At STD N 00E0FFFF
Ne 0 ""
Po -11500 -500
$EndPAD
$PAD
Sh "11" C 600 600 0 0 0
Dr 394 0 0
At STD N 00E0FFFF
Ne 0 ""
Po -10500 500
$EndPAD
$PAD
Sh "12" C 600 600 0 0 0
Dr 394 0 0
At STD N 00E0FFFF
Ne 0 ""
Po -10500 -500
$EndPAD
$PAD
Sh "13" C 600 600 0 0 0
Dr 394 0 0
At STD N 00E0FFFF
Ne 0 ""
Po -9500 500
$EndPAD
$PAD
Sh "14" C 600 600 0 0 0
Dr 394 0 0
At STD N 00E0FFFF
Ne 0 ""
Po -9500 -500
$EndPAD
$PAD
Sh "15" C 600 600 0 0 0
Dr 394 0 0
At STD N 00E0FFFF
Ne 0 ""
Po -8500 500
$EndPAD
$PAD
Sh "16" C 600 600 0 0 0
Dr 394 0 0
At STD N 00E0FFFF
Ne 0 ""
Po -8500 -500
$EndPAD
$PAD
Sh "17" C 600 600 0 0 0
Dr 394 0 0
At STD N 00E0FFFF
Ne 0 ""
Po -7500 500
$EndPAD
$PAD
Sh "18" C 600 600 0 0 0
Dr 394 0 0
At STD N 00E0FFFF
Ne 0 ""
Po -7500 -500
$EndPAD
$PAD
Sh "19" C 600 600 0 0 0
Dr 394 0 0
At STD N 00E0FFFF
Ne 0 ""
Po -6500 500
$EndPAD
$PAD
Sh "20" C 600 600 0 0 0
Dr 394 0 0
At STD N 00E0FFFF
Ne 0 ""
Po -6500 -500
$EndPAD
$PAD
Sh "21" C 600 600 0 0 0
Dr 394 0 0
At STD N 00E0FFFF
Ne 0 ""
Po -5500 500
$EndPAD
$PAD
Sh "22" C 600 600 0 0 0
Dr 394 0 0
At STD N 00E0FFFF
Ne 0 ""
Po -5500 -500
$EndPAD
$PAD
Sh "23" C 600 600 0 0 0
Dr 394 0 0
At STD N 00E0FFFF
Ne 0 ""
Po -4500 500
$EndPAD
$PAD
Sh "24" C 600 600 0 0 0
Dr 394 0 0
At STD N 00E0FFFF
Ne 0 ""
Po -4500 -500
$EndPAD
$PAD
Sh "25" C 600 600 0 0 0
Dr 394 0 0
At STD N 00E0FFFF
Ne 0 ""
Po -3500 500
$EndPAD
$PAD
Sh "26" C 600 600 0 0 0
Dr 394 0 0
At STD N 00E0FFFF
Ne 0 ""
Po -3500 -500
$EndPAD
$PAD
Sh "27" C 600 600 0 0 0
Dr 394 0 0
At STD N 00E0FFFF
Ne 0 ""
Po -2500 500
$EndPAD
$PAD
Sh "28" C 600 600 0 0 0
Dr 394 0 0
At STD N 00E0FFFF
Ne 0 ""
Po -2500 -500
$EndPAD
$PAD
Sh "29" C 600 600 0 0 0
Dr 394 0 0
At STD N 00E0FFFF
Ne 0 ""
Po -1500 500
$EndPAD
$PAD
Sh "30" C 600 600 0 0 0
Dr 394 0 0
At STD N 00E0FFFF
Ne 0 ""
Po -1500 -500
$EndPAD
$PAD
Sh "31" C 600 600 0 0 0
Dr 394 0 0
At STD N 00E0FFFF
Ne 0 ""
Po -500 500
$EndPAD
$PAD
Sh "32" C 600 600 0 0 0
Dr 394 0 0
At STD N 00E0FFFF
Ne 0 ""
Po -500 -500
$EndPAD
$PAD
Sh "33" C 600 600 0 0 0
Dr 394 0 0
At STD N 00E0FFFF
Ne 0 ""
Po 500 500
$EndPAD
$PAD
Sh "34" C 600 600 0 0 0
Dr 394 0 0
At STD N 00E0FFFF
Ne 0 ""
Po 500 -500
$EndPAD
$PAD
Sh "35" C 600 600 0 0 0
Dr 394 0 0
At STD N 00E0FFFF
Ne 0 ""
Po 1500 500
$EndPAD
$PAD
Sh "36" C 600 600 0 0 0
Dr 394 0 0
At STD N 00E0FFFF
Ne 0 ""
Po 1500 -500
$EndPAD
$PAD
Sh "37" C 600 600 0 0 0
Dr 394 0 0
At STD N 00E0FFFF
Ne 0 ""
Po 2500 500
$EndPAD
$PAD
Sh "38" C 600 600 0 0 0
Dr 394 0 0
At STD N 00E0FFFF
Ne 0 ""
Po 2500 -500
$EndPAD
$PAD
Sh "39" C 600 600 0 0 0
Dr 394 0 0
At STD N 00E0FFFF
Ne 0 ""
Po 3500 500
$EndPAD
$PAD
Sh "40" C 600 600 0 0 0
Dr 394 0 0
At STD N 00E0FFFF
Ne 0 ""
Po 3500 -500
$EndPAD
$PAD
Sh "41" C 600 600 0 0 0
Dr 394 0 0
At STD N 00E0FFFF
Ne 0 ""
Po 4500 500
$EndPAD
$PAD
Sh "42" C 600 600 0 0 0
Dr 394 0 0
At STD N 00E0FFFF
Ne 0 ""
Po 4500 -500
$EndPAD
$PAD
Sh "43" C 600 600 0 0 0
Dr 394 0 0
At STD N 00E0FFFF
Ne 0 ""
Po 5500 500
$EndPAD
$PAD
Sh "44" C 600 600 0 0 0
Dr 394 0 0
At STD N 00E0FFFF
Ne 0 ""
Po 5500 -500
$EndPAD
$PAD
Sh "45" C 600 600 0 0 0
Dr 394 0 0
At STD N 00E0FFFF
Ne 0 ""
Po 6500 500
$EndPAD
$PAD
Sh "46" C 600 600 0 0 0
Dr 394 0 0
At STD N 00E0FFFF
Ne 0 ""
Po 6500 -500
$EndPAD
$PAD
Sh "47" C 600 600 0 0 0
Dr 394 0 0
At STD N 00E0FFFF
Ne 0 ""
Po 7500 500
$EndPAD
$PAD
Sh "48" C 600 600 0 0 0
Dr 394 0 0
At STD N 00E0FFFF
Ne 0 ""
Po 7500 -500
$EndPAD
$PAD
Sh "49" C 600 600 0 0 0
Dr 394 0 0
At STD N 00E0FFFF
Ne 0 ""
Po 8500 500
$EndPAD
$PAD
Sh "50" C 600 600 0 0 0
Dr 394 0 0
At STD N 00E0FFFF
Ne 0 ""
Po 8500 -500
$EndPAD
$PAD
Sh "51" C 600 600 0 0 0
Dr 394 0 0
At STD N 00E0FFFF
Ne 0 ""
Po 9500 500
$EndPAD
$PAD
Sh "52" C 600 600 0 0 0
Dr 394 0 0
At STD N 00E0FFFF
Ne 0 ""
Po 9500 -500
$EndPAD
$PAD
Sh "53" C 600 600 0 0 0
Dr 394 0 0
At STD N 00E0FFFF
Ne 0 ""
Po 10500 500
$EndPAD
$PAD
Sh "54" C 600 600 0 0 0
Dr 394 0 0
At STD N 00E0FFFF
Ne 0 ""
Po 10500 -500
$EndPAD
$PAD
Sh "55" C 600 600 0 0 0
Dr 394 0 0
At STD N 00E0FFFF
Ne 0 ""
Po 11500 500
$EndPAD
$PAD
Sh "56" C 600 600 0 0 0
Dr 394 0 0
At STD N 00E0FFFF
Ne 0 ""
Po 11500 -500
$EndPAD
$PAD
Sh "57" C 600 600 0 0 0
Dr 394 0 0
At STD N 00E0FFFF
Ne 0 ""
Po 12500 500
$EndPAD
$PAD
Sh "58" C 600 600 0 0 0
Dr 394 0 0
At STD N 00E0FFFF
Ne 0 ""
Po 12500 -500
$EndPAD
$PAD
Sh "59" C 600 600 0 0 0
Dr 394 0 0
At STD N 00E0FFFF
Ne 0 ""
Po 13500 500
$EndPAD
$PAD
Sh "60" C 600 600 0 0 0
Dr 394 0 0
At STD N 00E0FFFF
Ne 0 ""
Po 13500 -500
$EndPAD
$PAD
Sh "61" C 600 600 0 0 0
Dr 394 0 0
At STD N 00E0FFFF
Ne 0 ""
Po 14500 500
$EndPAD
$PAD
Sh "62" C 600 600 0 0 0
Dr 394 0 0
At STD N 00E0FFFF
Ne 0 ""
Po 14500 -500
$EndPAD
$PAD
Sh "63" C 600 600 0 0 0
Dr 394 0 0
At STD N 00E0FFFF
Ne 0 ""
Po 15500 500
$EndPAD
$PAD
Sh "64" C 600 600 0 0 0
Dr 394 0 0
At STD N 00E0FFFF
Ne 0 ""
Po 15500 -500
$EndPAD
$SHAPE3D
Na "walter\conn_strip\vasch_strip_32x2.wrl"
Sc 1.000000 1.000000 1.000000
Of 0.000000 0.000000 0.000000
Ro 0.000000 0.000000 0.000000
$EndSHAPE3D
$EndMODULE  vasch_strip_32x2
$MODULE vasch_strip_25x2
Po 0 0 0 15 4B90D9E3 00000000 ~~
Li vasch_strip_25x2
Cd Vaschetta strip 25x2pin
Kw CONN DEV
Sc 00000000
AR
Op 0 0 0
T0 0 -2150 400 400 0 80 N V 21 N"VASCH_STRIP_25x2"
T1 0 2150 400 350 0 80 N I 21 N"JP***"
DS -14000 1800 14000 1800 120 21
DS 14000 -1800 -14000 -1800 120 21
DS -14000 -1800 -14000 1800 118 21
DS 14000 -1800 14000 1800 118 21
DS 500 1800 500 1300 118 21
DS 500 1300 -500 1300 118 21
DS -500 1300 -500 1800 118 21
$PAD
Sh "1" R 600 600 0 0 0
Dr 394 0 0
At STD N 00E0FFFF
Ne 0 ""
Po -12000 500
$EndPAD
$PAD
Sh "2" C 600 600 0 0 0
Dr 394 0 0
At STD N 00E0FFFF
Ne 0 ""
Po -12000 -500
$EndPAD
$PAD
Sh "3" C 600 600 0 0 0
Dr 394 0 0
At STD N 00E0FFFF
Ne 0 ""
Po -11000 500
$EndPAD
$PAD
Sh "4" C 600 600 0 0 0
Dr 394 0 0
At STD N 00E0FFFF
Ne 0 ""
Po -11000 -500
$EndPAD
$PAD
Sh "5" C 600 600 0 0 0
Dr 394 0 0
At STD N 00E0FFFF
Ne 0 ""
Po -10000 500
$EndPAD
$PAD
Sh "6" C 600 600 0 0 0
Dr 394 0 0
At STD N 00E0FFFF
Ne 0 ""
Po -10000 -500
$EndPAD
$PAD
Sh "7" C 600 600 0 0 0
Dr 394 0 0
At STD N 00E0FFFF
Ne 0 ""
Po -9000 500
$EndPAD
$PAD
Sh "8" C 600 600 0 0 0
Dr 394 0 0
At STD N 00E0FFFF
Ne 0 ""
Po -9000 -500
$EndPAD
$PAD
Sh "9" C 600 600 0 0 0
Dr 394 0 0
At STD N 00E0FFFF
Ne 0 ""
Po -8000 500
$EndPAD
$PAD
Sh "10" C 600 600 0 0 0
Dr 394 0 0
At STD N 00E0FFFF
Ne 0 ""
Po -8000 -500
$EndPAD
$PAD
Sh "11" C 600 600 0 0 0
Dr 394 0 0
At STD N 00E0FFFF
Ne 0 ""
Po -7000 500
$EndPAD
$PAD
Sh "12" C 600 600 0 0 0
Dr 394 0 0
At STD N 00E0FFFF
Ne 0 ""
Po -7000 -500
$EndPAD
$PAD
Sh "13" C 600 600 0 0 0
Dr 394 0 0
At STD N 00E0FFFF
Ne 0 ""
Po -6000 500
$EndPAD
$PAD
Sh "14" C 600 600 0 0 0
Dr 394 0 0
At STD N 00E0FFFF
Ne 0 ""
Po -6000 -500
$EndPAD
$PAD
Sh "15" C 600 600 0 0 0
Dr 394 0 0
At STD N 00E0FFFF
Ne 0 ""
Po -5000 500
$EndPAD
$PAD
Sh "16" C 600 600 0 0 0
Dr 394 0 0
At STD N 00E0FFFF
Ne 0 ""
Po -5000 -500
$EndPAD
$PAD
Sh "17" C 600 600 0 0 0
Dr 394 0 0
At STD N 00E0FFFF
Ne 0 ""
Po -4000 500
$EndPAD
$PAD
Sh "18" C 600 600 0 0 0
Dr 394 0 0
At STD N 00E0FFFF
Ne 0 ""
Po -4000 -500
$EndPAD
$PAD
Sh "19" C 600 600 0 0 0
Dr 394 0 0
At STD N 00E0FFFF
Ne 0 ""
Po -3000 500
$EndPAD
$PAD
Sh "20" C 600 600 0 0 0
Dr 394 0 0
At STD N 00E0FFFF
Ne 0 ""
Po -3000 -500
$EndPAD
$PAD
Sh "21" C 600 600 0 0 0
Dr 394 0 0
At STD N 00E0FFFF
Ne 0 ""
Po -2000 500
$EndPAD
$PAD
Sh "22" C 600 600 0 0 0
Dr 394 0 0
At STD N 00E0FFFF
Ne 0 ""
Po -2000 -500
$EndPAD
$PAD
Sh "23" C 600 600 0 0 0
Dr 394 0 0
At STD N 00E0FFFF
Ne 0 ""
Po -1000 500
$EndPAD
$PAD
Sh "24" C 600 600 0 0 0
Dr 394 0 0
At STD N 00E0FFFF
Ne 0 ""
Po -1000 -500
$EndPAD
$PAD
Sh "25" C 600 600 0 0 0
Dr 394 0 0
At STD N 00E0FFFF
Ne 0 ""
Po 0 500
$EndPAD
$PAD
Sh "26" C 600 600 0 0 0
Dr 394 0 0
At STD N 00E0FFFF
Ne 0 ""
Po 0 -500
$EndPAD
$PAD
Sh "27" C 600 600 0 0 0
Dr 394 0 0
At STD N 00E0FFFF
Ne 0 ""
Po 1000 500
$EndPAD
$PAD
Sh "28" C 600 600 0 0 0
Dr 394 0 0
At STD N 00E0FFFF
Ne 0 ""
Po 1000 -500
$EndPAD
$PAD
Sh "29" C 600 600 0 0 0
Dr 394 0 0
At STD N 00E0FFFF
Ne 0 ""
Po 2000 500
$EndPAD
$PAD
Sh "30" C 600 600 0 0 0
Dr 394 0 0
At STD N 00E0FFFF
Ne 0 ""
Po 2000 -500
$EndPAD
$PAD
Sh "31" C 600 600 0 0 0
Dr 394 0 0
At STD N 00E0FFFF
Ne 0 ""
Po 3000 500
$EndPAD
$PAD
Sh "32" C 600 600 0 0 0
Dr 394 0 0
At STD N 00E0FFFF
Ne 0 ""
Po 3000 -500
$EndPAD
$PAD
Sh "33" C 600 600 0 0 0
Dr 394 0 0
At STD N 00E0FFFF
Ne 0 ""
Po 4000 500
$EndPAD
$PAD
Sh "34" C 600 600 0 0 0
Dr 394 0 0
At STD N 00E0FFFF
Ne 0 ""
Po 4000 -500
$EndPAD
$PAD
Sh "35" C 600 600 0 0 0
Dr 394 0 0
At STD N 00E0FFFF
Ne 0 ""
Po 5000 500
$EndPAD
$PAD
Sh "36" C 600 600 0 0 0
Dr 394 0 0
At STD N 00E0FFFF
Ne 0 ""
Po 5000 -500
$EndPAD
$PAD
Sh "37" C 600 600 0 0 0
Dr 394 0 0
At STD N 00E0FFFF
Ne 0 ""
Po 6000 500
$EndPAD
$PAD
Sh "38" C 600 600 0 0 0
Dr 394 0 0
At STD N 00E0FFFF
Ne 0 ""
Po 6000 -500
$EndPAD
$PAD
Sh "39" C 600 600 0 0 0
Dr 394 0 0
At STD N 00E0FFFF
Ne 0 ""
Po 7000 500
$EndPAD
$PAD
Sh "40" C 600 600 0 0 0
Dr 394 0 0
At STD N 00E0FFFF
Ne 0 ""
Po 7000 -500
$EndPAD
$PAD
Sh "41" C 600 600 0 0 0
Dr 394 0 0
At STD N 00E0FFFF
Ne 0 ""
Po 8000 500
$EndPAD
$PAD
Sh "42" C 600 600 0 0 0
Dr 394 0 0
At STD N 00E0FFFF
Ne 0 ""
Po 8000 -500
$EndPAD
$PAD
Sh "43" C 600 600 0 0 0
Dr 394 0 0
At STD N 00E0FFFF
Ne 0 ""
Po 9000 500
$EndPAD
$PAD
Sh "44" C 600 600 0 0 0
Dr 394 0 0
At STD N 00E0FFFF
Ne 0 ""
Po 9000 -500
$EndPAD
$PAD
Sh "45" C 600 600 0 0 0
Dr 394 0 0
At STD N 00E0FFFF
Ne 0 ""
Po 10000 500
$EndPAD
$PAD
Sh "46" C 600 600 0 0 0
Dr 394 0 0
At STD N 00E0FFFF
Ne 0 ""
Po 10000 -500
$EndPAD
$PAD
Sh "47" C 600 600 0 0 0
Dr 394 0 0
At STD N 00E0FFFF
Ne 0 ""
Po 11000 500
$EndPAD
$PAD
Sh "48" C 600 600 0 0 0
Dr 394 0 0
At STD N 00E0FFFF
Ne 0 ""
Po 11000 -500
$EndPAD
$PAD
Sh "49" C 600 600 0 0 0
Dr 394 0 0
At STD N 00E0FFFF
Ne 0 ""
Po 12000 500
$EndPAD
$PAD
Sh "50" C 600 600 0 0 0
Dr 394 0 0
At STD N 00E0FFFF
Ne 0 ""
Po 12000 -500
$EndPAD
$SHAPE3D
Na "walter\conn_strip\vasch_strip_25x2.wrl"
Sc 1.000000 1.000000 1.000000
Of 0.000000 0.000000 0.000000
Ro 0.000000 0.000000 0.000000
$EndSHAPE3D
$EndMODULE  vasch_strip_25x2
$MODULE vasch_strip_20x2
Po 0 0 0 15 4B90D9EF 00000000 ~~
Li vasch_strip_20x2
Cd Vaschetta strip 20x2pin
Kw CONN DEV
Sc 00000000
AR
Op 0 0 0
T0 0 -2150 400 400 0 80 N V 21 N"VASCH_STRIP_20x2"
T1 0 2150 400 350 0 80 N I 21 N"JP***"
DS -11500 1800 11500 1800 120 21
DS 11500 -1800 -11500 -1800 120 21
DS -11500 -1800 -11500 1800 118 21
DS 11500 -1800 11500 1800 118 21
DS 500 1800 500 1300 118 21
DS 500 1300 -500 1300 118 21
DS -500 1300 -500 1800 118 21
$PAD
Sh "1" R 600 600 0 0 0
Dr 394 0 0
At STD N 00E0FFFF
Ne 0 ""
Po -9500 500
$EndPAD
$PAD
Sh "2" C 600 600 0 0 0
Dr 394 0 0
At STD N 00E0FFFF
Ne 0 ""
Po -9500 -500
$EndPAD
$PAD
Sh "3" C 600 600 0 0 0
Dr 394 0 0
At STD N 00E0FFFF
Ne 0 ""
Po -8500 500
$EndPAD
$PAD
Sh "4" C 600 600 0 0 0
Dr 394 0 0
At STD N 00E0FFFF
Ne 0 ""
Po -8500 -500
$EndPAD
$PAD
Sh "5" C 600 600 0 0 0
Dr 394 0 0
At STD N 00E0FFFF
Ne 0 ""
Po -7500 500
$EndPAD
$PAD
Sh "6" C 600 600 0 0 0
Dr 394 0 0
At STD N 00E0FFFF
Ne 0 ""
Po -7500 -500
$EndPAD
$PAD
Sh "7" C 600 600 0 0 0
Dr 394 0 0
At STD N 00E0FFFF
Ne 0 ""
Po -6500 500
$EndPAD
$PAD
Sh "8" C 600 600 0 0 0
Dr 394 0 0
At STD N 00E0FFFF
Ne 0 ""
Po -6500 -500
$EndPAD
$PAD
Sh "9" C 600 600 0 0 0
Dr 394 0 0
At STD N 00E0FFFF
Ne 0 ""
Po -5500 500
$EndPAD
$PAD
Sh "10" C 600 600 0 0 0
Dr 394 0 0
At STD N 00E0FFFF
Ne 0 ""
Po -5500 -500
$EndPAD
$PAD
Sh "11" C 600 600 0 0 0
Dr 394 0 0
At STD N 00E0FFFF
Ne 0 ""
Po -4500 500
$EndPAD
$PAD
Sh "12" C 600 600 0 0 0
Dr 394 0 0
At STD N 00E0FFFF
Ne 0 ""
Po -4500 -500
$EndPAD
$PAD
Sh "13" C 600 600 0 0 0
Dr 394 0 0
At STD N 00E0FFFF
Ne 0 ""
Po -3500 500
$EndPAD
$PAD
Sh "14" C 600 600 0 0 0
Dr 394 0 0
At STD N 00E0FFFF
Ne 0 ""
Po -3500 -500
$EndPAD
$PAD
Sh "15" C 600 600 0 0 0
Dr 394 0 0
At STD N 00E0FFFF
Ne 0 ""
Po -2500 500
$EndPAD
$PAD
Sh "16" C 600 600 0 0 0
Dr 394 0 0
At STD N 00E0FFFF
Ne 0 ""
Po -2500 -500
$EndPAD
$PAD
Sh "17" C 600 600 0 0 0
Dr 394 0 0
At STD N 00E0FFFF
Ne 0 ""
Po -1500 500
$EndPAD
$PAD
Sh "18" C 600 600 0 0 0
Dr 394 0 0
At STD N 00E0FFFF
Ne 0 ""
Po -1500 -500
$EndPAD
$PAD
Sh "19" C 600 600 0 0 0
Dr 394 0 0
At STD N 00E0FFFF
Ne 0 ""
Po -500 500
$EndPAD
$PAD
Sh "20" C 600 600 0 0 0
Dr 394 0 0
At STD N 00E0FFFF
Ne 0 ""
Po -500 -500
$EndPAD
$PAD
Sh "21" C 600 600 0 0 0
Dr 394 0 0
At STD N 00E0FFFF
Ne 0 ""
Po 500 500
$EndPAD
$PAD
Sh "22" C 600 600 0 0 0
Dr 394 0 0
At STD N 00E0FFFF
Ne 0 ""
Po 500 -500
$EndPAD
$PAD
Sh "23" C 600 600 0 0 0
Dr 394 0 0
At STD N 00E0FFFF
Ne 0 ""
Po 1500 500
$EndPAD
$PAD
Sh "24" C 600 600 0 0 0
Dr 394 0 0
At STD N 00E0FFFF
Ne 0 ""
Po 1500 -500
$EndPAD
$PAD
Sh "25" C 600 600 0 0 0
Dr 394 0 0
At STD N 00E0FFFF
Ne 0 ""
Po 2500 500
$EndPAD
$PAD
Sh "26" C 600 600 0 0 0
Dr 394 0 0
At STD N 00E0FFFF
Ne 0 ""
Po 2500 -500
$EndPAD
$PAD
Sh "27" C 600 600 0 0 0
Dr 394 0 0
At STD N 00E0FFFF
Ne 0 ""
Po 3500 500
$EndPAD
$PAD
Sh "28" C 600 600 0 0 0
Dr 394 0 0
At STD N 00E0FFFF
Ne 0 ""
Po 3500 -500
$EndPAD
$PAD
Sh "29" C 600 600 0 0 0
Dr 394 0 0
At STD N 00E0FFFF
Ne 0 ""
Po 4500 500
$EndPAD
$PAD
Sh "30" C 600 600 0 0 0
Dr 394 0 0
At STD N 00E0FFFF
Ne 0 ""
Po 4500 -500
$EndPAD
$PAD
Sh "31" C 600 600 0 0 0
Dr 394 0 0
At STD N 00E0FFFF
Ne 0 ""
Po 5500 500
$EndPAD
$PAD
Sh "32" C 600 600 0 0 0
Dr 394 0 0
At STD N 00E0FFFF
Ne 0 ""
Po 5500 -500
$EndPAD
$PAD
Sh "33" C 600 600 0 0 0
Dr 394 0 0
At STD N 00E0FFFF
Ne 0 ""
Po 6500 500
$EndPAD
$PAD
Sh "34" C 600 600 0 0 0
Dr 394 0 0
At STD N 00E0FFFF
Ne 0 ""
Po 6500 -500
$EndPAD
$PAD
Sh "35" C 600 600 0 0 0
Dr 394 0 0
At STD N 00E0FFFF
Ne 0 ""
Po 7500 500
$EndPAD
$PAD
Sh "36" C 600 600 0 0 0
Dr 394 0 0
At STD N 00E0FFFF
Ne 0 ""
Po 7500 -500
$EndPAD
$PAD
Sh "37" C 600 600 0 0 0
Dr 394 0 0
At STD N 00E0FFFF
Ne 0 ""
Po 8500 500
$EndPAD
$PAD
Sh "38" C 600 600 0 0 0
Dr 394 0 0
At STD N 00E0FFFF
Ne 0 ""
Po 8500 -500
$EndPAD
$PAD
Sh "39" C 600 600 0 0 0
Dr 394 0 0
At STD N 00E0FFFF
Ne 0 ""
Po 9500 500
$EndPAD
$PAD
Sh "40" C 600 600 0 0 0
Dr 394 0 0
At STD N 00E0FFFF
Ne 0 ""
Po 9500 -500
$EndPAD
$SHAPE3D
Na "walter\conn_strip\vasch_strip_20x2.wrl"
Sc 1.000000 1.000000 1.000000
Of 0.000000 0.000000 0.000000
Ro 0.000000 0.000000 0.000000
$EndSHAPE3D
$EndMODULE  vasch_strip_20x2
$MODULE vasch_strip_17x2
Po 0 0 0 15 4B90D9FE 00000000 ~~
Li vasch_strip_17x2
Cd Vaschetta strip 17x2pin
Kw CONN DEV
Sc 00000000
AR
Op 0 0 0
T0 0 -2150 400 400 0 80 N V 21 N"VASCH_STRIP_17x2"
T1 0 2150 400 350 0 80 N I 21 N"JP***"
DS 10000 1800 -10000 1800 120 21
DS -10000 -1800 10000 -1800 120 21
DS -10000 -1800 -10000 1800 118 21
DS 10000 -1800 10000 1800 118 21
DS 500 1800 500 1300 118 21
DS 500 1300 -500 1300 118 21
DS -500 1300 -500 1800 118 21
$PAD
Sh "1" R 600 600 0 0 0
Dr 394 0 0
At STD N 00E0FFFF
Ne 0 ""
Po -8000 500
$EndPAD
$PAD
Sh "2" C 600 600 0 0 0
Dr 394 0 0
At STD N 00E0FFFF
Ne 0 ""
Po -8000 -500
$EndPAD
$PAD
Sh "3" C 600 600 0 0 0
Dr 394 0 0
At STD N 00E0FFFF
Ne 0 ""
Po -7000 500
$EndPAD
$PAD
Sh "4" C 600 600 0 0 0
Dr 394 0 0
At STD N 00E0FFFF
Ne 0 ""
Po -7000 -500
$EndPAD
$PAD
Sh "5" C 600 600 0 0 0
Dr 394 0 0
At STD N 00E0FFFF
Ne 0 ""
Po -6000 500
$EndPAD
$PAD
Sh "6" C 600 600 0 0 0
Dr 394 0 0
At STD N 00E0FFFF
Ne 0 ""
Po -6000 -500
$EndPAD
$PAD
Sh "7" C 600 600 0 0 0
Dr 394 0 0
At STD N 00E0FFFF
Ne 0 ""
Po -5000 500
$EndPAD
$PAD
Sh "8" C 600 600 0 0 0
Dr 394 0 0
At STD N 00E0FFFF
Ne 0 ""
Po -5000 -500
$EndPAD
$PAD
Sh "9" C 600 600 0 0 0
Dr 394 0 0
At STD N 00E0FFFF
Ne 0 ""
Po -4000 500
$EndPAD
$PAD
Sh "10" C 600 600 0 0 0
Dr 394 0 0
At STD N 00E0FFFF
Ne 0 ""
Po -4000 -500
$EndPAD
$PAD
Sh "11" C 600 600 0 0 0
Dr 394 0 0
At STD N 00E0FFFF
Ne 0 ""
Po -3000 500
$EndPAD
$PAD
Sh "12" C 600 600 0 0 0
Dr 394 0 0
At STD N 00E0FFFF
Ne 0 ""
Po -3000 -500
$EndPAD
$PAD
Sh "13" C 600 600 0 0 0
Dr 394 0 0
At STD N 00E0FFFF
Ne 0 ""
Po -2000 500
$EndPAD
$PAD
Sh "14" C 600 600 0 0 0
Dr 394 0 0
At STD N 00E0FFFF
Ne 0 ""
Po -2000 -500
$EndPAD
$PAD
Sh "15" C 600 600 0 0 0
Dr 394 0 0
At STD N 00E0FFFF
Ne 0 ""
Po -1000 500
$EndPAD
$PAD
Sh "16" C 600 600 0 0 0
Dr 394 0 0
At STD N 00E0FFFF
Ne 0 ""
Po -1000 -500
$EndPAD
$PAD
Sh "17" C 600 600 0 0 0
Dr 394 0 0
At STD N 00E0FFFF
Ne 0 ""
Po 0 500
$EndPAD
$PAD
Sh "18" C 600 600 0 0 0
Dr 394 0 0
At STD N 00E0FFFF
Ne 0 ""
Po 0 -500
$EndPAD
$PAD
Sh "19" C 600 600 0 0 0
Dr 394 0 0
At STD N 00E0FFFF
Ne 0 ""
Po 1000 500
$EndPAD
$PAD
Sh "20" C 600 600 0 0 0
Dr 394 0 0
At STD N 00E0FFFF
Ne 0 ""
Po 1000 -500
$EndPAD
$PAD
Sh "21" C 600 600 0 0 0
Dr 394 0 0
At STD N 00E0FFFF
Ne 0 ""
Po 2000 500
$EndPAD
$PAD
Sh "22" C 600 600 0 0 0
Dr 394 0 0
At STD N 00E0FFFF
Ne 0 ""
Po 2000 -500
$EndPAD
$PAD
Sh "23" C 600 600 0 0 0
Dr 394 0 0
At STD N 00E0FFFF
Ne 0 ""
Po 3000 500
$EndPAD
$PAD
Sh "24" C 600 600 0 0 0
Dr 394 0 0
At STD N 00E0FFFF
Ne 0 ""
Po 3000 -500
$EndPAD
$PAD
Sh "25" C 600 600 0 0 0
Dr 394 0 0
At STD N 00E0FFFF
Ne 0 ""
Po 4000 500
$EndPAD
$PAD
Sh "26" C 600 600 0 0 0
Dr 394 0 0
At STD N 00E0FFFF
Ne 0 ""
Po 4000 -500
$EndPAD
$PAD
Sh "27" C 600 600 0 0 0
Dr 394 0 0
At STD N 00E0FFFF
Ne 0 ""
Po 5000 500
$EndPAD
$PAD
Sh "28" C 600 600 0 0 0
Dr 394 0 0
At STD N 00E0FFFF
Ne 0 ""
Po 5000 -500
$EndPAD
$PAD
Sh "29" C 600 600 0 0 0
Dr 394 0 0
At STD N 00E0FFFF
Ne 0 ""
Po 6000 500
$EndPAD
$PAD
Sh "30" C 600 600 0 0 0
Dr 394 0 0
At STD N 00E0FFFF
Ne 0 ""
Po 6000 -500
$EndPAD
$PAD
Sh "31" C 600 600 0 0 0
Dr 394 0 0
At STD N 00E0FFFF
Ne 0 ""
Po 7000 500
$EndPAD
$PAD
Sh "32" C 600 600 0 0 0
Dr 394 0 0
At STD N 00E0FFFF
Ne 0 ""
Po 7000 -500
$EndPAD
$PAD
Sh "33" C 600 600 0 0 0
Dr 394 0 0
At STD N 00E0FFFF
Ne 0 ""
Po 8000 500
$EndPAD
$PAD
Sh "34" C 600 600 0 0 0
Dr 394 0 0
At STD N 00E0FFFF
Ne 0 ""
Po 8000 -500
$EndPAD
$SHAPE3D
Na "walter\conn_strip\vasch_strip_17x2.wrl"
Sc 1.000000 1.000000 1.000000
Of 0.000000 0.000000 0.000000
Ro 0.000000 0.000000 0.000000
$EndSHAPE3D
$EndMODULE  vasch_strip_17x2
$MODULE vasch_strip_13x2
Po 0 0 0 15 4B90DA09 00000000 ~~
Li vasch_strip_13x2
Cd Vaschetta strip 13x2pin
Kw CONN DEV
Sc 00000000
AR
Op 0 0 0
T0 0 -2150 400 400 0 80 N V 21 N"VASCH_STRIP_13x2"
T1 0 2150 400 350 0 80 N I 21 N"JP***"
DS -8000 1800 8000 1800 120 21
DS 8000 -1800 -8000 -1800 120 21
DS -8000 -1800 -8000 1800 118 21
DS 8000 -1800 8000 1800 118 21
DS 500 1800 500 1300 118 21
DS 500 1300 -500 1300 118 21
DS -500 1300 -500 1800 118 21
$PAD
Sh "1" R 600 600 0 0 0
Dr 394 0 0
At STD N 00E0FFFF
Ne 0 ""
Po -6000 500
$EndPAD
$PAD
Sh "2" C 600 600 0 0 0
Dr 394 0 0
At STD N 00E0FFFF
Ne 0 ""
Po -6000 -500
$EndPAD
$PAD
Sh "3" C 600 600 0 0 0
Dr 394 0 0
At STD N 00E0FFFF
Ne 0 ""
Po -5000 500
$EndPAD
$PAD
Sh "4" C 600 600 0 0 0
Dr 394 0 0
At STD N 00E0FFFF
Ne 0 ""
Po -5000 -500
$EndPAD
$PAD
Sh "5" C 600 600 0 0 0
Dr 394 0 0
At STD N 00E0FFFF
Ne 0 ""
Po -4000 500
$EndPAD
$PAD
Sh "6" C 600 600 0 0 0
Dr 394 0 0
At STD N 00E0FFFF
Ne 0 ""
Po -4000 -500
$EndPAD
$PAD
Sh "7" C 600 600 0 0 0
Dr 394 0 0
At STD N 00E0FFFF
Ne 0 ""
Po -3000 500
$EndPAD
$PAD
Sh "8" C 600 600 0 0 0
Dr 394 0 0
At STD N 00E0FFFF
Ne 0 ""
Po -3000 -500
$EndPAD
$PAD
Sh "9" C 600 600 0 0 0
Dr 394 0 0
At STD N 00E0FFFF
Ne 0 ""
Po -2000 500
$EndPAD
$PAD
Sh "10" C 600 600 0 0 0
Dr 394 0 0
At STD N 00E0FFFF
Ne 0 ""
Po -2000 -500
$EndPAD
$PAD
Sh "11" C 600 600 0 0 0
Dr 394 0 0
At STD N 00E0FFFF
Ne 0 ""
Po -1000 500
$EndPAD
$PAD
Sh "12" C 600 600 0 0 0
Dr 394 0 0
At STD N 00E0FFFF
Ne 0 ""
Po -1000 -500
$EndPAD
$PAD
Sh "13" C 600 600 0 0 0
Dr 394 0 0
At STD N 00E0FFFF
Ne 0 ""
Po 0 500
$EndPAD
$PAD
Sh "14" C 600 600 0 0 0
Dr 394 0 0
At STD N 00E0FFFF
Ne 0 ""
Po 0 -500
$EndPAD
$PAD
Sh "15" C 600 600 0 0 0
Dr 394 0 0
At STD N 00E0FFFF
Ne 0 ""
Po 1000 500
$EndPAD
$PAD
Sh "16" C 600 600 0 0 0
Dr 394 0 0
At STD N 00E0FFFF
Ne 0 ""
Po 1000 -500
$EndPAD
$PAD
Sh "17" C 600 600 0 0 0
Dr 394 0 0
At STD N 00E0FFFF
Ne 0 ""
Po 2000 500
$EndPAD
$PAD
Sh "18" C 600 600 0 0 0
Dr 394 0 0
At STD N 00E0FFFF
Ne 0 ""
Po 2000 -500
$EndPAD
$PAD
Sh "19" C 600 600 0 0 0
Dr 394 0 0
At STD N 00E0FFFF
Ne 0 ""
Po 3000 500
$EndPAD
$PAD
Sh "20" C 600 600 0 0 0
Dr 394 0 0
At STD N 00E0FFFF
Ne 0 ""
Po 3000 -500
$EndPAD
$PAD
Sh "21" C 600 600 0 0 0
Dr 394 0 0
At STD N 00E0FFFF
Ne 0 ""
Po 4000 500
$EndPAD
$PAD
Sh "22" C 600 600 0 0 0
Dr 394 0 0
At STD N 00E0FFFF
Ne 0 ""
Po 4000 -500
$EndPAD
$PAD
Sh "23" C 600 600 0 0 0
Dr 394 0 0
At STD N 00E0FFFF
Ne 0 ""
Po 5000 500
$EndPAD
$PAD
Sh "24" C 600 600 0 0 0
Dr 394 0 0
At STD N 00E0FFFF
Ne 0 ""
Po 5000 -500
$EndPAD
$PAD
Sh "25" C 600 600 0 0 0
Dr 394 0 0
At STD N 00E0FFFF
Ne 0 ""
Po 6000 500
$EndPAD
$PAD
Sh "26" C 600 600 0 0 0
Dr 394 0 0
At STD N 00E0FFFF
Ne 0 ""
Po 6000 -500
$EndPAD
$SHAPE3D
Na "walter\conn_strip\vasch_strip_13x2.wrl"
Sc 1.000000 1.000000 1.000000
Of 0.000000 0.000000 0.000000
Ro 0.000000 0.000000 0.000000
$EndSHAPE3D
$EndMODULE  vasch_strip_13x2
$MODULE vasch_strip_10x2
Po 0 0 0 15 4B90DA20 00000000 ~~
Li vasch_strip_10x2
Cd Vaschetta strip 10x2pin
Kw CONN DEV
Sc 00000000
AR
Op 0 0 0
T0 0 -2150 400 400 0 80 N V 21 N"VASCH_STRIP_10x2"
T1 0 2150 400 350 0 80 N I 21 N"JP***"
DS 6500 1800 -6500 1800 120 21
DS -6500 -1800 6500 -1800 120 21
DS -6500 -1800 -6500 1800 118 21
DS 6500 -1800 6500 1800 118 21
DS 500 1800 500 1300 118 21
DS 500 1300 -500 1300 118 21
DS -500 1300 -500 1800 118 21
$PAD
Sh "1" R 600 600 0 0 0
Dr 394 0 0
At STD N 00E0FFFF
Ne 0 ""
Po -4500 500
$EndPAD
$PAD
Sh "2" C 600 600 0 0 0
Dr 394 0 0
At STD N 00E0FFFF
Ne 0 ""
Po -4500 -500
$EndPAD
$PAD
Sh "3" C 600 600 0 0 0
Dr 394 0 0
At STD N 00E0FFFF
Ne 0 ""
Po -3500 500
$EndPAD
$PAD
Sh "4" C 600 600 0 0 0
Dr 394 0 0
At STD N 00E0FFFF
Ne 0 ""
Po -3500 -500
$EndPAD
$PAD
Sh "5" C 600 600 0 0 0
Dr 394 0 0
At STD N 00E0FFFF
Ne 0 ""
Po -2500 500
$EndPAD
$PAD
Sh "6" C 600 600 0 0 0
Dr 394 0 0
At STD N 00E0FFFF
Ne 0 ""
Po -2500 -500
$EndPAD
$PAD
Sh "7" C 600 600 0 0 0
Dr 394 0 0
At STD N 00E0FFFF
Ne 0 ""
Po -1500 500
$EndPAD
$PAD
Sh "8" C 600 600 0 0 0
Dr 394 0 0
At STD N 00E0FFFF
Ne 0 ""
Po -1500 -500
$EndPAD
$PAD
Sh "9" C 600 600 0 0 0
Dr 394 0 0
At STD N 00E0FFFF
Ne 0 ""
Po -500 500
$EndPAD
$PAD
Sh "10" C 600 600 0 0 0
Dr 394 0 0
At STD N 00E0FFFF
Ne 0 ""
Po -500 -500
$EndPAD
$PAD
Sh "11" C 600 600 0 0 0
Dr 394 0 0
At STD N 00E0FFFF
Ne 0 ""
Po 500 500
$EndPAD
$PAD
Sh "12" C 600 600 0 0 0
Dr 394 0 0
At STD N 00E0FFFF
Ne 0 ""
Po 500 -500
$EndPAD
$PAD
Sh "13" C 600 600 0 0 0
Dr 394 0 0
At STD N 00E0FFFF
Ne 0 ""
Po 1500 500
$EndPAD
$PAD
Sh "14" C 600 600 0 0 0
Dr 394 0 0
At STD N 00E0FFFF
Ne 0 ""
Po 1500 -500
$EndPAD
$PAD
Sh "15" C 600 600 0 0 0
Dr 394 0 0
At STD N 00E0FFFF
Ne 0 ""
Po 2500 500
$EndPAD
$PAD
Sh "16" C 600 600 0 0 0
Dr 394 0 0
At STD N 00E0FFFF
Ne 0 ""
Po 2500 -500
$EndPAD
$PAD
Sh "17" C 600 600 0 0 0
Dr 394 0 0
At STD N 00E0FFFF
Ne 0 ""
Po 3500 500
$EndPAD
$PAD
Sh "18" C 600 600 0 0 0
Dr 394 0 0
At STD N 00E0FFFF
Ne 0 ""
Po 3500 -500
$EndPAD
$PAD
Sh "19" C 600 600 0 0 0
Dr 394 0 0
At STD N 00E0FFFF
Ne 0 ""
Po 4500 500
$EndPAD
$PAD
Sh "20" C 600 600 0 0 0
Dr 394 0 0
At STD N 00E0FFFF
Ne 0 ""
Po 4500 -500
$EndPAD
$SHAPE3D
Na "walter\conn_strip\vasch_strip_10x2.wrl"
Sc 1.000000 1.000000 1.000000
Of 0.000000 0.000000 0.000000
Ro 0.000000 0.000000 0.000000
$EndSHAPE3D
$EndMODULE  vasch_strip_10x2
$MODULE vasch_strip_8x2
Po 0 0 0 15 4B90DA2F 00000000 ~~
Li vasch_strip_8x2
Cd Vaschetta strip 8x2pin
Kw CONN DEV
Sc 00000000
AR
Op 0 0 0
T0 0 -2150 400 400 0 80 N V 21 N"VASCH_STRIP_8x2"
T1 0 2150 400 350 0 80 N I 21 N"JP***"
DS 5500 1800 -5500 1800 118 21
DS -5500 -1800 5500 -1800 118 21
DS -5500 -1800 -5500 1800 118 21
DS 5500 -1800 5500 1800 118 21
DS 500 1800 500 1300 118 21
DS 500 1300 -500 1300 118 21
DS -500 1300 -500 1800 118 21
$PAD
Sh "1" R 600 600 0 0 0
Dr 394 0 0
At STD N 00E0FFFF
Ne 0 ""
Po -3500 500
$EndPAD
$PAD
Sh "2" C 600 600 0 0 0
Dr 394 0 0
At STD N 00E0FFFF
Ne 0 ""
Po -3500 -500
$EndPAD
$PAD
Sh "3" C 600 600 0 0 0
Dr 394 0 0
At STD N 00E0FFFF
Ne 0 ""
Po -2500 500
$EndPAD
$PAD
Sh "4" C 600 600 0 0 0
Dr 394 0 0
At STD N 00E0FFFF
Ne 0 ""
Po -2500 -500
$EndPAD
$PAD
Sh "5" C 600 600 0 0 0
Dr 394 0 0
At STD N 00E0FFFF
Ne 0 ""
Po -1500 500
$EndPAD
$PAD
Sh "6" C 600 600 0 0 0
Dr 394 0 0
At STD N 00E0FFFF
Ne 0 ""
Po -1500 -500
$EndPAD
$PAD
Sh "7" C 600 600 0 0 0
Dr 394 0 0
At STD N 00E0FFFF
Ne 0 ""
Po -500 500
$EndPAD
$PAD
Sh "8" C 600 600 0 0 0
Dr 394 0 0
At STD N 00E0FFFF
Ne 0 ""
Po -500 -500
$EndPAD
$PAD
Sh "9" C 600 600 0 0 0
Dr 394 0 0
At STD N 00E0FFFF
Ne 0 ""
Po 500 500
$EndPAD
$PAD
Sh "10" C 600 600 0 0 0
Dr 394 0 0
At STD N 00E0FFFF
Ne 0 ""
Po 500 -500
$EndPAD
$PAD
Sh "11" C 600 600 0 0 0
Dr 394 0 0
At STD N 00E0FFFF
Ne 0 ""
Po 1500 500
$EndPAD
$PAD
Sh "12" C 600 600 0 0 0
Dr 394 0 0
At STD N 00E0FFFF
Ne 0 ""
Po 1500 -500
$EndPAD
$PAD
Sh "13" C 600 600 0 0 0
Dr 394 0 0
At STD N 00E0FFFF
Ne 0 ""
Po 2500 500
$EndPAD
$PAD
Sh "14" C 600 600 0 0 0
Dr 394 0 0
At STD N 00E0FFFF
Ne 0 ""
Po 2500 -500
$EndPAD
$PAD
Sh "15" C 600 600 0 0 0
Dr 394 0 0
At STD N 00E0FFFF
Ne 0 ""
Po 3500 500
$EndPAD
$PAD
Sh "16" C 600 600 0 0 0
Dr 394 0 0
At STD N 00E0FFFF
Ne 0 ""
Po 3500 -500
$EndPAD
$SHAPE3D
Na "walter\conn_strip\vasch_strip_8x2.wrl"
Sc 1.000000 1.000000 1.000000
Of 0.000000 0.000000 0.000000
Ro 0.000000 0.000000 0.000000
$EndSHAPE3D
$EndMODULE  vasch_strip_8x2
$MODULE vasch_strip_7x2
Po 0 0 0 15 4B90DA40 00000000 ~~
Li vasch_strip_7x2
Cd Vaschetta strip 7x2pin
Kw CONN DEV
Sc 00000000
AR
Op 0 0 0
T0 0 -2150 400 400 0 80 N V 21 N"VASCH_STRIP_7x2"
T1 0 2150 400 350 0 80 N I 21 N"JP***"
DS 5000 1800 -5000 1800 120 21
DS -5000 -1800 5000 -1800 120 21
DS -5000 -1800 -5000 1800 118 21
DS 5000 -1800 5000 1800 118 21
DS 500 1800 500 1300 118 21
DS 500 1300 -500 1300 118 21
DS -500 1300 -500 1800 118 21
$PAD
Sh "1" R 600 600 0 0 0
Dr 394 0 0
At STD N 00E0FFFF
Ne 0 ""
Po -3000 500
$EndPAD
$PAD
Sh "2" C 600 600 0 0 0
Dr 394 0 0
At STD N 00E0FFFF
Ne 0 ""
Po -3000 -500
$EndPAD
$PAD
Sh "3" C 600 600 0 0 0
Dr 394 0 0
At STD N 00E0FFFF
Ne 0 ""
Po -2000 500
$EndPAD
$PAD
Sh "4" C 600 600 0 0 0
Dr 394 0 0
At STD N 00E0FFFF
Ne 0 ""
Po -2000 -500
$EndPAD
$PAD
Sh "5" C 600 600 0 0 0
Dr 394 0 0
At STD N 00E0FFFF
Ne 0 ""
Po -1000 500
$EndPAD
$PAD
Sh "6" C 600 600 0 0 0
Dr 394 0 0
At STD N 00E0FFFF
Ne 0 ""
Po -1000 -500
$EndPAD
$PAD
Sh "7" C 600 600 0 0 0
Dr 394 0 0
At STD N 00E0FFFF
Ne 0 ""
Po 0 500
$EndPAD
$PAD
Sh "8" C 600 600 0 0 0
Dr 394 0 0
At STD N 00E0FFFF
Ne 0 ""
Po 0 -500
$EndPAD
$PAD
Sh "9" C 600 600 0 0 0
Dr 394 0 0
At STD N 00E0FFFF
Ne 0 ""
Po 1000 500
$EndPAD
$PAD
Sh "10" C 600 600 0 0 0
Dr 394 0 0
At STD N 00E0FFFF
Ne 0 ""
Po 1000 -500
$EndPAD
$PAD
Sh "11" C 600 600 0 0 0
Dr 394 0 0
At STD N 00E0FFFF
Ne 0 ""
Po 2000 500
$EndPAD
$PAD
Sh "12" C 600 600 0 0 0
Dr 394 0 0
At STD N 00E0FFFF
Ne 0 ""
Po 2000 -500
$EndPAD
$PAD
Sh "13" C 600 600 0 0 0
Dr 394 0 0
At STD N 00E0FFFF
Ne 0 ""
Po 3000 500
$EndPAD
$PAD
Sh "14" C 600 600 0 0 0
Dr 394 0 0
At STD N 00E0FFFF
Ne 0 ""
Po 3000 -500
$EndPAD
$SHAPE3D
Na "walter\conn_strip\vasch_strip_7x2.wrl"
Sc 1.000000 1.000000 1.000000
Of 0.000000 0.000000 0.000000
Ro 0.000000 0.000000 0.000000
$EndSHAPE3D
$EndMODULE  vasch_strip_7x2
$MODULE vasch_strip_5x2
Po 0 0 0 15 4B90DA49 00000000 ~~
Li vasch_strip_5x2
Cd Vaschetta strip 5x2pin
Kw CONN DEV
Sc 00000000
AR 
Op 0 0 0
T0 0 -2150 400 400 0 80 N V 21 N"VASCH_STRIP_5x2"
T1 0 2150 400 350 0 80 N I 21 N"JP***"
DS -4000 -1800 -4000 1800 118 21
DS 4000 -1800 -4000 -1800 118 21
DS 4000 -1800 4000 1800 118 21
DS -4000 1800 4000 1800 118 21
DS 500 1800 500 1300 118 21
DS 500 1300 -500 1300 118 21
DS -500 1300 -500 1800 118 21
$PAD
Sh "1" R 600 600 0 0 0
Dr 394 0 0
At STD N 00E0FFFF
Ne 0 ""
Po -2000 500
$EndPAD
$PAD
Sh "2" C 600 600 0 0 0
Dr 394 0 0
At STD N 00E0FFFF
Ne 0 ""
Po -2000 -500
$EndPAD
$PAD
Sh "3" C 600 600 0 0 0
Dr 394 0 0
At STD N 00E0FFFF
Ne 0 ""
Po -1000 500
$EndPAD
$PAD
Sh "4" C 600 600 0 0 0
Dr 394 0 0
At STD N 00E0FFFF
Ne 0 ""
Po -1000 -500
$EndPAD
$PAD
Sh "5" C 600 600 0 0 0
Dr 394 0 0
At STD N 00E0FFFF
Ne 0 ""
Po 0 500
$EndPAD
$PAD
Sh "6" C 600 600 0 0 0
Dr 394 0 0
At STD N 00E0FFFF
Ne 0 ""
Po 0 -500
$EndPAD
$PAD
Sh "7" C 600 600 0 0 0
Dr 394 0 0
At STD N 00E0FFFF
Ne 0 ""
Po 1000 500
$EndPAD
$PAD
Sh "8" C 600 600 0 0 0
Dr 394 0 0
At STD N 00E0FFFF
Ne 0 ""
Po 1000 -500
$EndPAD
$PAD
Sh "9" C 600 600 0 0 0
Dr 394 0 0
At STD N 00E0FFFF
Ne 0 ""
Po 2000 500
$EndPAD
$PAD
Sh "10" C 600 600 0 0 0
Dr 394 0 0
At STD N 00E0FFFF
Ne 0 ""
Po 2000 -500
$EndPAD
$SHAPE3D
Na "walter\conn_strip\vasch_strip_5x2.wrl"
Sc 1.000000 1.000000 1.000000
Of 0.000000 0.000000 0.000000
Ro 0.000000 0.000000 0.000000
$EndSHAPE3D
$EndMODULE  vasch_strip_5x2
$EndLIBRARY
