PCBNEW-LibModule-V1  lun 15 ago 2011 21:17:06 CEST
$INDEX
PLCC20
PLCC28
PLCC44
PLCC52
PLCC68
PLCC84
PLCC32
$EndINDEX
$MODULE PLCC20
Po 0 0 0 15 4E47A5EA 00000000 ~~
Li PLCC20
Sc 00000000
AR
Op 0 0 0
T0 0 -2520 394 394 0 79 N V 21 N"PLCC20"
T1 0 2598 394 394 0 79 N V 21 N"VAL**"
DC 0 1516 -59 1555 100 21
DS 1752 1299 -1752 1299 100 21
DS 1299 1752 1752 1299 100 21
DS 1752 1299 1752 -1654 100 21
DS 1752 -1654 1654 -1752 100 21
DS 1654 -1752 -1654 -1752 100 21
DS -1654 -1752 -1752 -1654 100 21
DS -1752 -1654 -1752 1654 100 21
DS -1752 1654 -1654 1752 100 21
DS -1654 1752 1299 1752 100 21
$PAD
Sh "1" O 276 1063 0 0 0
Dr 0 0 0
At SMD N 00888000
Ne 0 ""
Po 0 1693
.SolderMask 39
$EndPAD
$PAD
Sh "2" O 276 1063 0 0 0
Dr 0 0 0
At SMD N 00888000
Ne 0 ""
Po 500 1693
$EndPAD
$PAD
Sh "3" O 276 1063 0 0 0
Dr 0 0 0
At SMD N 00888000
Ne 0 ""
Po 1000 1693
$EndPAD
$PAD
Sh "4" O 1063 276 0 0 0
Dr 0 0 0
At SMD N 00888000
Ne 0 ""
Po 1693 1000
$EndPAD
$PAD
Sh "5" O 1063 276 0 0 0
Dr 0 0 0
At SMD N 00888000
Ne 0 ""
Po 1693 500
$EndPAD
$PAD
Sh "6" O 1063 276 0 0 0
Dr 0 0 0
At SMD N 00888000
Ne 0 ""
Po 1693 0
$EndPAD
$PAD
Sh "7" O 1063 276 0 0 0
Dr 0 0 0
At SMD N 00888000
Ne 0 ""
Po 1693 -500
$EndPAD
$PAD
Sh "8" O 1063 276 0 0 0
Dr 0 0 0
At SMD N 00888000
Ne 0 ""
Po 1693 -1000
$EndPAD
$PAD
Sh "9" O 276 1063 0 0 0
Dr 0 0 0
At SMD N 00888000
Ne 0 ""
Po 1000 -1693
$EndPAD
$PAD
Sh "10" O 276 1063 0 0 0
Dr 0 0 0
At SMD N 00888000
Ne 0 ""
Po 500 -1693
$EndPAD
$PAD
Sh "11" O 276 1063 0 0 0
Dr 0 0 0
At SMD N 00888000
Ne 0 ""
Po 0 -1693
$EndPAD
$PAD
Sh "12" O 276 1063 0 0 0
Dr 0 0 0
At SMD N 00888000
Ne 0 ""
Po -500 -1693
$EndPAD
$PAD
Sh "13" O 276 1063 0 0 0
Dr 0 0 0
At SMD N 00888000
Ne 0 ""
Po -1000 -1693
$EndPAD
$PAD
Sh "14" O 1063 276 0 0 0
Dr 0 0 0
At SMD N 00888000
Ne 0 ""
Po -1693 -1000
$EndPAD
$PAD
Sh "15" O 1063 276 0 0 0
Dr 0 0 0
At SMD N 00888000
Ne 0 ""
Po -1693 -500
$EndPAD
$PAD
Sh "16" O 1063 276 0 0 0
Dr 0 0 0
At SMD N 00888000
Ne 0 ""
Po -1693 0
$EndPAD
$PAD
Sh "17" O 1063 276 0 0 0
Dr 0 0 0
At SMD N 00888000
Ne 0 ""
Po -1693 500
$EndPAD
$PAD
Sh "18" O 1063 276 0 0 0
Dr 0 0 0
At SMD N 00888000
Ne 0 ""
Po -1693 1000
$EndPAD
$PAD
Sh "19" O 276 1063 0 0 0
Dr 0 0 0
At SMD N 00888000
Ne 0 ""
Po -1000 1693
$EndPAD
$PAD
Sh "20" O 276 1063 0 0 0
Dr 0 0 0
At SMD N 00888000
Ne 0 ""
Po -500 1693
$EndPAD
$SHAPE3D
Na "walter\smd_plcc\plcc20.wrl"
Sc 1.000000 1.000000 1.000000
Of 0.000000 0.000000 0.000000
Ro 0.000000 0.000000 0.000000
$EndSHAPE3D
$EndMODULE  PLCC20
$MODULE PLCC28
Po 0 0 0 15 4E47AD4E 00000000 ~~
Li PLCC28
Sc 00000000
AR
Op 0 0 0
T0 0 -3150 394 394 0 79 N V 21 N"PLCC28"
T1 0 3150 394 394 0 79 N V 21 N"VAL**"
DC 0 2028 -59 2067 100 21
DS 2264 1811 -2264 1811 100 21
DS -2264 2165 -2264 -2165 100 21
DS -2264 -2165 -2165 -2264 100 21
DS -2165 -2264 2165 -2264 100 21
DS 2165 -2264 2264 -2165 100 21
DS 2264 -2165 2264 1811 100 21
DS 2264 1811 1811 2264 100 21
DS 1811 2264 -2165 2264 100 21
DS -2165 2264 -2264 2165 100 21
$PAD
Sh "1" O 276 1063 0 0 0
Dr 0 0 0
At SMD N 00888000
Ne 0 ""
Po 0 2165
.SolderMask 39
$EndPAD
$PAD
Sh "2" O 276 1063 0 0 0
Dr 0 0 0
At SMD N 00888000
Ne 0 ""
Po 500 2165
.SolderMask 39
$EndPAD
$PAD
Sh "3" O 276 1063 0 0 0
Dr 0 0 0
At SMD N 00888000
Ne 0 ""
Po 1000 2165
.SolderMask 39
$EndPAD
$PAD
Sh "4" O 276 1063 0 0 0
Dr 0 0 0
At SMD N 00888000
Ne 0 ""
Po 1500 2165
.SolderMask 39
$EndPAD
$PAD
Sh "7" O 1063 276 0 0 0
Dr 0 0 0
At SMD N 00888000
Ne 0 ""
Po 2165 500
.SolderMask 39
$EndPAD
$PAD
Sh "8" O 1063 276 0 0 0
Dr 0 0 0
At SMD N 00888000
Ne 0 ""
Po 2165 0
.SolderMask 39
$EndPAD
$PAD
Sh "9" O 1063 276 0 0 0
Dr 0 0 0
At SMD N 00888000
Ne 0 ""
Po 2165 -500
.SolderMask 39
$EndPAD
$PAD
Sh "10" O 1063 276 0 0 0
Dr 0 0 0
At SMD N 00888000
Ne 0 ""
Po 2165 -1000
.SolderMask 39
$EndPAD
$PAD
Sh "13" O 276 1063 0 0 0
Dr 0 0 0
At SMD N 00888000
Ne 0 ""
Po 1000 -2165
.SolderMask 39
$EndPAD
$PAD
Sh "14" O 276 1063 0 0 0
Dr 0 0 0
At SMD N 00888000
Ne 0 ""
Po 500 -2165
.SolderMask 39
$EndPAD
$PAD
Sh "15" O 276 1063 0 0 0
Dr 0 0 0
At SMD N 00888000
Ne 0 ""
Po 0 -2165
.SolderMask 39
$EndPAD
$PAD
Sh "16" O 276 1063 0 0 0
Dr 0 0 0
At SMD N 00888000
Ne 0 ""
Po -500 -2165
.SolderMask 39
$EndPAD
$PAD
Sh "17" O 276 1063 0 0 0
Dr 0 0 0
At SMD N 00888000
Ne 0 ""
Po -1000 -2165
.SolderMask 39
$EndPAD
$PAD
Sh "21" O 1063 276 0 0 0
Dr 0 0 0
At SMD N 00888000
Ne 0 ""
Po -2165 -500
.SolderMask 39
$EndPAD
$PAD
Sh "22" O 1063 276 0 0 0
Dr 0 0 0
At SMD N 00888000
Ne 0 ""
Po -2165 0
.SolderMask 39
$EndPAD
$PAD
Sh "23" O 1063 276 0 0 0
Dr 0 0 0
At SMD N 00888000
Ne 0 ""
Po -2165 500
.SolderMask 39
$EndPAD
$PAD
Sh "26" O 276 1063 0 0 0
Dr 0 0 0
At SMD N 00888000
Ne 0 ""
Po -1500 2165
.SolderMask 39
$EndPAD
$PAD
Sh "27" O 276 1063 0 0 0
Dr 0 0 0
At SMD N 00888000
Ne 0 ""
Po -1000 2165
.SolderMask 39
$EndPAD
$PAD
Sh "28" O 276 1063 0 0 0
Dr 0 0 0
At SMD N 00888000
Ne 0 ""
Po -500 2165
.SolderMask 39
$EndPAD
$PAD
Sh "24" O 1063 276 0 0 0
Dr 0 0 0
At SMD N 00888000
Ne 0 ""
Po -2165 1000
$EndPAD
$PAD
Sh "20" O 1063 276 0 0 0
Dr 0 0 0
At SMD N 00888000
Ne 0 ""
Po -2165 -1000
$EndPAD
$PAD
Sh "6" O 1063 276 0 0 0
Dr 0 0 0
At SMD N 00888000
Ne 0 ""
Po 2165 1000
$EndPAD
$PAD
Sh "5" O 1063 276 0 0 0
Dr 0 0 0
At SMD N 00888000
Ne 0 ""
Po 2165 1500
$EndPAD
$PAD
Sh "25" O 1063 276 0 0 0
Dr 0 0 0
At SMD N 00888000
Ne 0 ""
Po -2165 1500
$EndPAD
$PAD
Sh "19" O 1063 276 0 0 0
Dr 0 0 0
At SMD N 00888000
Ne 0 ""
Po -2165 -1500
$EndPAD
$PAD
Sh "11" O 1063 276 0 0 0
Dr 0 0 0
At SMD N 00888000
Ne 0 ""
Po 2165 -1500
$EndPAD
$PAD
Sh "12" O 276 1063 0 0 0
Dr 0 0 0
At SMD N 00888000
Ne 0 ""
Po 1500 -2165
$EndPAD
$PAD
Sh "18" O 276 1063 0 0 0
Dr 0 0 0
At SMD N 00888000
Ne 0 ""
Po -1500 -2165
$EndPAD
$SHAPE3D
Na "walter\smd_plcc\plcc28.wrl"
Sc 1.000000 1.000000 1.000000
Of 0.000000 0.000000 0.000000
Ro 0.000000 0.000000 0.000000
$EndSHAPE3D
$EndMODULE  PLCC28
$MODULE PLCC44
Po 0 0 0 15 4E47AFC8 00000000 ~~
Li PLCC44
Sc 00000000
AR
Op 0 0 0
T0 0 -4134 394 394 0 79 N V 21 N"PLCC44"
T1 0 4134 394 394 0 79 N V 21 N"VAL**"
DC 0 3031 -59 3071 100 21
DS 3268 2815 -3268 2815 100 21
DS -3169 3268 2815 3268 100 21
DS 2815 3268 3268 2815 100 21
DS 3268 2815 3268 -3169 100 21
DS 3268 -3169 3169 -3268 100 21
DS 3169 -3268 -3169 -3268 100 21
DS -3169 -3268 -3268 -3169 100 21
DS -3268 -3169 -3268 3169 100 21
DS -3268 3169 -3169 3268 100 21
$PAD
Sh "1" O 276 1063 0 0 0
Dr 0 0 0
At SMD N 00888000
Ne 0 ""
Po 0 3189
.SolderMask 39
$EndPAD
$PAD
Sh "2" O 276 1063 0 0 0
Dr 0 0 0
At SMD N 00888000
Ne 0 ""
Po 500 3189
.SolderMask 39
$EndPAD
$PAD
Sh "3" O 276 1063 0 0 0
Dr 0 0 0
At SMD N 00888000
Ne 0 ""
Po 1000 3189
.SolderMask 39
$EndPAD
$PAD
Sh "4" O 276 1063 0 0 0
Dr 0 0 0
At SMD N 00888000
Ne 0 ""
Po 1500 3189
.SolderMask 39
$EndPAD
$PAD
Sh "7" O 1063 276 0 0 0
Dr 0 0 0
At SMD N 00888000
Ne 0 ""
Po 3189 2500
.SolderMask 39
$EndPAD
$PAD
Sh "8" O 1063 276 0 0 0
Dr 0 0 0
At SMD N 00888000
Ne 0 ""
Po 3189 2000
.SolderMask 39
$EndPAD
$PAD
Sh "9" O 1063 276 0 0 0
Dr 0 0 0
At SMD N 00888000
Ne 0 ""
Po 3189 1500
.SolderMask 39
$EndPAD
$PAD
Sh "10" O 1063 276 0 0 0
Dr 0 0 0
At SMD N 00888000
Ne 0 ""
Po 3189 1000
.SolderMask 39
$EndPAD
$PAD
Sh "13" O 1063 276 0 0 0
Dr 0 0 0
At SMD N 00888000
Ne 0 ""
Po 3189 -500
.SolderMask 39
$EndPAD
$PAD
Sh "14" O 1063 276 0 0 0
Dr 0 0 0
At SMD N 00888000
Ne 0 ""
Po 3189 -1000
.SolderMask 39
$EndPAD
$PAD
Sh "15" O 1063 276 0 0 0
Dr 0 0 0
At SMD N 00888000
Ne 0 ""
Po 3189 -1500
.SolderMask 39
$EndPAD
$PAD
Sh "16" O 1063 276 0 0 0
Dr 0 0 0
At SMD N 00888000
Ne 0 ""
Po 3189 -2000
.SolderMask 39
$EndPAD
$PAD
Sh "17" O 1063 276 0 0 0
Dr 0 0 0
At SMD N 00888000
Ne 0 ""
Po 3189 -2500
.SolderMask 39
$EndPAD
$PAD
Sh "21" O 276 1063 0 0 0
Dr 0 0 0
At SMD N 00888000
Ne 0 ""
Po 1000 -3189
.SolderMask 39
$EndPAD
$PAD
Sh "22" O 276 1063 0 0 0
Dr 0 0 0
At SMD N 00888000
Ne 0 ""
Po 500 -3189
.SolderMask 39
$EndPAD
$PAD
Sh "23" O 276 1063 0 0 0
Dr 0 0 0
At SMD N 00888000
Ne 0 ""
Po 0 -3189
.SolderMask 39
$EndPAD
$PAD
Sh "42" O 276 1063 0 0 0
Dr 0 0 0
At SMD N 00888000
Ne 0 ""
Po -1500 3189
.SolderMask 39
$EndPAD
$PAD
Sh "43" O 276 1063 0 0 0
Dr 0 0 0
At SMD N 00888000
Ne 0 ""
Po -1000 3189
.SolderMask 39
$EndPAD
$PAD
Sh "44" O 276 1063 0 0 0
Dr 0 0 0
At SMD N 00888000
Ne 0 ""
Po -500 3189
.SolderMask 39
$EndPAD
$PAD
Sh "40" O 276 1063 0 0 0
Dr 0 0 0
At SMD N 00888000
Ne 0 ""
Po -2500 3189
$EndPAD
$PAD
Sh "20" O 276 1063 0 0 0
Dr 0 0 0
At SMD N 00888000
Ne 0 ""
Po 1500 -3189
$EndPAD
$PAD
Sh "6" O 276 1063 0 0 0
Dr 0 0 0
At SMD N 00888000
Ne 0 ""
Po 2500 3189
$EndPAD
$PAD
Sh "5" O 276 1063 0 0 0
Dr 0 0 0
At SMD N 00888000
Ne 0 ""
Po 2000 3189
$EndPAD
$PAD
Sh "41" O 276 1063 0 0 0
Dr 0 0 0
At SMD N 00888000
Ne 0 ""
Po -2000 3189
$EndPAD
$PAD
Sh "19" O 276 1063 0 0 0
Dr 0 0 0
At SMD N 00888000
Ne 0 ""
Po 2000 -3189
$EndPAD
$PAD
Sh "11" O 1063 276 0 0 0
Dr 0 0 0
At SMD N 00888000
Ne 0 ""
Po 3189 500
$EndPAD
$PAD
Sh "12" O 1063 276 0 0 0
Dr 0 0 0
At SMD N 00888000
Ne 0 ""
Po 3189 0
$EndPAD
$PAD
Sh "18" O 276 1063 0 0 0
Dr 0 0 0
At SMD N 00888000
Ne 0 ""
Po 2500 -3189
$EndPAD
$PAD
Sh "24" O 276 1063 0 0 0
Dr 0 0 0
At SMD N 00888000
Ne 0 ""
Po -500 -3189
$EndPAD
$PAD
Sh "25" O 276 1063 0 0 0
Dr 0 0 0
At SMD N 00888000
Ne 0 ""
Po -1000 -3189
$EndPAD
$PAD
Sh "26" O 276 1063 0 0 0
Dr 0 0 0
At SMD N 00888000
Ne 0 ""
Po -1500 -3189
$EndPAD
$PAD
Sh "27" O 276 1063 0 0 0
Dr 0 0 0
At SMD N 00888000
Ne 0 ""
Po -2000 -3189
$EndPAD
$PAD
Sh "28" O 276 1063 0 0 0
Dr 0 0 0
At SMD N 00888000
Ne 0 ""
Po -2500 -3189
$EndPAD
$PAD
Sh "29" O 1063 276 0 0 0
Dr 0 0 0
At SMD N 00888000
Ne 0 ""
Po -3189 -2500
$EndPAD
$PAD
Sh "30" O 1063 276 0 0 0
Dr 0 0 0
At SMD N 00888000
Ne 0 ""
Po -3189 -2000
$EndPAD
$PAD
Sh "31" O 1063 276 0 0 0
Dr 0 0 0
At SMD N 00888000
Ne 0 ""
Po -3189 -1500
$EndPAD
$PAD
Sh "32" O 1063 276 0 0 0
Dr 0 0 0
At SMD N 00888000
Ne 0 ""
Po -3189 -1000
$EndPAD
$PAD
Sh "33" O 1063 276 0 0 0
Dr 0 0 0
At SMD N 00888000
Ne 0 ""
Po -3189 -500
$EndPAD
$PAD
Sh "34" O 1063 276 0 0 0
Dr 0 0 0
At SMD N 00888000
Ne 0 ""
Po -3189 0
$EndPAD
$PAD
Sh "35" O 1063 276 0 0 0
Dr 0 0 0
At SMD N 00888000
Ne 0 ""
Po -3189 500
$EndPAD
$PAD
Sh "36" O 1063 276 0 0 0
Dr 0 0 0
At SMD N 00888000
Ne 0 ""
Po -3189 1000
$EndPAD
$PAD
Sh "37" O 1063 276 0 0 0
Dr 0 0 0
At SMD N 00888000
Ne 0 ""
Po -3189 1500
$EndPAD
$PAD
Sh "38" O 1063 276 0 0 0
Dr 0 0 0
At SMD N 00888000
Ne 0 ""
Po -3189 2000
$EndPAD
$PAD
Sh "39" O 1063 276 0 0 0
Dr 0 0 0
At SMD N 00888000
Ne 0 ""
Po -3189 2500
$EndPAD
$SHAPE3D
Na "walter\smd_plcc\plcc44.wrl"
Sc 1.000000 1.000000 1.000000
Of 0.000000 0.000000 0.000000
Ro 0.000000 0.000000 0.000000
$EndSHAPE3D
$EndMODULE  PLCC44
$MODULE PLCC52
Po 0 0 0 15 4E47B206 00000000 ~~
Li PLCC52
Sc 00000000
AR
Op 0 0 0
T0 0 -4646 394 394 0 79 N V 21 N"PLCC52"
T1 0 4646 394 394 0 79 N V 21 N"VAL**"
DC 0 3524 -59 3563 100 21
DS 3760 3307 -3760 3307 100 21
DS -3661 3760 -3760 3661 100 21
DS -3760 3661 -3760 -3661 100 21
DS -3760 -3661 -3661 -3760 100 21
DS -3661 -3760 3661 -3760 100 21
DS 3661 -3760 3760 -3661 100 21
DS 3760 -3661 3760 3307 100 21
DS 3760 3307 3307 3760 100 21
DS 3307 3760 -3661 3760 100 21
$PAD
Sh "1" O 276 1063 0 0 0
Dr 0 0 0
At SMD N 00888000
Ne 0 ""
Po 0 3661
.SolderMask 39
$EndPAD
$PAD
Sh "2" O 276 1063 0 0 0
Dr 0 0 0
At SMD N 00888000
Ne 0 ""
Po 500 3661
.SolderMask 39
$EndPAD
$PAD
Sh "3" O 276 1063 0 0 0
Dr 0 0 0
At SMD N 00888000
Ne 0 ""
Po 1000 3661
.SolderMask 39
$EndPAD
$PAD
Sh "4" O 276 1063 0 0 0
Dr 0 0 0
At SMD N 00888000
Ne 0 ""
Po 1500 3661
.SolderMask 39
$EndPAD
$PAD
Sh "7" O 276 1063 0 0 0
Dr 0 0 0
At SMD N 00888000
Ne 0 ""
Po 3000 3661
.SolderMask 39
$EndPAD
$PAD
Sh "8" O 1063 276 0 0 0
Dr 0 0 0
At SMD N 00888000
Ne 0 ""
Po 3661 3000
.SolderMask 39
$EndPAD
$PAD
Sh "9" O 1063 276 0 0 0
Dr 0 0 0
At SMD N 00888000
Ne 0 ""
Po 3661 2500
.SolderMask 39
$EndPAD
$PAD
Sh "10" O 1063 276 0 0 0
Dr 0 0 0
At SMD N 00888000
Ne 0 ""
Po 3661 2000
.SolderMask 39
$EndPAD
$PAD
Sh "13" O 1063 276 0 0 0
Dr 0 0 0
At SMD N 00888000
Ne 0 ""
Po 3661 500
.SolderMask 39
$EndPAD
$PAD
Sh "14" O 1063 276 0 0 0
Dr 0 0 0
At SMD N 00888000
Ne 0 ""
Po 3661 0
.SolderMask 39
$EndPAD
$PAD
Sh "15" O 1063 276 0 0 0
Dr 0 0 0
At SMD N 00888000
Ne 0 ""
Po 3661 -500
.SolderMask 39
$EndPAD
$PAD
Sh "16" O 1063 276 0 0 0
Dr 0 0 0
At SMD N 00888000
Ne 0 ""
Po 3661 -1000
.SolderMask 39
$EndPAD
$PAD
Sh "17" O 1063 276 0 0 0
Dr 0 0 0
At SMD N 00888000
Ne 0 ""
Po 3661 -1500
.SolderMask 39
$EndPAD
$PAD
Sh "21" O 276 1063 0 0 0
Dr 0 0 0
At SMD N 00888000
Ne 0 ""
Po 3000 -3661
.SolderMask 39
$EndPAD
$PAD
Sh "22" O 276 1063 0 0 0
Dr 0 0 0
At SMD N 00888000
Ne 0 ""
Po 2500 -3661
.SolderMask 39
$EndPAD
$PAD
Sh "23" O 276 1063 0 0 0
Dr 0 0 0
At SMD N 00888000
Ne 0 ""
Po 2000 -3661
.SolderMask 39
$EndPAD
$PAD
Sh "42" O 1063 276 0 0 0
Dr 0 0 0
At SMD N 00888000
Ne 0 ""
Po -3661 1000
.SolderMask 39
$EndPAD
$PAD
Sh "43" O 1063 276 0 0 0
Dr 0 0 0
At SMD N 00888000
Ne 0 ""
Po -3661 1500
.SolderMask 39
$EndPAD
$PAD
Sh "44" O 1063 276 0 0 0
Dr 0 0 0
At SMD N 00888000
Ne 0 ""
Po -3661 2000
.SolderMask 39
$EndPAD
$PAD
Sh "40" O 1063 276 0 0 0
Dr 0 0 0
At SMD N 00888000
Ne 0 ""
Po -3661 0
$EndPAD
$PAD
Sh "20" O 1063 276 0 0 0
Dr 0 0 0
At SMD N 00888000
Ne 0 ""
Po 3661 -3000
$EndPAD
$PAD
Sh "6" O 276 1063 0 0 0
Dr 0 0 0
At SMD N 00888000
Ne 0 ""
Po 2500 3661
$EndPAD
$PAD
Sh "5" O 276 1063 0 0 0
Dr 0 0 0
At SMD N 00888000
Ne 0 ""
Po 2000 3661
$EndPAD
$PAD
Sh "41" O 1063 276 0 0 0
Dr 0 0 0
At SMD N 00888000
Ne 0 ""
Po -3661 500
$EndPAD
$PAD
Sh "19" O 1063 276 0 0 0
Dr 0 0 0
At SMD N 00888000
Ne 0 ""
Po 3661 -2500
$EndPAD
$PAD
Sh "11" O 1063 276 0 0 0
Dr 0 0 0
At SMD N 00888000
Ne 0 ""
Po 3661 1500
$EndPAD
$PAD
Sh "12" O 1063 276 0 0 0
Dr 0 0 0
At SMD N 00888000
Ne 0 ""
Po 3661 1000
$EndPAD
$PAD
Sh "18" O 1063 276 0 0 0
Dr 0 0 0
At SMD N 00888000
Ne 0 ""
Po 3661 -2000
$EndPAD
$PAD
Sh "24" O 276 1063 0 0 0
Dr 0 0 0
At SMD N 00888000
Ne 0 ""
Po 1500 -3661
$EndPAD
$PAD
Sh "25" O 276 1063 0 0 0
Dr 0 0 0
At SMD N 00888000
Ne 0 ""
Po 1000 -3661
$EndPAD
$PAD
Sh "26" O 276 1063 0 0 0
Dr 0 0 0
At SMD N 00888000
Ne 0 ""
Po 500 -3661
$EndPAD
$PAD
Sh "27" O 276 1063 0 0 0
Dr 0 0 0
At SMD N 00888000
Ne 0 ""
Po 0 -3661
$EndPAD
$PAD
Sh "28" O 276 1063 0 0 0
Dr 0 0 0
At SMD N 00888000
Ne 0 ""
Po -500 -3661
$EndPAD
$PAD
Sh "29" O 276 1063 0 0 0
Dr 0 0 0
At SMD N 00888000
Ne 0 ""
Po -1000 -3661
$EndPAD
$PAD
Sh "30" O 276 1063 0 0 0
Dr 0 0 0
At SMD N 00888000
Ne 0 ""
Po -1500 -3661
$EndPAD
$PAD
Sh "31" O 276 1063 0 0 0
Dr 0 0 0
At SMD N 00888000
Ne 0 ""
Po -2000 -3661
$EndPAD
$PAD
Sh "32" O 276 1063 0 0 0
Dr 0 0 0
At SMD N 00888000
Ne 0 ""
Po -2500 -3661
$EndPAD
$PAD
Sh "33" O 276 1063 0 0 0
Dr 0 0 0
At SMD N 00888000
Ne 0 ""
Po -3000 -3661
$EndPAD
$PAD
Sh "34" O 1063 276 0 0 0
Dr 0 0 0
At SMD N 00888000
Ne 0 ""
Po -3661 -3000
$EndPAD
$PAD
Sh "35" O 1063 276 0 0 0
Dr 0 0 0
At SMD N 00888000
Ne 0 ""
Po -3661 -2500
$EndPAD
$PAD
Sh "36" O 1063 276 0 0 0
Dr 0 0 0
At SMD N 00888000
Ne 0 ""
Po -3661 -2000
$EndPAD
$PAD
Sh "37" O 1063 276 0 0 0
Dr 0 0 0
At SMD N 00888000
Ne 0 ""
Po -3661 -1500
$EndPAD
$PAD
Sh "38" O 1063 276 0 0 0
Dr 0 0 0
At SMD N 00888000
Ne 0 ""
Po -3661 -1000
$EndPAD
$PAD
Sh "39" O 1063 276 0 0 0
Dr 0 0 0
At SMD N 00888000
Ne 0 ""
Po -3661 -500
$EndPAD
$PAD
Sh "45" O 1063 276 0 0 0
Dr 0 0 0
At SMD N 00888000
Ne 0 ""
Po -3661 2500
$EndPAD
$PAD
Sh "46" O 1063 276 0 0 0
Dr 0 0 0
At SMD N 00888000
Ne 0 ""
Po -3661 3000
$EndPAD
$PAD
Sh "47" O 276 1063 0 0 0
Dr 0 0 0
At SMD N 00888000
Ne 0 ""
Po -3000 3661
$EndPAD
$PAD
Sh "48" O 276 1063 0 0 0
Dr 0 0 0
At SMD N 00888000
Ne 0 ""
Po -2500 3661
$EndPAD
$PAD
Sh "49" O 276 1063 0 0 0
Dr 0 0 0
At SMD N 00888000
Ne 0 ""
Po -2000 3661
$EndPAD
$PAD
Sh "50" O 276 1063 0 0 0
Dr 0 0 0
At SMD N 00888000
Ne 0 ""
Po -1500 3661
$EndPAD
$PAD
Sh "51" O 276 1063 0 0 0
Dr 0 0 0
At SMD N 00888000
Ne 0 ""
Po -1000 3661
$EndPAD
$PAD
Sh "52" O 276 1063 0 0 0
Dr 0 0 0
At SMD N 00888000
Ne 0 ""
Po -500 3661
$EndPAD
$SHAPE3D
Na "walter\smd_plcc\plcc52.wrl"
Sc 1.000000 1.000000 1.000000
Of 0.000000 0.000000 0.000000
Ro 0.000000 0.000000 0.000000
$EndSHAPE3D
$EndMODULE  PLCC52
$MODULE PLCC68
Po 0 0 0 15 4E47B4CC 00000000 ~~
Li PLCC68
Sc 00000000
AR
Op 0 0 0
T0 0 -5630 394 394 0 79 N V 21 N"PLCC68"
T1 0 5630 394 394 0 79 N V 21 N"VAL**"
DC 0 4508 -79 4528 100 21
DS 4764 4291 -4764 4291 100 21
DS -4665 4764 -4764 4665 100 21
DS -4764 4665 -4764 -4665 100 21
DS -4764 -4665 -4665 -4764 100 21
DS -4665 -4764 4665 -4764 100 21
DS 4665 -4764 4764 -4665 100 21
DS 4764 -4665 4764 4311 100 21
DS 4764 4311 4311 4764 100 21
DS 4311 4764 -4665 4764 100 21
$PAD
Sh "1" O 276 1063 0 0 0
Dr 0 0 0
At SMD N 00888000
Ne 0 ""
Po 0 4685
.SolderMask 39
$EndPAD
$PAD
Sh "2" O 276 1063 0 0 0
Dr 0 0 0
At SMD N 00888000
Ne 0 ""
Po 500 4685
.SolderMask 39
$EndPAD
$PAD
Sh "3" O 276 1063 0 0 0
Dr 0 0 0
At SMD N 00888000
Ne 0 ""
Po 1000 4685
.SolderMask 39
$EndPAD
$PAD
Sh "4" O 276 1063 0 0 0
Dr 0 0 0
At SMD N 00888000
Ne 0 ""
Po 1500 4685
.SolderMask 39
$EndPAD
$PAD
Sh "7" O 276 1063 0 0 0
Dr 0 0 0
At SMD N 00888000
Ne 0 ""
Po 3000 4685
.SolderMask 39
$EndPAD
$PAD
Sh "8" O 276 1063 0 0 0
Dr 0 0 0
At SMD N 00888000
Ne 0 ""
Po 3500 4685
.SolderMask 39
$EndPAD
$PAD
Sh "9" O 276 1063 0 0 0
Dr 0 0 0
At SMD N 00888000
Ne 0 ""
Po 4000 4685
.SolderMask 39
$EndPAD
$PAD
Sh "10" O 1063 276 0 0 0
Dr 0 0 0
At SMD N 00888000
Ne 0 ""
Po 4685 4000
.SolderMask 39
$EndPAD
$PAD
Sh "13" O 1063 276 0 0 0
Dr 0 0 0
At SMD N 00888000
Ne 0 ""
Po 4685 2500
.SolderMask 39
$EndPAD
$PAD
Sh "14" O 1063 276 0 0 0
Dr 0 0 0
At SMD N 00888000
Ne 0 ""
Po 4685 2000
.SolderMask 39
$EndPAD
$PAD
Sh "15" O 1063 276 0 0 0
Dr 0 0 0
At SMD N 00888000
Ne 0 ""
Po 4689 1500
.SolderMask 39
$EndPAD
$PAD
Sh "16" O 1063 276 0 0 0
Dr 0 0 0
At SMD N 00888000
Ne 0 ""
Po 4685 1000
.SolderMask 39
$EndPAD
$PAD
Sh "17" O 1063 276 0 0 0
Dr 0 0 0
At SMD N 00888000
Ne 0 ""
Po 4685 500
.SolderMask 39
$EndPAD
$PAD
Sh "21" O 1063 276 0 0 0
Dr 0 0 0
At SMD N 00888000
Ne 0 ""
Po 4685 -1500
.SolderMask 39
$EndPAD
$PAD
Sh "22" O 1063 276 0 0 0
Dr 0 0 0
At SMD N 00888000
Ne 0 ""
Po 4685 -2000
.SolderMask 39
$EndPAD
$PAD
Sh "23" O 1063 276 0 0 0
Dr 0 0 0
At SMD N 00888000
Ne 0 ""
Po 4685 -2500
.SolderMask 39
$EndPAD
$PAD
Sh "42" O 276 1063 0 0 0
Dr 0 0 0
At SMD N 00888000
Ne 0 ""
Po -3500 -4685
.SolderMask 39
$EndPAD
$PAD
Sh "43" O 276 1063 0 0 0
Dr 0 0 0
At SMD N 00888000
Ne 0 ""
Po -4000 -4685
.SolderMask 39
$EndPAD
$PAD
Sh "44" O 1063 276 0 0 0
Dr 0 0 0
At SMD N 00888000
Ne 0 ""
Po -4685 -4000
.SolderMask 39
$EndPAD
$PAD
Sh "40" O 276 1063 0 0 0
Dr 0 0 0
At SMD N 00888000
Ne 0 ""
Po -2500 -4685
$EndPAD
$PAD
Sh "20" O 1063 276 0 0 0
Dr 0 0 0
At SMD N 00888000
Ne 0 ""
Po 4685 -1000
$EndPAD
$PAD
Sh "6" O 276 1063 0 0 0
Dr 0 0 0
At SMD N 00888000
Ne 0 ""
Po 2500 4685
$EndPAD
$PAD
Sh "5" O 276 1063 0 0 0
Dr 0 0 0
At SMD N 00888000
Ne 0 ""
Po 2000 4685
$EndPAD
$PAD
Sh "41" O 276 1063 0 0 0
Dr 0 0 0
At SMD N 00888000
Ne 0 ""
Po -3000 -4685
$EndPAD
$PAD
Sh "19" O 1063 276 0 0 0
Dr 0 0 0
At SMD N 00888000
Ne 0 ""
Po 4685 -500
$EndPAD
$PAD
Sh "11" O 1063 276 0 0 0
Dr 0 0 0
At SMD N 00888000
Ne 0 ""
Po 4685 3500
$EndPAD
$PAD
Sh "12" O 1063 276 0 0 0
Dr 0 0 0
At SMD N 00888000
Ne 0 ""
Po 4685 3000
$EndPAD
$PAD
Sh "18" O 1063 276 0 0 0
Dr 0 0 0
At SMD N 00888000
Ne 0 ""
Po 4685 0
$EndPAD
$PAD
Sh "24" O 1063 276 0 0 0
Dr 0 0 0
At SMD N 00888000
Ne 0 ""
Po 4685 -3000
$EndPAD
$PAD
Sh "25" O 1063 276 0 0 0
Dr 0 0 0
At SMD N 00888000
Ne 0 ""
Po 4685 -3500
$EndPAD
$PAD
Sh "26" O 1063 276 0 0 0
Dr 0 0 0
At SMD N 00888000
Ne 0 ""
Po 4685 -4000
$EndPAD
$PAD
Sh "27" O 276 1063 0 0 0
Dr 0 0 0
At SMD N 00888000
Ne 0 ""
Po 4000 -4685
$EndPAD
$PAD
Sh "28" O 276 1063 0 0 0
Dr 0 0 0
At SMD N 00888000
Ne 0 ""
Po 3500 -4685
$EndPAD
$PAD
Sh "29" O 276 1063 0 0 0
Dr 0 0 0
At SMD N 00888000
Ne 0 ""
Po 3000 -4685
$EndPAD
$PAD
Sh "30" O 276 1063 0 0 0
Dr 0 0 0
At SMD N 00888000
Ne 0 ""
Po 2500 -4685
$EndPAD
$PAD
Sh "31" O 276 1063 0 0 0
Dr 0 0 0
At SMD N 00888000
Ne 0 ""
Po 2000 -4685
$EndPAD
$PAD
Sh "32" O 276 1063 0 0 0
Dr 0 0 0
At SMD N 00888000
Ne 0 ""
Po 1500 -4685
$EndPAD
$PAD
Sh "33" O 276 1063 0 0 0
Dr 0 0 0
At SMD N 00888000
Ne 0 ""
Po 1000 -4685
$EndPAD
$PAD
Sh "34" O 276 1063 0 0 0
Dr 0 0 0
At SMD N 00888000
Ne 0 ""
Po 500 -4685
$EndPAD
$PAD
Sh "35" O 276 1063 0 0 0
Dr 0 0 0
At SMD N 00888000
Ne 0 ""
Po 0 -4685
$EndPAD
$PAD
Sh "36" O 276 1063 0 0 0
Dr 0 0 0
At SMD N 00888000
Ne 0 ""
Po -500 -4685
$EndPAD
$PAD
Sh "37" O 276 1063 0 0 0
Dr 0 0 0
At SMD N 00888000
Ne 0 ""
Po -1000 -4685
$EndPAD
$PAD
Sh "38" O 276 1063 0 0 0
Dr 0 0 0
At SMD N 00888000
Ne 0 ""
Po -1500 -4685
$EndPAD
$PAD
Sh "39" O 276 1063 0 0 0
Dr 0 0 0
At SMD N 00888000
Ne 0 ""
Po -2000 -4685
$EndPAD
$PAD
Sh "45" O 1063 276 0 0 0
Dr 0 0 0
At SMD N 00888000
Ne 0 ""
Po -4685 -3500
$EndPAD
$PAD
Sh "46" O 1063 276 0 0 0
Dr 0 0 0
At SMD N 00888000
Ne 0 ""
Po -4685 -3000
$EndPAD
$PAD
Sh "47" O 1063 276 0 0 0
Dr 0 0 0
At SMD N 00888000
Ne 0 ""
Po -4685 -2500
$EndPAD
$PAD
Sh "48" O 1063 276 0 0 0
Dr 0 0 0
At SMD N 00888000
Ne 0 ""
Po -4685 -2000
$EndPAD
$PAD
Sh "49" O 1063 276 0 0 0
Dr 0 0 0
At SMD N 00888000
Ne 0 ""
Po -4685 -1500
$EndPAD
$PAD
Sh "50" O 1063 276 0 0 0
Dr 0 0 0
At SMD N 00888000
Ne 0 ""
Po -4685 -1000
$EndPAD
$PAD
Sh "51" O 1063 276 0 0 0
Dr 0 0 0
At SMD N 00888000
Ne 0 ""
Po -4685 -500
$EndPAD
$PAD
Sh "52" O 1063 276 0 0 0
Dr 0 0 0
At SMD N 00888000
Ne 0 ""
Po -4685 0
$EndPAD
$PAD
Sh "61" O 276 1063 0 0 0
Dr 0 0 0
At SMD N 00888000
Ne 0 ""
Po -4000 4685
$EndPAD
$PAD
Sh "62" O 276 1063 0 0 0
Dr 0 0 0
At SMD N 00888000
Ne 0 ""
Po -3500 4685
$EndPAD
$PAD
Sh "63" O 276 1063 0 0 0
Dr 0 0 0
At SMD N 00888000
Ne 0 ""
Po -3000 4685
$EndPAD
$PAD
Sh "64" O 276 1063 0 0 0
Dr 0 0 0
At SMD N 00888000
Ne 0 ""
Po -2500 4685
$EndPAD
$PAD
Sh "65" O 276 1063 0 0 0
Dr 0 0 0
At SMD N 00888000
Ne 0 ""
Po -2000 4685
$EndPAD
$PAD
Sh "66" O 276 1063 0 0 0
Dr 0 0 0
At SMD N 00888000
Ne 0 ""
Po -1500 4685
$EndPAD
$PAD
Sh "67" O 276 1063 0 0 0
Dr 0 0 0
At SMD N 00888000
Ne 0 ""
Po -1000 4685
$EndPAD
$PAD
Sh "68" O 276 1063 0 0 0
Dr 0 0 0
At SMD N 00888000
Ne 0 ""
Po -500 4685
$EndPAD
$PAD
Sh "53" O 1063 276 0 0 0
Dr 0 0 0
At SMD N 00888000
Ne 0 ""
Po -4685 500
$EndPAD
$PAD
Sh "54" O 1063 276 0 0 0
Dr 0 0 0
At SMD N 00888000
Ne 0 ""
Po -4685 1000
$EndPAD
$PAD
Sh "55" O 1063 276 0 0 0
Dr 0 0 0
At SMD N 00888000
Ne 0 ""
Po -4685 1500
$EndPAD
$PAD
Sh "56" O 1063 276 0 0 0
Dr 0 0 0
At SMD N 00888000
Ne 0 ""
Po -4685 2000
$EndPAD
$PAD
Sh "57" O 1063 276 0 0 0
Dr 0 0 0
At SMD N 00888000
Ne 0 ""
Po -4685 2500
$EndPAD
$PAD
Sh "58" O 1063 276 0 0 0
Dr 0 0 0
At SMD N 00888000
Ne 0 ""
Po -4685 3000
$EndPAD
$PAD
Sh "59" O 1063 276 0 0 0
Dr 0 0 0
At SMD N 00888000
Ne 0 ""
Po -4685 3500
$EndPAD
$PAD
Sh "60" O 1063 276 0 0 0
Dr 0 0 0
At SMD N 00888000
Ne 0 ""
Po -4685 4000
$EndPAD
$SHAPE3D
Na "walter\smd_plcc\plcc68.wrl"
Sc 1.000000 1.000000 1.000000
Of 0.000000 0.000000 0.000000
Ro 0.000000 0.000000 0.000000
$EndSHAPE3D
$EndMODULE  PLCC68
$MODULE PLCC84
Po 0 0 0 15 4E47B6DD 00000000 ~~
Li PLCC84
Sc 00000000
AR
Op 0 0 0
T0 0 -6614 394 394 0 79 N V 21 N"PLCC84"
T1 0 6614 394 394 0 79 N V 21 N"VAL**"
DC 0 5531 -59 5571 100 21
DS 5768 5315 -5768 5315 100 21
DS -5669 5768 -5768 5669 100 21
DS -5768 5669 -5768 -5669 100 21
DS -5768 -5669 -5669 -5768 100 21
DS -5669 -5768 5669 -5768 100 21
DS 5669 -5768 5768 -5669 100 21
DS 5768 -5669 5768 5315 100 21
DS 5768 5315 5315 5768 100 21
DS 5315 5768 -5669 5768 100 21
$PAD
Sh "1" O 276 1063 0 0 0
Dr 0 0 0
At SMD N 00888000
Ne 0 ""
Po 0 5659
.SolderMask 39
$EndPAD
$PAD
Sh "2" O 276 1063 0 0 0
Dr 0 0 0
At SMD N 00888000
Ne 0 ""
Po 500 5659
.SolderMask 39
$EndPAD
$PAD
Sh "3" O 276 1063 0 0 0
Dr 0 0 0
At SMD N 00888000
Ne 0 ""
Po 1000 5659
.SolderMask 39
$EndPAD
$PAD
Sh "4" O 276 1063 0 0 0
Dr 0 0 0
At SMD N 00888000
Ne 0 ""
Po 1500 5659
.SolderMask 39
$EndPAD
$PAD
Sh "7" O 276 1063 0 0 0
Dr 0 0 0
At SMD N 00888000
Ne 0 ""
Po 3000 5659
.SolderMask 39
$EndPAD
$PAD
Sh "8" O 276 1063 0 0 0
Dr 0 0 0
At SMD N 00888000
Ne 0 ""
Po 3500 5659
.SolderMask 39
$EndPAD
$PAD
Sh "9" O 276 1063 0 0 0
Dr 0 0 0
At SMD N 00888000
Ne 0 ""
Po 4000 5659
.SolderMask 39
$EndPAD
$PAD
Sh "10" O 276 1063 0 0 0
Dr 0 0 0
At SMD N 00888000
Ne 0 ""
Po 4500 5659
.SolderMask 39
$EndPAD
$PAD
Sh "13" O 1063 276 0 0 0
Dr 0 0 0
At SMD N 00888000
Ne 0 ""
Po 5659 4500
.SolderMask 39
$EndPAD
$PAD
Sh "14" O 1063 276 0 0 0
Dr 0 0 0
At SMD N 00888000
Ne 0 ""
Po 5659 4000
.SolderMask 39
$EndPAD
$PAD
Sh "15" O 1063 276 0 0 0
Dr 0 0 0
At SMD N 00888000
Ne 0 ""
Po 5659 3500
.SolderMask 39
$EndPAD
$PAD
Sh "16" O 1063 276 0 0 0
Dr 0 0 0
At SMD N 00888000
Ne 0 ""
Po 5659 3000
.SolderMask 39
$EndPAD
$PAD
Sh "17" O 1063 276 0 0 0
Dr 0 0 0
At SMD N 00888000
Ne 0 ""
Po 5659 2500
.SolderMask 39
$EndPAD
$PAD
Sh "21" O 1063 276 0 0 0
Dr 0 0 0
At SMD N 00888000
Ne 0 ""
Po 5659 500
.SolderMask 39
$EndPAD
$PAD
Sh "22" O 1063 276 0 0 0
Dr 0 0 0
At SMD N 00888000
Ne 0 ""
Po 5659 0
.SolderMask 39
$EndPAD
$PAD
Sh "23" O 1063 276 0 0 0
Dr 0 0 0
At SMD N 00888000
Ne 0 ""
Po 5659 -500
.SolderMask 39
$EndPAD
$PAD
Sh "42" O 276 1063 0 0 0
Dr 0 0 0
At SMD N 00888000
Ne 0 ""
Po 500 -5659
.SolderMask 39
$EndPAD
$PAD
Sh "43" O 276 1063 0 0 0
Dr 0 0 0
At SMD N 00888000
Ne 0 ""
Po 0 -5659
.SolderMask 39
$EndPAD
$PAD
Sh "44" O 276 1063 0 0 0
Dr 0 0 0
At SMD N 00888000
Ne 0 ""
Po -500 -5659
.SolderMask 39
$EndPAD
$PAD
Sh "40" O 276 1063 0 0 0
Dr 0 0 0
At SMD N 00888000
Ne 0 ""
Po 1500 -5659
$EndPAD
$PAD
Sh "20" O 1063 276 0 0 0
Dr 0 0 0
At SMD N 00888000
Ne 0 ""
Po 5659 1000
$EndPAD
$PAD
Sh "6" O 276 1063 0 0 0
Dr 0 0 0
At SMD N 00888000
Ne 0 ""
Po 2500 5659
$EndPAD
$PAD
Sh "5" O 276 1063 0 0 0
Dr 0 0 0
At SMD N 00888000
Ne 0 ""
Po 2000 5659
$EndPAD
$PAD
Sh "41" O 276 1063 0 0 0
Dr 0 0 0
At SMD N 00888000
Ne 0 ""
Po 1000 -5659
$EndPAD
$PAD
Sh "19" O 1063 276 0 0 0
Dr 0 0 0
At SMD N 00888000
Ne 0 ""
Po 5659 1500
$EndPAD
$PAD
Sh "11" O 276 1063 0 0 0
Dr 0 0 0
At SMD N 00888000
Ne 0 ""
Po 5000 5659
$EndPAD
$PAD
Sh "12" O 1063 276 0 0 0
Dr 0 0 0
At SMD N 00888000
Ne 0 ""
Po 5659 5000
$EndPAD
$PAD
Sh "18" O 1063 276 0 0 0
Dr 0 0 0
At SMD N 00888000
Ne 0 ""
Po 5659 2000
$EndPAD
$PAD
Sh "24" O 1063 276 0 0 0
Dr 0 0 0
At SMD N 00888000
Ne 0 ""
Po 5659 -1000
$EndPAD
$PAD
Sh "25" O 1063 276 0 0 0
Dr 0 0 0
At SMD N 00888000
Ne 0 ""
Po 5659 -1500
$EndPAD
$PAD
Sh "26" O 1063 276 0 0 0
Dr 0 0 0
At SMD N 00888000
Ne 0 ""
Po 5659 -2000
$EndPAD
$PAD
Sh "27" O 1063 276 0 0 0
Dr 0 0 0
At SMD N 00888000
Ne 0 ""
Po 5659 -2500
$EndPAD
$PAD
Sh "28" O 1063 276 0 0 0
Dr 0 0 0
At SMD N 00888000
Ne 0 ""
Po 5659 -3000
$EndPAD
$PAD
Sh "29" O 1063 276 0 0 0
Dr 0 0 0
At SMD N 00888000
Ne 0 ""
Po 5659 -3500
$EndPAD
$PAD
Sh "30" O 1063 276 0 0 0
Dr 0 0 0
At SMD N 00888000
Ne 0 ""
Po 5659 -4000
$EndPAD
$PAD
Sh "31" O 1063 276 0 0 0
Dr 0 0 0
At SMD N 00888000
Ne 0 ""
Po 5659 -4500
$EndPAD
$PAD
Sh "32" O 1063 276 0 0 0
Dr 0 0 0
At SMD N 00888000
Ne 0 ""
Po 5659 -5000
$EndPAD
$PAD
Sh "33" O 276 1063 0 0 0
Dr 0 0 0
At SMD N 00888000
Ne 0 ""
Po 5000 -5659
$EndPAD
$PAD
Sh "34" O 276 1063 0 0 0
Dr 0 0 0
At SMD N 00888000
Ne 0 ""
Po 4500 -5659
$EndPAD
$PAD
Sh "35" O 276 1063 0 0 0
Dr 0 0 0
At SMD N 00888000
Ne 0 ""
Po 4000 -5659
$EndPAD
$PAD
Sh "36" O 276 1063 0 0 0
Dr 0 0 0
At SMD N 00888000
Ne 0 ""
Po 3500 -5659
$EndPAD
$PAD
Sh "37" O 276 1063 0 0 0
Dr 0 0 0
At SMD N 00888000
Ne 0 ""
Po 3000 -5659
$EndPAD
$PAD
Sh "38" O 276 1063 0 0 0
Dr 0 0 0
At SMD N 00888000
Ne 0 ""
Po 2500 -5659
$EndPAD
$PAD
Sh "39" O 276 1063 0 0 0
Dr 0 0 0
At SMD N 00888000
Ne 0 ""
Po 2000 -5659
$EndPAD
$PAD
Sh "45" O 276 1063 0 0 0
Dr 0 0 0
At SMD N 00888000
Ne 0 ""
Po -1000 -5659
$EndPAD
$PAD
Sh "46" O 276 1063 0 0 0
Dr 0 0 0
At SMD N 00888000
Ne 0 ""
Po -1500 -5659
$EndPAD
$PAD
Sh "47" O 276 1063 0 0 0
Dr 0 0 0
At SMD N 00888000
Ne 0 ""
Po -2000 -5659
$EndPAD
$PAD
Sh "48" O 276 1063 0 0 0
Dr 0 0 0
At SMD N 00888000
Ne 0 ""
Po -2500 -5659
$EndPAD
$PAD
Sh "49" O 276 1063 0 0 0
Dr 0 0 0
At SMD N 00888000
Ne 0 ""
Po -3000 -5659
$EndPAD
$PAD
Sh "50" O 276 1063 0 0 0
Dr 0 0 0
At SMD N 00888000
Ne 0 ""
Po -3500 -5659
$EndPAD
$PAD
Sh "51" O 276 1063 0 0 0
Dr 0 0 0
At SMD N 00888000
Ne 0 ""
Po -4000 -5659
$EndPAD
$PAD
Sh "52" O 276 1063 0 0 0
Dr 0 0 0
At SMD N 00888000
Ne 0 ""
Po -4500 -5659
$EndPAD
$PAD
Sh "61" O 1063 276 0 0 0
Dr 0 0 0
At SMD N 00888000
Ne 0 ""
Po -5659 -1500
$EndPAD
$PAD
Sh "62" O 1063 276 0 0 0
Dr 0 0 0
At SMD N 00888000
Ne 0 ""
Po -5659 -1000
$EndPAD
$PAD
Sh "63" O 1063 276 0 0 0
Dr 0 0 0
At SMD N 00888000
Ne 0 ""
Po -5659 -500
$EndPAD
$PAD
Sh "64" O 1063 276 0 0 0
Dr 0 0 0
At SMD N 00888000
Ne 0 ""
Po -5659 0
$EndPAD
$PAD
Sh "65" O 1063 276 0 0 0
Dr 0 0 0
At SMD N 00888000
Ne 0 ""
Po -5659 500
$EndPAD
$PAD
Sh "66" O 1063 276 0 0 0
Dr 0 0 0
At SMD N 00888000
Ne 0 ""
Po -5659 1000
$EndPAD
$PAD
Sh "67" O 1063 276 0 0 0
Dr 0 0 0
At SMD N 00888000
Ne 0 ""
Po -5659 1500
$EndPAD
$PAD
Sh "68" O 1063 276 0 0 0
Dr 0 0 0
At SMD N 00888000
Ne 0 ""
Po -5659 2000
$EndPAD
$PAD
Sh "53" O 276 1063 0 0 0
Dr 0 0 0
At SMD N 00888000
Ne 0 ""
Po -5000 -5659
$EndPAD
$PAD
Sh "54" O 1063 276 0 0 0
Dr 0 0 0
At SMD N 00888000
Ne 0 ""
Po -5659 -5000
$EndPAD
$PAD
Sh "55" O 1063 276 0 0 0
Dr 0 0 0
At SMD N 00888000
Ne 0 ""
Po -5659 -4500
$EndPAD
$PAD
Sh "56" O 1063 276 0 0 0
Dr 0 0 0
At SMD N 00888000
Ne 0 ""
Po -5659 -4000
$EndPAD
$PAD
Sh "57" O 1063 276 0 0 0
Dr 0 0 0
At SMD N 00888000
Ne 0 ""
Po -5659 -3500
$EndPAD
$PAD
Sh "58" O 1063 276 0 0 0
Dr 0 0 0
At SMD N 00888000
Ne 0 ""
Po -5659 -3000
$EndPAD
$PAD
Sh "59" O 1063 276 0 0 0
Dr 0 0 0
At SMD N 00888000
Ne 0 ""
Po -5659 -2500
$EndPAD
$PAD
Sh "60" O 1063 276 0 0 0
Dr 0 0 0
At SMD N 00888000
Ne 0 ""
Po -5659 -2000
$EndPAD
$PAD
Sh "69" O 1063 276 0 0 0
Dr 0 0 0
At SMD N 00888000
Ne 0 ""
Po -5659 2500
$EndPAD
$PAD
Sh "70" O 1063 276 0 0 0
Dr 0 0 0
At SMD N 00888000
Ne 0 ""
Po -5659 3000
$EndPAD
$PAD
Sh "71" O 1063 276 0 0 0
Dr 0 0 0
At SMD N 00888000
Ne 0 ""
Po -5659 3500
$EndPAD
$PAD
Sh "72" O 1063 276 0 0 0
Dr 0 0 0
At SMD N 00888000
Ne 0 ""
Po -5659 4000
$EndPAD
$PAD
Sh "73" O 1063 276 0 0 0
Dr 0 0 0
At SMD N 00888000
Ne 0 ""
Po -5659 4500
$EndPAD
$PAD
Sh "74" O 1063 276 0 0 0
Dr 0 0 0
At SMD N 00888000
Ne 0 ""
Po -5659 5000
$EndPAD
$PAD
Sh "75" O 276 1063 0 0 0
Dr 0 0 0
At SMD N 00888000
Ne 0 ""
Po -5000 5659
$EndPAD
$PAD
Sh "76" O 276 1063 0 0 0
Dr 0 0 0
At SMD N 00888000
Ne 0 ""
Po -4500 5659
$EndPAD
$PAD
Sh "77" O 276 1063 0 0 0
Dr 0 0 0
At SMD N 00888000
Ne 0 ""
Po -4000 5659
$EndPAD
$PAD
Sh "78" O 276 1063 0 0 0
Dr 0 0 0
At SMD N 00888000
Ne 0 ""
Po -3500 5659
$EndPAD
$PAD
Sh "79" O 276 1063 0 0 0
Dr 0 0 0
At SMD N 00888000
Ne 0 ""
Po -3000 5659
$EndPAD
$PAD
Sh "80" O 276 1063 0 0 0
Dr 0 0 0
At SMD N 00888000
Ne 0 ""
Po -2500 5659
$EndPAD
$PAD
Sh "81" O 276 1063 0 0 0
Dr 0 0 0
At SMD N 00888000
Ne 0 ""
Po -2000 5659
$EndPAD
$PAD
Sh "82" O 276 1063 0 0 0
Dr 0 0 0
At SMD N 00888000
Ne 0 ""
Po -1500 5659
$EndPAD
$PAD
Sh "83" O 276 1063 0 0 0
Dr 0 0 0
At SMD N 00888000
Ne 0 ""
Po -1000 5659
$EndPAD
$PAD
Sh "84" O 276 1063 0 0 0
Dr 0 0 0
At SMD N 00888000
Ne 0 ""
Po -500 5659
$EndPAD
$SHAPE3D
Na "walter\smd_plcc\plcc84.wrl"
Sc 1.000000 1.000000 1.000000
Of 0.000000 0.000000 0.000000
Ro 0.000000 0.000000 0.000000
$EndSHAPE3D
$EndMODULE  PLCC84
$MODULE PLCC32
Po 0 0 0 15 4E4970AB 00000000 ~~
Li PLCC32
Sc 00000000
AR 
Op 0 0 0
T0 0 -3622 394 394 0 79 N V 21 N"PLCC32"
T1 0 3622 394 394 0 79 N V 21 N"VAL**"
DS -2264 -2657 -2264 2657 100 21
DS 2264 2303 2264 -2657 100 21
DC 0 2520 -59 2559 100 21
DS 2264 2303 -2264 2303 100 21
DS -2264 -2657 -2165 -2756 100 21
DS -2165 -2756 2165 -2756 100 21
DS 2165 -2757 2264 -2658 100 21
DS 2264 2303 1811 2756 100 21
DS 1811 2756 -2165 2756 100 21
DS -2165 2757 -2264 2658 100 21
$PAD
Sh "1" O 276 1063 0 0 0
Dr 0 0 0
At SMD N 00888000
Ne 0 ""
Po 0 2665
.SolderMask 39
$EndPAD
$PAD
Sh "2" O 276 1063 0 0 0
Dr 0 0 0
At SMD N 00888000
Ne 0 ""
Po 500 2665
.SolderMask 39
$EndPAD
$PAD
Sh "3" O 276 1063 0 0 0
Dr 0 0 0
At SMD N 00888000
Ne 0 ""
Po 1000 2665
.SolderMask 39
$EndPAD
$PAD
Sh "4" O 276 1063 0 0 0
Dr 0 0 0
At SMD N 00888000
Ne 0 ""
Po 1500 2665
.SolderMask 39
$EndPAD
$PAD
Sh "7" O 1063 276 0 0 0
Dr 0 0 0
At SMD N 00888000
Ne 0 ""
Po 2165 1000
.SolderMask 39
$EndPAD
$PAD
Sh "8" O 1063 276 0 0 0
Dr 0 0 0
At SMD N 00888000
Ne 0 ""
Po 2165 500
.SolderMask 39
$EndPAD
$PAD
Sh "9" O 1063 276 0 0 0
Dr 0 0 0
At SMD N 00888000
Ne 0 ""
Po 2165 0
.SolderMask 39
$EndPAD
$PAD
Sh "10" O 1063 276 0 0 0
Dr 0 0 0
At SMD N 00888000
Ne 0 ""
Po 2165 -500
.SolderMask 39
$EndPAD
$PAD
Sh "15" O 276 1063 0 0 0
Dr 0 0 0
At SMD N 00888000
Ne 0 ""
Po 1000 -2665
.SolderMask 39
$EndPAD
$PAD
Sh "16" O 276 1063 0 0 0
Dr 0 0 0
At SMD N 00888000
Ne 0 ""
Po 500 -2665
.SolderMask 39
$EndPAD
$PAD
Sh "17" O 276 1063 0 0 0
Dr 0 0 0
At SMD N 00888000
Ne 0 ""
Po 0 -2665
.SolderMask 39
$EndPAD
$PAD
Sh "18" O 276 1063 0 0 0
Dr 0 0 0
At SMD N 00888000
Ne 0 ""
Po -500 -2665
.SolderMask 39
$EndPAD
$PAD
Sh "19" O 276 1063 0 0 0
Dr 0 0 0
At SMD N 00888000
Ne 0 ""
Po -1000 -2665
.SolderMask 39
$EndPAD
$PAD
Sh "24" O 1063 276 0 0 0
Dr 0 0 0
At SMD N 00888000
Ne 0 ""
Po -2165 -500
.SolderMask 39
$EndPAD
$PAD
Sh "25" O 1063 276 0 0 0
Dr 0 0 0
At SMD N 00888000
Ne 0 ""
Po -2165 0
.SolderMask 39
$EndPAD
$PAD
Sh "26" O 1063 276 0 0 0
Dr 0 0 0
At SMD N 00888000
Ne 0 ""
Po -2165 500
.SolderMask 39
$EndPAD
$PAD
Sh "30" O 276 1063 0 0 0
Dr 0 0 0
At SMD N 00888000
Ne 0 ""
Po -1500 2665
.SolderMask 39
$EndPAD
$PAD
Sh "31" O 276 1063 0 0 0
Dr 0 0 0
At SMD N 00888000
Ne 0 ""
Po -1000 2665
.SolderMask 39
$EndPAD
$PAD
Sh "32" O 276 1063 0 0 0
Dr 0 0 0
At SMD N 00888000
Ne 0 ""
Po -500 2665
.SolderMask 39
$EndPAD
$PAD
Sh "27" O 1063 276 0 0 0
Dr 0 0 0
At SMD N 00888000
Ne 0 ""
Po -2165 1000
$EndPAD
$PAD
Sh "23" O 1063 276 0 0 0
Dr 0 0 0
At SMD N 00888000
Ne 0 ""
Po -2165 -1000
$EndPAD
$PAD
Sh "6" O 1063 276 0 0 0
Dr 0 0 0
At SMD N 00888000
Ne 0 ""
Po 2165 1500
$EndPAD
$PAD
Sh "5" O 1063 276 0 0 0
Dr 0 0 0
At SMD N 00888000
Ne 0 ""
Po 2165 2000
$EndPAD
$PAD
Sh "28" O 1063 276 0 0 0
Dr 0 0 0
At SMD N 00888000
Ne 0 ""
Po -2165 1500
$EndPAD
$PAD
Sh "22" O 1063 276 0 0 0
Dr 0 0 0
At SMD N 00888000
Ne 0 ""
Po -2165 -1500
$EndPAD
$PAD
Sh "11" O 1063 276 0 0 0
Dr 0 0 0
At SMD N 00888000
Ne 0 ""
Po 2165 -1000
$EndPAD
$PAD
Sh "14" O 276 1063 0 0 0
Dr 0 0 0
At SMD N 00888000
Ne 0 ""
Po 1500 -2665
$EndPAD
$PAD
Sh "20" O 276 1063 0 0 0
Dr 0 0 0
At SMD N 00888000
Ne 0 ""
Po -1500 -2665
$EndPAD
$PAD
Sh "29" O 1063 276 0 0 0
Dr 0 0 0
At SMD N 00888000
Ne 0 ""
Po -2165 2000
$EndPAD
$PAD
Sh "21" O 1063 276 0 0 0
Dr 0 0 0
At SMD N 00888000
Ne 0 ""
Po -2165 -2000
$EndPAD
$PAD
Sh "12" O 1063 276 0 0 0
Dr 0 0 0
At SMD N 00888000
Ne 0 ""
Po 2165 -1500
$EndPAD
$PAD
Sh "13" O 1063 276 0 0 0
Dr 0 0 0
At SMD N 00888000
Ne 0 ""
Po 2165 -2000
$EndPAD
$SHAPE3D
Na "walter\smd_plcc\plcc32.wrl"
Sc 1.000000 1.000000 1.000000
Of 0.000000 0.000000 0.000000
Ro 0.000000 0.000000 0.000000
$EndSHAPE3D
$EndMODULE  PLCC32
$EndLIBRARY
