PCBNEW-LibModule-V1  mar 16 ago 2011 13:24:55 CEST
$INDEX
trimmer_64w
RC05
rc05_vert
r-sil_9
r-sil_5
RC03
RC07
rc_vert_26x14x10
RC03_VERT
rc07_vert
R15.5x6
R12x5.2
R13.5x6
R22x8
R25x8
R12x5.2_vert
R13.5x6_vert
R15.5x6_vert
R22x8_vert
R25x8_vert
$EndINDEX
$MODULE trimmer_64w
Po 0 0 0 15 4B90E136 00000000 ~~
Li trimmer_64w
Cd trimmer, multiturn cermet, shape 64W
Kw trimmer
Sc 00000000
AR
Op 0 0 0
T0 0 2600 600 600 0 120 N V 21 N"trimmer_64w"
T1 0 -2600 600 600 0 120 N V 21 N"TR***"
DS 1000 -2000 1000 2000 150 21
DS 1000 2000 -1000 2000 150 21
DS -1000 2000 -1000 -2000 150 21
DS 0 -1400 800 -1400 150 21
DC 400 -1400 800 -1400 150 21
DS 1000 -2000 -1000 -2000 150 21
$PAD
Sh "1" O 787 591 0 0 0
Dr 315 0 0
At STD N 00E0FFFF
Ne 0 ""
Po 0 -1000
$EndPAD
$PAD
Sh "2" O 787 591 0 0 0
Dr 315 0 0
At STD N 00E0FFFF
Ne 0 ""
Po 0 0
$EndPAD
$PAD
Sh "3" O 787 591 0 0 0
Dr 315 0 0
At STD N 00E0FFFF
Ne 0 ""
Po 0 1000
$EndPAD
$SHAPE3D
Na "walter\pth_resistors\trimmer_64w.wrl"
Sc 1.000000 1.000000 1.000000
Of 0.000000 0.000000 0.000000
Ro 0.000000 0.000000 0.000000
$EndSHAPE3D
$EndMODULE  trimmer_64w
$MODULE rc_vert_26x14x10
Po 0 0 0 15 4B90E141 00000000 ~~
Li rc_vert_26x14x10
Cd ceramic power resistor, vertical, 26,5mm
Sc 00000000
AR
Op 0 0 0
T0 0 -3000 600 600 0 120 N V 21 N"rc_vert_26x14x10"
T1 0 3000 600 600 0 120 N V 21 N"R***"
DS 2400 -2000 2400 2000 100 21
DS -2400 -2000 -2400 2000 100 21
DS 2800 -2000 -2800 -2000 100 21
DS -2800 -2000 -2800 2000 100 21
DS -2800 2000 2800 2000 100 21
DS 2800 2000 2800 -2000 100 21
$PAD
Sh "1" C 1181 1181 0 0 0
Dr 394 0 0
At STD N 00E0FFFF
Ne 0 ""
Po 1000 0
$EndPAD
$PAD
Sh "2" C 1181 1181 0 0 0
Dr 394 0 0
At STD N 00E0FFFF
Ne 0 ""
Po -1000 0
$EndPAD
$SHAPE3D
Na "walter\pth_resistors\rc_vert_26x14x10.wrl"
Sc 1.000000 1.000000 1.000000
Of 0.000000 0.000000 0.000000
Ro 0.000000 0.000000 0.000000
$EndSHAPE3D
$EndMODULE  rc_vert_26x14x10
$MODULE rc07_vert
Po 0 0 0 15 4B90E14B 00000000 ~~
Li rc07_vert
Cd Resistor, RC07 vertical
Sc 00000000
AR
Op 0 0 0
T0 0 1400 600 600 0 120 N V 21 N"RC07_vert"
T1 0 -1400 600 600 0 120 N V 21 N"R***"
DS 750 0 -750 0 120 21
DC -750 0 -1550 50 120 21
$PAD
Sh "1" C 787 787 0 0 0
Dr 315 0 0
At STD N 00E0FFFF
Ne 0 ""
Po -750 0
$EndPAD
$PAD
Sh "2" C 787 787 0 0 0
Dr 315 0 0
At STD N 00E0FFFF
Ne 0 ""
Po 750 0
$EndPAD
$SHAPE3D
Na "walter\pth_resistors\rc07vert.wrl"
Sc 1.000000 1.000000 1.000000
Of 0.000000 0.000000 0.000000
Ro 0.000000 0.000000 0.000000
$EndSHAPE3D
$EndMODULE  rc07_vert
$MODULE RC07
Po 0 0 0 15 4B90E153 00000000 ~~
Li RC07
Cd Resistor, RC07
Kw R
Sc 00000000
AR
Op 0 A 0
T0 50 -400 550 500 0 80 N V 21 N"RC07"
T1 0 400 550 500 0 80 N I 21 N"R***"
DS -2150 0 -2150 -800 100 21
DS -2150 -800 2150 -800 100 21
DS 2150 -800 2150 800 100 21
DS 2150 800 -2150 800 100 21
DS -2150 800 -2150 0 100 21
DS 2150 0 3000 0 100 21
DS -3000 0 -2150 0 100 21
$PAD
Sh "1" C 787 787 0 0 0
Dr 315 0 0
At STD N 00E0FFFF
Ne 0 ""
Po -3000 0
$EndPAD
$PAD
Sh "2" C 787 787 0 0 0
Dr 315 0 0
At STD N 00E0FFFF
Ne 0 ""
Po 3000 0
$EndPAD
$SHAPE3D
Na "walter\pth_resistors\rc07.wrl"
Sc 1.000000 1.000000 1.000000
Of 0.000000 0.000000 0.000000
Ro 0.000000 0.000000 0.000000
$EndSHAPE3D
$EndMODULE  RC07
$MODULE rc05_vert
Po 0 0 0 15 4B90E15B 00000000 ~~
Li rc05_vert
Cd Resistor, RC05 vertical
Sc 00000000
AR
Op 0 0 0
T0 0 1000 600 600 0 120 N V 21 N"RC05_vert"
T1 0 -1000 600 600 0 120 N V 21 N"R***"
DS -500 0 500 0 100 21
DC -500 0 0 0 100 21
$PAD
Sh "1" C 787 787 0 0 0
Dr 315 0 0
At STD N 00E0FFFF
Ne 0 ""
Po -500 0
$EndPAD
$PAD
Sh "2" C 787 787 0 0 0
Dr 315 0 0
At STD N 00E0FFFF
Ne 0 ""
Po 500 0
$EndPAD
$SHAPE3D
Na "walter\pth_resistors\rc05vert.wrl"
Sc 1.000000 1.000000 1.000000
Of 0.000000 0.000000 0.000000
Ro 0.000000 0.000000 0.000000
$EndSHAPE3D
$EndMODULE  rc05_vert
$MODULE RC05
Po 0 0 0 15 4B90E162 00000000 ~~
Li RC05
Cd Resistor, RC05
Kw R
Sc 00000000
AR
Op 0 A 0
T0 0 0 550 500 0 80 N V 21 N"RC05"
T1 0 800 550 500 0 80 N I 21 N"R***"
DS 1800 500 -1800 500 100 21
DS -1800 500 -1800 -500 100 21
DS -1800 -500 1800 -500 100 21
DS 1800 -500 1800 500 100 21
DS -2000 0 -1800 0 120 21
DS 2000 0 1800 0 120 21
$PAD
Sh "1" C 787 787 0 0 0
Dr 315 0 0
At STD N 00E0FFFF
Ne 0 ""
Po -2000 0
$EndPAD
$PAD
Sh "2" C 787 787 0 0 0
Dr 315 0 0
At STD N 00E0FFFF
Ne 0 ""
Po 2000 0
$EndPAD
$SHAPE3D
Na "walter\pth_resistors\rc05.wrl"
Sc 1.000000 1.000000 1.000000
Of 0.000000 0.000000 0.000000
Ro 0.000000 0.000000 0.000000
$EndSHAPE3D
$EndMODULE  RC05
$MODULE rc03_vert
Po 0 0 0 15 4B90E169 00000000 ~~
Li rc03_vert
Cd Resistor, RC03 vertical
Sc 00000000
AR
Op 0 0 0
T0 0 1000 600 600 0 120 N V 21 N"RC03_vert"
T1 0 -1000 600 600 0 120 N V 21 N"R***"
DC -500 0 -850 0 120 21
DS -500 0 500 0 100 21
$PAD
Sh "1" C 787 787 0 0 0
Dr 315 0 0
At STD N 00E0FFFF
Ne 0 ""
Po -500 0
$EndPAD
$PAD
Sh "2" C 787 787 0 0 0
Dr 315 0 0
At STD N 00E0FFFF
Ne 0 ""
Po 500 0
$EndPAD
$SHAPE3D
Na "walter\pth_resistors\rc03vert.wrl"
Sc 1.000000 1.000000 1.000000
Of 0.000000 0.000000 0.000000
Ro 0.000000 0.000000 0.000000
$EndSHAPE3D
$EndMODULE  rc03_vert
$MODULE RC03
Po 0 0 0 15 4B90E175 00000000 ~~
Li RC03
Cd Resistor, RC03
Kw R
Sc 00000000
AR
Op 0 A 0
T0 0 0 550 500 0 80 N V 21 N"RC03"
T1 0 800 550 500 0 80 N I 21 N"R***"
DS 850 0 1500 0 100 21
DS -850 0 -1500 0 100 21
DS -850 -350 -850 350 100 21
DS -850 350 850 350 100 21
DS 850 350 850 -350 100 21
DS 850 -350 -850 -350 100 21
$PAD
Sh "1" C 787 787 0 0 0
Dr 315 0 0
At STD N 00E0FFFF
Ne 0 ""
Po -1500 0
$EndPAD
$PAD
Sh "2" C 787 787 0 0 0
Dr 315 0 0
At STD N 00E0FFFF
Ne 0 ""
Po 1500 0
$EndPAD
$SHAPE3D
Na "walter\pth_resistors\rc03.wrl"
Sc 1.000000 1.000000 1.000000
Of 0.000000 0.000000 0.000000
Ro 0.000000 0.000000 0.000000
$EndSHAPE3D
$EndMODULE  RC03
$MODULE r-sil_9
Po 0 0 0 15 4B90E183 00000000 ~~
Li r-sil_9
Cd R-net, sil package, 9pin
Kw CONN DEV
Sc 00000000
AR
Op 0 0 0
T0 0 -850 400 400 0 80 N V 21 N"R-SIL_9"
T1 100 -1400 400 350 0 80 N I 21 N"RN***"
DS -3500 -500 -3500 500 120 21
DS -4500 -500 4500 -500 120 21
DS 4500 -500 4500 500 120 21
DS 4500 500 -4500 500 120 21
DS -4500 500 -4500 -500 120 21
$PAD
Sh "1" R 600 866 0 0 0
Dr 315 0 0
At STD N 00E0FFFF
Ne 0 ""
Po -4000 0
$EndPAD
$PAD
Sh "2" O 600 866 0 0 0
Dr 315 0 0
At STD N 00E0FFFF
Ne 0 ""
Po -3000 0
$EndPAD
$PAD
Sh "3" O 600 866 0 0 0
Dr 315 0 0
At STD N 00E0FFFF
Ne 0 ""
Po -2000 0
$EndPAD
$PAD
Sh "4" O 600 866 0 0 0
Dr 315 0 0
At STD N 00E0FFFF
Ne 0 ""
Po -1000 0
$EndPAD
$PAD
Sh "5" O 600 866 0 0 0
Dr 315 0 0
At STD N 00E0FFFF
Ne 0 ""
Po 0 0
$EndPAD
$PAD
Sh "6" O 600 866 0 0 0
Dr 315 0 0
At STD N 00E0FFFF
Ne 0 ""
Po 1000 0
$EndPAD
$PAD
Sh "7" O 600 866 0 0 0
Dr 315 0 0
At STD N 00E0FFFF
Ne 0 ""
Po 2000 0
$EndPAD
$PAD
Sh "8" O 600 866 0 0 0
Dr 315 0 0
At STD N 00E0FFFF
Ne 0 ""
Po 3000 0
$EndPAD
$PAD
Sh "9" O 600 866 0 0 0
Dr 315 0 0
At STD N 00E0FFFF
Ne 0 ""
Po 4000 0
$EndPAD
$SHAPE3D
Na "walter\pth_resistors\r-sil_9.wrl"
Sc 1.000000 1.000000 1.000000
Of 0.000000 0.000000 0.000000
Ro 0.000000 0.000000 0.000000
$EndSHAPE3D
$EndMODULE  r-sil_9
$MODULE r-sil_5
Po 0 0 0 15 4B90E192 00000000 ~~
Li r-sil_5
Cd R-net, sil package, 5pin
Kw CONN DEV
Sc 00000000
AR
Op 0 0 0
T0 0 -850 400 400 0 80 N V 21 N"R-SIL_5"
T1 100 -1400 400 350 0 80 N I 21 N"RN***"
DS -2500 -500 2500 -500 125 21
DS 2500 500 -2500 500 125 21
DS -1500 -500 -1500 500 120 21
DS 2500 -500 2500 500 125 21
DS -2500 500 -2500 -500 120 21
$PAD
Sh "1" R 600 866 0 0 0
Dr 315 0 0
At STD N 00E0FFFF
Ne 0 ""
Po -2000 0
$EndPAD
$PAD
Sh "2" O 600 866 0 0 0
Dr 315 0 0
At STD N 00E0FFFF
Ne 0 ""
Po -1000 0
$EndPAD
$PAD
Sh "3" O 600 866 0 0 0
Dr 315 0 0
At STD N 00E0FFFF
Ne 0 ""
Po 0 0
$EndPAD
$PAD
Sh "4" O 600 866 0 0 0
Dr 315 0 0
At STD N 00E0FFFF
Ne 0 ""
Po 1000 0
$EndPAD
$PAD
Sh "5" O 600 866 0 0 0
Dr 315 0 0
At STD N 00E0FFFF
Ne 0 ""
Po 2000 0
$EndPAD
$SHAPE3D
Na "walter\pth_resistors\r-sil_5.wrl"
Sc 1.000000 1.000000 1.000000
Of 0.000000 0.000000 0.000000
Ro 0.000000 0.000000 0.000000
$EndSHAPE3D
$EndMODULE  r-sil_5
$MODULE R15.5x6
Po 0 0 0 15 4DB71201 00000000 ~~
Li R15.5x6
Cd Resistor, 15.5x6 mm
Kw R
Sc 00000000
AR
Op 0 A 0
T0 50 -400 550 500 0 80 N V 21 N "R***"
T1 0 400 550 500 0 80 N I 21 N "R15.5x6"
DS 3248 0 4331 0 100 21
DS -3248 0 -4331 0 100 21
DS -3248 -1378 -3248 1378 100 21
DS -3248 1378 3248 1378 100 21
DS 3248 1378 3248 -1378 100 21
DS 3248 -1378 -3248 -1378 100 21
$PAD
Sh "1" C 1181 1181 0 0 0
Dr 394 0 0
At STD N 00E0FFFF
Ne 0 ""
Po -4336 0
$EndPAD
$PAD
Sh "2" C 1181 1181 0 0 0
Dr 394 0 0
At STD N 00E0FFFF
Ne 0 ""
Po 4336 0
$EndPAD
$SHAPE3D
Na "walter\pth_resistors\r15.5x6.wrl"
Sc 1.000000 1.000000 1.000000
Of 0.000000 0.000000 0.000000
Ro 0.000000 0.000000 0.000000
$EndSHAPE3D
$EndMODULE  R15.5x6
$MODULE R22x8
Po 0 0 0 15 4E4A3F0D 00000000 ~~
Li R22x8
Cd Resistor, 22x8 mm
Kw R
Sc 00000000
AR
Op 0 A 0
T0 50 -400 550 500 0 80 N V 21 N"R***"
T1 0 400 550 500 0 80 N I 21 N"R22x8"
DS -4646 -1732 4646 -1732 100 21
DS 4646 -1732 4646 1732 100 21
DS 4646 1732 -4646 1732 100 21
DS -4646 1732 -4646 -1732 100 21
DS 4666 0 5749 0 100 21
DS -4666 0 -5749 0 100 21
$PAD
Sh "1" C 1181 1181 0 0 0
Dr 394 0 0
At STD N 00E0FFFF
Ne 0 ""
Po -5750 0
$EndPAD
$PAD
Sh "2" C 1181 1181 0 0 0
Dr 394 0 0
At STD N 00E0FFFF
Ne 0 ""
Po 5750 0
$EndPAD
$SHAPE3D
Na "walter\pth_resistors\r22x8.wrl"
Sc 1.000000 1.000000 1.000000
Of 0.000000 0.000000 0.000000
Ro 0.000000 0.000000 0.000000
$EndSHAPE3D
$EndMODULE  R22x8
$MODULE R25x8
Po 0 0 0 15 4E4A3FF2 00000000 ~~
Li R25x8
Cd Resistor, 25x8 mm
Kw R
Sc 00000000
AR
Op 0 A 0
T0 50 -400 550 500 0 80 N V 21 N"R***"
T1 0 400 550 500 0 80 N I 21 N"R25x8"
DS -5236 -1732 5236 -1732 100 21
DS 5236 -1732 5236 1732 100 21
DS 5236 1732 -5236 1732 100 21
DS -5236 1732 -5236 -1732 100 21
DS 5256 0 6339 0 100 21
DS -5257 0 -6340 0 100 21
$PAD
Sh "1" C 1181 1181 0 0 0
Dr 394 0 0
At STD N 00E0FFFF
Ne 0 ""
Po -6250 0
$EndPAD
$PAD
Sh "2" C 1181 1181 0 0 0
Dr 394 0 0
At STD N 00E0FFFF
Ne 0 ""
Po 6250 0
$EndPAD
$SHAPE3D
Na "walter\pth_resistors\r25x8.wrl"
Sc 1.000000 1.000000 1.000000
Of 0.000000 0.000000 0.000000
Ro 0.000000 0.000000 0.000000
$EndSHAPE3D
$EndMODULE  R25x8
$MODULE R12x5.2_vert
Po 0 0 0 15 4E4A46F0 00000000 ~~
Li R12x5.2_vert
Cd Resistor, 12x5.2 mm, vertical
Kw R
Sc 00000000
AR
Op 0 A 0
T0 0 -1575 550 500 0 80 N V 21 N"R***"
T1 0 1732 550 500 0 80 N I 21 N"R12x5.2_vert"
DS 0 0 2008 0 100 21
DC 0 0 -1220 0 100 21
$PAD
Sh "1" C 1181 1181 0 0 0
Dr 394 0 0
At STD N 00E0FFFF
Ne 0 ""
Po 0 0
$EndPAD
$PAD
Sh "2" C 1181 1181 0 0 0
Dr 394 0 0
At STD N 00E0FFFF
Ne 0 ""
Po 2000 0
$EndPAD
$SHAPE3D
Na "walter\pth_resistors\r12x5.2vert.wrl"
Sc 1.000000 1.000000 1.000000
Of 0.000000 0.000000 0.000000
Ro 0.000000 0.000000 0.000000
$EndSHAPE3D
$EndMODULE  R12x5.2_vert
$MODULE R12x5.2
Po 0 0 0 15 4E4A3DC6 00000000 ~~
Li R12x5.2
Cd Resistor, 12x5.2 mm
Kw R
Sc 00000000
AR
Op 0 A 0
T0 50 -400 550 500 0 80 N V 21 N"R***"
T1 0 400 550 500 0 80 N I 21 N"R12x5.2"
DS -2520 -1142 -2520 1142 100 21
DS -2520 1142 2520 1142 100 21
DS 2520 1142 2520 -1142 100 21
DS 2520 -1142 -2520 -1142 100 21
DS 2540 0 3623 0 100 21
DS -2540 0 -3623 0 100 21
$PAD
Sh "1" C 1181 1181 0 0 0
Dr 394 0 0
At STD N 00E0FFFF
Ne 0 ""
Po -3500 0
$EndPAD
$PAD
Sh "2" C 1181 1181 0 0 0
Dr 394 0 0
At STD N 00E0FFFF
Ne 0 ""
Po 3500 0
$EndPAD
$SHAPE3D
Na "walter\pth_resistors\r12x5.2.wrl"
Sc 1.000000 1.000000 1.000000
Of 0.000000 0.000000 0.000000
Ro 0.000000 0.000000 0.000000
$EndSHAPE3D
$EndMODULE  R12x5.2
$MODULE R13.5x6_vert
Po 0 0 0 15 4E4A4A13 00000000 ~~
Li R13.5x6_vert
Cd Resistor, 13.5x6 mm, vertical
Kw R
Sc 00000000
AR
Op 0 A 0
T0 0 -1772 550 500 0 80 N V 21 N"R***"
T1 0 1929 550 500 0 80 N I 21 N"R13.5x6_vert"
DS 0 0 2244 0 100 21
DC 0 0 -1378 0 100 21
$PAD
Sh "1" C 1181 1181 0 0 0
Dr 394 0 0
At STD N 00E0FFFF
Ne 0 ""
Po 0 0
$EndPAD
$PAD
Sh "2" C 1181 1181 0 0 0
Dr 394 0 0
At STD N 00E0FFFF
Ne 0 ""
Po 2250 0
$EndPAD
$SHAPE3D
Na "walter\pth_resistors\r13.5x6vert.wrl"
Sc 1.000000 1.000000 1.000000
Of 0.000000 0.000000 0.000000
Ro 0.000000 0.000000 0.000000
$EndSHAPE3D
$EndMODULE  R13.5x6_vert
$MODULE R13.5x6
Po 0 0 0 15 4E4A3E4A 00000000 ~~
Li R13.5x6
Cd Resistor, 13.5x6 mm
Kw R
Sc 00000000
AR
Op 0 A 0
T0 50 -400 550 500 0 80 N V 21 N"R***"
T1 0 400 550 500 0 80 N I 21 N"R13.5x6"
DS -2835 -1299 2835 -1299 100 21
DS 2835 -1299 2835 1299 100 21
DS 2835 1299 -2835 1299 100 21
DS -2835 1299 -2835 -1299 100 21
DS 2855 0 3938 0 100 21
DS -2855 0 -3938 0 100 21
$PAD
Sh "1" C 1181 1181 0 0 0
Dr 394 0 0
At STD N 00E0FFFF
Ne 0 ""
Po -4000 0
$EndPAD
$PAD
Sh "2" C 1181 1181 0 0 0
Dr 394 0 0
At STD N 00E0FFFF
Ne 0 ""
Po 4000 0
$EndPAD
$SHAPE3D
Na "walter\pth_resistors\r13.5x6.wrl"
Sc 1.000000 1.000000 1.000000
Of 0.000000 0.000000 0.000000
Ro 0.000000 0.000000 0.000000
$EndSHAPE3D
$EndMODULE  R13.5x6
$MODULE R15.5x6_vert
Po 0 0 0 15 4E4A4A13 00000000 ~~
Li R15.5x6_vert
Cd Resistor, 15.5x6 mm, vertical
Kw R
Sc 00000000
AR
Op 0 A 0
T0 0 -1772 550 500 0 80 N V 21 N"R***"
T1 0 1929 550 500 0 80 N I 21 N"R15.5x6_vert"
DS 0 0 2244 0 100 21
DC 0 0 -1378 0 100 21
$PAD
Sh "1" C 1181 1181 0 0 0
Dr 394 0 0
At STD N 00E0FFFF
Ne 0 ""
Po 0 0
$EndPAD
$PAD
Sh "2" C 1181 1181 0 0 0
Dr 394 0 0
At STD N 00E0FFFF
Ne 0 ""
Po 2250 0
$EndPAD
$SHAPE3D
Na "walter\pth_resistors\r15.5x6vert.wrl"
Sc 1.000000 1.000000 1.000000
Of 0.000000 0.000000 0.000000
Ro 0.000000 0.000000 0.000000
$EndSHAPE3D
$EndMODULE  R15.5x6_vert
$MODULE R22x8_vert
Po 0 0 0 15 4E4A4E01 00000000 ~~
Li R22x8_vert
Cd Resistor, 22x8 mm, vertical
Kw R
Sc 00000000
AR
Op 0 A 0
T0 0 -2362 550 500 0 80 N V 21 N"R***"
T1 0 2441 550 500 0 80 N I 21 N"R22x8_vert"
DS 0 0 3268 0 100 21
DC 0 0 -1969 0 100 21
$PAD
Sh "1" C 1181 1181 0 0 0
Dr 394 0 0
At STD N 00E0FFFF
Ne 0 ""
Po 0 0
$EndPAD
$PAD
Sh "2" C 1181 1181 0 0 0
Dr 394 0 0
At STD N 00E0FFFF
Ne 0 ""
Po 3250 0
$EndPAD
$SHAPE3D
Na "walter\pth_resistors\r22x8vert.wrl"
Sc 1.000000 1.000000 1.000000
Of 0.000000 0.000000 0.000000
Ro 0.000000 0.000000 0.000000
$EndSHAPE3D
$EndMODULE  R22x8_vert
$MODULE R25x8_vert
Po 0 0 0 15 4E4A4E01 00000000 ~~
Li R25x8_vert
Cd Resistor, 25x8 mm, vertical
Kw R
Sc 00000000
AR 
Op 0 A 0
T0 0 -2362 550 500 0 80 N V 21 N"R***"
T1 0 2441 550 500 0 80 N I 21 N"R25x8_vert"
DS 0 0 3268 0 100 21
DC 0 0 -1969 0 100 21
$PAD
Sh "1" C 1181 1181 0 0 0
Dr 394 0 0
At STD N 00E0FFFF
Ne 0 ""
Po 0 0
$EndPAD
$PAD
Sh "2" C 1181 1181 0 0 0
Dr 394 0 0
At STD N 00E0FFFF
Ne 0 ""
Po 3250 0
$EndPAD
$SHAPE3D
Na "walter\pth_resistors\r25x8vert.wrl"
Sc 1.000000 1.000000 1.000000
Of 0.000000 0.000000 0.000000
Ro 0.000000 0.000000 0.000000
$EndSHAPE3D
$EndMODULE  R25x8_vert
$EndLIBRARY
