(module GPWR555 (layer F.Cu) (tedit 5E4E9367)
  (fp_text reference REF** (at -17.78 -6.096) (layer F.SilkS)
    (effects (font (size 1 1) (thickness 0.15)))
  )
  (fp_text value GPWR555 (at -16.51 -6.096) (layer F.Fab)
    (effects (font (size 1 1) (thickness 0.15)))
  )
  (fp_line (start 20.32 1.27) (end -19.05 1.27) (layer F.SilkS) (width 0.15))
  (fp_line (start 20.32 -5.08) (end 20.32 1.27) (layer F.SilkS) (width 0.15))
  (fp_line (start -20.32 -5.08) (end 20.32 -5.08) (layer F.SilkS) (width 0.15))
  (fp_line (start -20.32 0) (end -20.32 -5.08) (layer F.SilkS) (width 0.15))
  (fp_line (start -20.32 0) (end -19.05 1.27) (layer F.SilkS) (width 0.15))
  (fp_line (start -20.32 -5.08) (end 20.32 -5.08) (layer F.Fab) (width 0.12))
  (fp_line (start 20.32 -5.08) (end 20.32 1.524) (layer F.Fab) (width 0.12))
  (fp_line (start 20.32 1.524) (end -19.304 1.524) (layer F.Fab) (width 0.12))
  (fp_line (start -19.304 1.524) (end -20.32 0.508) (layer F.Fab) (width 0.12))
  (fp_line (start -20.32 0.508) (end -20.32 -5.08) (layer F.Fab) (width 0.12))
  (fp_text user REF** (at -17.78 -7.62) (layer F.Fab)
    (effects (font (size 1 1) (thickness 0.15)))
  )
  (pad 4 thru_hole oval (at -1.27 0) (size 1.6 2) (drill 0.8) (layers *.Cu *.Mask))
  (pad 6 thru_hole oval (at 3.81 0) (size 1.6 2) (drill 0.8) (layers *.Cu *.Mask))
  (pad 5 thru_hole oval (at 1.27 0) (size 1.6 2) (drill 0.8) (layers *.Cu *.Mask))
  (pad 2 thru_hole oval (at -6.35 0) (size 1.6 2) (drill 0.8) (layers *.Cu *.Mask))
  (pad 1 thru_hole rect (at -8.89 0) (size 1.6 2) (drill 0.8) (layers *.Cu *.Mask))
  (pad 3 thru_hole oval (at -3.81 0) (size 1.6 2) (drill 0.8) (layers *.Cu *.Mask))
  (pad 7 thru_hole oval (at 6.35 0) (size 1.6 2) (drill 0.8) (layers *.Cu *.Mask))
  (pad 8 thru_hole oval (at 8.89 0) (size 1.6 2) (drill 0.8) (layers *.Cu *.Mask))
)
