PCBNEW-LibModule-V1  23.5.2012 20:14:34
# encoding utf-8
$INDEX
Emb2_5
Emb3_5
Emb4_5
Emb5_5
XY128V-A-2P
XY128V-A-3P
bornier2_V
bornier3_V
bornier4_V
bornier5_V
bornier6_V
$EndINDEX
$MODULE bornier2_V
Po 0 0 0 15 4FBA7A61 00000000 ~~
Li bornier2_V
Cd Bornier d'alimentation 2 pins
Kw DEV
Sc 00000000
AR
Op 0 0 0
.SolderPasteRatio 1.42782e+240
T0 0 -2000 394 394 0 79 N V 21 N "BORN2_V"
T1 0 -1000 394 394 0 79 N I 21 N "Value"
DS 2000 1000 -2000 1000 120 21
DS 2000 1500 2000 -1500 120 21
DS 2000 -1500 -2000 -1500 120 21
DS -2000 -1500 -2000 1500 120 21
DS -2000 1500 2000 1500 120 21
$PAD
Sh "1" R 1000 1000 0 0 0
Dr 482 0 0
At STD N 00E0FFFF
Ne 0 ""
Po -1000 0
$EndPAD
$PAD
Sh "2" C 1000 1000 0 0 0
Dr 482 0 0
At STD N 00E0FFFF
Ne 0 ""
Po 1000 0
$EndPAD
$SHAPE3D
Na "Terminal\\bornier_2.wrl"
Sc 1.000000 1.000000 1.000000
Of 0.000000 0.000000 0.000000
Ro 0.000000 0.000000 0.000000
$EndSHAPE3D
$EndMODULE  bornier2_V
$MODULE bornier4_V
Po 0 0 0 15 4FBA7A99 00000000 ~~
Li bornier4_V
Cd Bornier d'alimentation 4 pins
Kw DEV
Sc 00000000
AR
Op 0 0 0
T0 0 -1900 394 394 0 79 N V 21 N "BORN4_V"
T1 0 -1100 394 394 0 79 N I 21 N "Value"
DS -4000 -1500 -4000 1500 120 21
DS 4000 1500 4000 -1500 120 21
DS 4000 1000 -4000 1000 120 21
DS -4000 -1500 4000 -1500 120 21
DS -4000 1500 4000 1500 120 21
$PAD
Sh "2" C 1500 1500 0 0 0
Dr 482 0 0
At STD N 00E0FFFF
Ne 0 ""
Po -1000 0
$EndPAD
$PAD
Sh "3" C 1500 1500 0 0 0
Dr 482 0 0
At STD N 00E0FFFF
Ne 0 ""
Po 1000 0
$EndPAD
$PAD
Sh "1" R 1500 1500 0 0 0
Dr 482 0 0
At STD N 00E0FFFF
Ne 0 ""
Po -3000 0
$EndPAD
$PAD
Sh "4" C 1500 1500 0 0 0
Dr 482 0 0
At STD N 00E0FFFF
Ne 0 ""
Po 3000 0
$EndPAD
$SHAPE3D
Na "Terminal\\bornier_4.wrl"
Sc 1.000000 1.000000 1.000000
Of 0.000000 0.000000 0.000000
Ro 0.000000 0.000000 0.000000
$EndSHAPE3D
$EndMODULE  bornier4_V
$MODULE bornier3_V
Po 0 0 0 15 4FBA7A30 00000000 ~~
Li bornier3_V
Cd Bornier d'alimentation 3 pins
Kw DEV
Sc 00000000
AR
Op 0 0 0
T0 0 -2000 394 394 0 79 N V 21 N "bornier3_V"
T1 0 -1000 394 394 0 79 N I 21 N "Value"
DS -3000 1500 -3000 -1500 120 21
DS 3000 1500 3000 -1500 120 21
DS -3000 1000 3000 1000 120 21
DS -3000 -1500 3000 -1500 120 21
DS -3000 1500 3000 1500 120 21
$PAD
Sh "1" R 1000 1000 0 0 0
Dr 482 0 0
At STD N 00E0FFFF
Ne 0 ""
Po -2000 0
$EndPAD
$PAD
Sh "2" C 1000 1000 0 0 0
Dr 482 0 0
At STD N 00E0FFFF
Ne 0 ""
Po 0 0
$EndPAD
$PAD
Sh "3" C 1000 1000 0 0 0
Dr 482 0 0
At STD N 00E0FFFF
Ne 0 ""
Po 2000 0
$EndPAD
$SHAPE3D
Na "Terminal\\bornier_3.wrl"
Sc 1.000000 1.000000 1.000000
Of 0.000000 0.000000 0.000000
Ro 0.000000 0.000000 0.000000
$EndSHAPE3D
$EndMODULE  bornier3_V
$MODULE bornier5_V
Po 0 0 0 15 4FBA7AF2 00000000 ~~
Li bornier5_V
Cd Bornier d'alimentation 4 pins
Kw DEV
Sc 00000000
AR
Op 0 0 0
T0 0 -1900 394 394 0 79 N V 21 N "BORN5_V"
T1 0 -1100 394 394 0 79 N I 21 N "Value"
DS 5000 1500 -5000 1500 150 21
DS 5000 -1500 -5000 -1500 150 21
DS 5000 1000 -5000 1000 150 21
DS -5000 -1500 -5000 1500 120 21
DS 5000 1500 5000 -1500 120 21
$PAD
Sh "2" C 1500 1500 0 0 0
Dr 482 0 0
At STD N 00E0FFFF
Ne 0 ""
Po -2000 0
$EndPAD
$PAD
Sh "3" C 1500 1500 0 0 0
Dr 482 0 0
At STD N 00E0FFFF
Ne 0 ""
Po 0 0
$EndPAD
$PAD
Sh "1" R 1500 1500 0 0 0
Dr 482 0 0
At STD N 00E0FFFF
Ne 0 ""
Po -4000 0
$EndPAD
$PAD
Sh "4" C 1500 1500 0 0 0
Dr 482 0 0
At STD N 00E0FFFF
Ne 0 ""
Po 2000 0
$EndPAD
$PAD
Sh "5" C 1500 1500 0 0 0
Dr 482 0 0
At STD N 00E0FFFF
Ne 0 ""
Po 4000 0
$EndPAD
$SHAPE3D
Na "Terminal\\bornier_5.wrl"
Sc 1.000000 1.000000 1.000000
Of 0.000000 0.000000 0.000000
Ro 0.000000 0.000000 0.000000
$EndSHAPE3D
$EndMODULE  bornier5_V
$MODULE bornier6_V
Po 0 0 0 15 4FBA7B26 00000000 ~~
Li bornier6_V
Cd Bornier d'alimentation 4 pins
Kw DEV
Sc 00000000
AR
Op 0 0 0
T0 0 -1950 394 394 0 79 N V 21 N "BORN6_V"
T1 0 -1100 394 394 0 79 N I 21 N "Value"
DS -6000 -1500 -6000 1500 120 21
DS 6000 1500 6000 -1500 120 21
DS -6000 1000 6000 1000 120 21
DS -6000 -1500 6000 -1500 120 21
DS -6000 1500 6000 1500 120 21
$PAD
Sh "2" C 1500 1500 0 0 0
Dr 482 0 0
At STD N 00E0FFFF
Ne 0 ""
Po -3000 0
$EndPAD
$PAD
Sh "3" C 1500 1500 0 0 0
Dr 482 0 0
At STD N 00E0FFFF
Ne 0 ""
Po -1000 0
$EndPAD
$PAD
Sh "1" R 1500 1500 0 0 0
Dr 482 0 0
At STD N 00E0FFFF
Ne 0 ""
Po -5000 0
$EndPAD
$PAD
Sh "4" C 1500 1500 0 0 0
Dr 482 0 0
At STD N 00E0FFFF
Ne 0 ""
Po 1000 0
$EndPAD
$PAD
Sh "5" C 1500 1500 0 0 0
Dr 482 0 0
At STD N 00E0FFFF
Ne 0 ""
Po 3000 0
$EndPAD
$PAD
Sh "6" C 1500 1500 0 0 0
Dr 482 0 0
At STD N 00E0FFFF
Ne 0 ""
Po 5000 0
$EndPAD
$SHAPE3D
Na "Terminal\\bornier_6.wrl"
Sc 1.000000 1.000000 1.000000
Of 0.000000 0.000000 0.000000
Ro 0.000000 0.000000 0.000000
$EndSHAPE3D
$EndMODULE  bornier6_V
$MODULE Emb2_5
Po 0 0 0 15 4FBA7B5D 00000000 ~~
Li Emb2_5
Cd Bornier d'alimentation 4 pins
Kw DEV
Sc 00000000
AR
Op 0 0 0
T0 0 -1950 394 394 0 79 N V 21 N "Emb2_5"
T1 0 2000 394 394 0 79 N I 21 N "Value"
DS -2000 -1500 2000 -1500 150 21
DS 2000 -1250 -2000 -1250 150 21
DS -2000 1500 2000 1500 150 21
DA 1000 0 2000 1000 900 150 21
DA -1000 0 0 1000 900 150 21
DS -2000 -1500 -2000 1500 120 21
DS 2000 1500 2000 -1500 120 21
$PAD
Sh "2" C 1500 1500 0 0 0
Dr 600 0 0
At STD N 00E0FFFF
Ne 0 ""
Po 1000 0
$EndPAD
$PAD
Sh "1" R 1500 1500 0 0 0
Dr 600 0 0
At STD N 00E0FFFF
Ne 0 ""
Po -1000 0
$EndPAD
$SHAPE3D
Na "Terminal\\conn_2_embrochable.wrl"
Sc 1.000000 1.000000 1.000000
Of 0.000000 0.000000 0.000000
Ro 270.000000 0.000000 90.000000
$EndSHAPE3D
$EndMODULE  Emb2_5
$MODULE Emb3_5
Po 0 0 0 15 4FBA7BD7 00000000 ~~
Li Emb3_5
Cd Bornier d'alimentation 4 pins
Kw DEV
Sc 00000000
AR
Op 0 0 0
T0 0 -1950 394 394 0 79 N V 21 N "Emb3_5"
T1 0 2000 394 394 0 79 N I 21 N "Value"
DS -3000 1500 3000 1500 150 21
DS -3000 -1500 3000 -1500 150 21
DS 3000 -1000 -3000 -1000 150 21
DA 0 0 1000 1000 900 150 21
DA 2000 0 3000 1000 900 150 21
DA -2000 0 -1000 1000 900 150 21
DS -3000 -1500 -3000 1500 120 21
DS 3000 1500 3000 -1500 120 21
$PAD
Sh "2" C 1500 1500 0 0 0
Dr 600 0 0
At STD N 00E0FFFF
Ne 0 ""
Po 0 0
$EndPAD
$PAD
Sh "3" C 1500 1500 0 0 0
Dr 600 0 0
At STD N 00E0FFFF
Ne 0 ""
Po 2000 0
$EndPAD
$PAD
Sh "1" R 1500 1500 0 0 0
Dr 600 0 0
At STD N 00E0FFFF
Ne 0 ""
Po -2000 0
$EndPAD
$SHAPE3D
Na "Terminal/conn_3_embrochable.wrl"
Sc 1.000000 1.000000 1.000000
Of 0.000000 0.000000 0.000000
Ro 270.000000 0.000000 90.000000
$EndSHAPE3D
$EndMODULE  Emb3_5
$MODULE Emb4_5
Po 0 0 0 15 4FBA7BFA 00000000 ~~
Li Emb4_5
Cd Bornier d'alimentation 4 pins
Kw DEV
Sc 00000000
AR
Op 0 0 0
T0 0 -1900 394 394 0 79 N V 21 N "Emb4_5"
T1 0 2000 394 394 0 79 N I 21 N "Value"
DA -1000 0 0 1000 900 150 21
DA 1000 0 2000 1000 900 150 21
DA 3000 0 4000 1000 900 150 21
DA -3000 0 -2000 1000 900 150 21
DS -4000 -1000 4000 -1000 150 21
DS -4000 -1500 -4000 1500 120 21
DS 4000 1500 4000 -1500 120 21
DS -4000 -1500 4000 -1500 120 21
DS -4000 1500 4000 1500 120 21
$PAD
Sh "2" C 1500 1500 0 0 0
Dr 600 0 0
At STD N 00E0FFFF
Ne 0 ""
Po -1000 0
$EndPAD
$PAD
Sh "3" C 1500 1500 0 0 0
Dr 600 0 0
At STD N 00E0FFFF
Ne 0 ""
Po 1000 0
$EndPAD
$PAD
Sh "1" R 1500 1500 0 0 0
Dr 600 0 0
At STD N 00E0FFFF
Ne 0 ""
Po -3000 0
$EndPAD
$PAD
Sh "4" C 1500 1500 0 0 0
Dr 600 0 0
At STD N 00E0FFFF
Ne 0 ""
Po 3000 0
$EndPAD
$SHAPE3D
Na "Terminal/conn_4_embrochable.wrl"
Sc 1.000000 1.000000 1.000000
Of 0.000000 0.000000 0.000000
Ro 270.000000 0.000000 90.000000
$EndSHAPE3D
$EndMODULE  Emb4_5
$MODULE Emb5_5
Po 0 0 0 15 4FBA7C1F 00000000 ~~
Li Emb5_5
Cd Bornier d'alimentation 4 pins
Kw DEV
Sc 00000000
AR
Op 0 0 0
T0 0 -1900 394 394 0 79 N V 21 N "Emb5_5"
T1 0 2000 394 394 0 79 N I 21 N "Value"
DS 3000 -1500 -5000 -1500 150 21
DS 5000 1500 -5000 1500 150 21
DS 3000 -1500 5000 -1500 150 21
DS 3000 -1000 5000 -1000 150 21
DA 4000 0 5000 1000 900 150 21
DA -2000 0 -1000 1000 900 150 21
DA 0 0 1000 1000 900 150 21
DA 2000 0 3000 1000 900 150 21
DA -4000 0 -3000 1000 900 150 21
DS -5000 -1000 3000 -1000 150 21
DS -5000 -1500 -5000 1500 120 21
DS 5000 1500 5000 -1500 120 21
$PAD
Sh "2" C 1500 1500 0 0 0
Dr 600 0 0
At STD N 00E0FFFF
Ne 0 ""
Po -2000 0
$EndPAD
$PAD
Sh "3" C 1500 1500 0 0 0
Dr 600 0 0
At STD N 00E0FFFF
Ne 0 ""
Po 0 0
$EndPAD
$PAD
Sh "1" R 1500 1500 0 0 0
Dr 600 0 0
At STD N 00E0FFFF
Ne 0 ""
Po -4000 0
$EndPAD
$PAD
Sh "4" C 1500 1500 0 0 0
Dr 600 0 0
At STD N 00E0FFFF
Ne 0 ""
Po 2000 0
$EndPAD
$PAD
Sh "5" C 1496 1496 0 0 0
Dr 320 0 0
At STD N 00E0FFFF
Ne 0 ""
Po 4000 0
$EndPAD
$SHAPE3D
Na "Terminal/conn_5_embrochable.wrl"
Sc 1.000000 1.000000 1.000000
Of 0.000000 0.000000 0.000000
Ro 270.000000 0.000000 90.000000
$EndSHAPE3D
$EndMODULE  Emb5_5
$MODULE XY128V-A-2P
Po 0 0 0 15 4FBD28A9 00000000 ~~
Li XY128V-A-2P
Cd Bornier d'alimentation 2 pins
Kw DEV
Sc 00000000
AR
Op 0 0 0
T0 0 -2500 394 394 0 79 N V 21 N "XY128V-A-2P"
T1 0 1500 394 394 0 79 N I 21 N "Value"
DS 1969 1024 -1969 1024 120 21
DS -1969 -1496 1969 -1496 120 21
DS -1969 -2126 1969 -2126 120 21
DS 1969 -2126 1969 1890 120 21
DS 1969 1890 -1969 1890 120 21
DS -1969 1890 -1969 -2126 120 21
$PAD
Sh "1" C 1000 1000 0 0 0
Dr 591 0 0
At STD N 00E0FFFF
Ne 0 ""
Po -984 0
$EndPAD
$PAD
Sh "2" C 1000 1000 0 0 0
Dr 591 0 0
At STD N 00E0FFFF
Ne 0 ""
Po 984 0
$EndPAD
$SHAPE3D
Na "Terminal\\bornier_XY128V_2.wrl"
Sc 1.000000 1.000000 1.000000
Of 0.000000 0.000000 0.000000
Ro 0.000000 0.000000 0.000000
$EndSHAPE3D
$EndMODULE  XY128V-A-2P
$MODULE XY128V-A-3P
Po 0 0 0 15 4FBD28F1 00000000 ~~
Li XY128V-A-3P
Cd Bornier d'alimentation 2 pins
Kw DEV
Sc 00000000
AR 
Op 0 0 0
T0 0 -2500 394 394 0 79 N V 21 N "XY128V-A-3P"
T1 0 1500 394 394 0 79 N I 21 N "Value"
DS 984 1024 2953 1024 120 21
DS 906 -1496 2953 -1496 120 21
DS 984 -2126 2953 -2126 120 21
DS 2953 -2126 2953 1890 120 21
DS 2953 1890 984 1890 120 21
DS 985 1024 -2953 1024 120 21
DS -2953 -1496 985 -1496 120 21
DS -2953 -2126 985 -2126 120 21
DS 985 1890 -2953 1890 120 21
DS -2953 1890 -2953 -2126 120 21
$PAD
Sh "1" C 1000 1000 0 0 0
Dr 591 0 0
At STD N 00E0FFFF
Ne 0 ""
Po -1968 0
$EndPAD
$PAD
Sh "2" C 1000 1000 0 0 0
Dr 591 0 0
At STD N 00E0FFFF
Ne 0 ""
Po 0 0
$EndPAD
$PAD
Sh "3" C 1000 1000 0 0 0
Dr 591 0 0
At STD N 00E0FFFF
Ne 0 ""
Po 1969 0
$EndPAD
$SHAPE3D
Na "Terminal\\bornier_XY128V_3.wrl"
Sc 1.000000 1.000000 1.000000
Of 0.000000 0.000000 0.000000
Ro 0.000000 0.000000 0.000000
$EndSHAPE3D
$EndMODULE  XY128V-A-3P
$EndLIBRARY
