PCBNEW-LibModule-V1  gio 18 ago 2011 12:32:55 CEST
$INDEX
dil_14-300_socket
dil_16-300_socket
dil_18-300_socket
dil_20-300_socket
dil_22-300_socket
dil_24-300_socket
dil_28-300_socket
dil_8-300_socket
dil_6-300_socket
dil_40-600_socket
dil_6-300
dil_8-300
dil_14-300
dil_16-300
dil_18-300
dil_20-300
dil_22-300
dil_24-300
dil_28-300
dil_24-600_socket
dil_24-600
dil_28-600_socket
dil_28-600
dil_40-600
dil_48-600_socket
dil_48-600
$EndINDEX
$MODULE dil_6-300_socket
Po 0 0 0 15 4E4CD333 00000000 ~~
Li dil_6-300_socket
Cd IC, DIL6 x 0,3", with socket
Kw DIL
Sc 00000000
AR
Op 0 0 0
T0 0 -2500 600 450 0 113 N V 21 N"U***"
T1 0 2600 600 450 0 113 N V 21 N"DIL_6-300_socket"
DA -1500 0 -1500 -500 900 100 21
DA -1500 0 -1000 0 900 100 21
DS -1500 500 -1900 500 150 21
DS -1500 -500 -1900 -500 150 21
DS -300 -500 -300 500 100 21
DS -300 500 300 500 100 21
DS 300 500 300 -500 100 21
DS 300 -500 -300 -500 100 21
DS -1500 -2000 1500 -2000 150 21
DS 1500 -2000 1500 2000 150 21
DS 1500 2000 -1500 2000 150 21
DS -1500 2000 -1500 -2000 150 21
DS 1900 -1300 1900 1300 150 21
DS 1900 1300 -1900 1300 150 21
DS -1900 1300 -1900 -1300 150 21
DS -1900 -1300 1900 -1300 150 21
$PAD
Sh "1" O 591 866 0 0 0
Dr 315 0 0
At STD N 00E0FFFF
Ne 0 ""
Po -1000 1500
$EndPAD
$PAD
Sh "2" O 591 866 0 0 0
Dr 315 0 0
At STD N 00E0FFFF
Ne 0 ""
Po 0 1500
$EndPAD
$PAD
Sh "3" O 591 866 0 0 0
Dr 315 0 0
At STD N 00E0FFFF
Ne 0 ""
Po 1000 1500
$EndPAD
$PAD
Sh "4" O 591 866 0 0 0
Dr 315 0 0
At STD N 00E0FFFF
Ne 0 ""
Po 1000 -1500
$EndPAD
$PAD
Sh "5" O 591 866 0 0 0
Dr 315 0 0
At STD N 00E0FFFF
Ne 0 ""
Po 0 -1500
$EndPAD
$PAD
Sh "6" O 591 866 0 0 0
Dr 315 0 0
At STD N 00E0FFFF
Ne 0 ""
Po -1000 -1500
$EndPAD
$SHAPE3D
Na "walter\pth_circuits\dil_6-300_socket.wrl"
Sc 1.000000 1.000000 1.000000
Of 0.000000 0.000000 0.000000
Ro 0.000000 0.000000 0.000000
$EndSHAPE3D
$EndMODULE  dil_6-300_socket
$MODULE dil_6-300
Po 0 0 0 15 4E4CD3CF 00000000 ~~
Li dil_6-300
Cd IC, DIL6 x 0,3"
Kw DIL
Sc 00000000
AR
Op 0 0 0
T0 0 -2520 600 450 0 113 N V 21 N"U***"
T1 0 2520 600 450 0 113 N V 21 N"DIL_6-300"
DS -1500 -500 -1900 -500 150 21
DS -1500 500 -1900 500 150 21
DS 1900 -1300 1900 1300 150 21
DS 1900 1300 -1900 1300 150 21
DS -1900 1300 -1900 -1300 150 21
DS -1900 -1300 1900 -1300 150 21
DS -1500 -500 -1500 500 150 21
$PAD
Sh "1" O 591 866 0 0 0
Dr 315 0 0
At STD N 00E0FFFF
Ne 0 ""
Po -1000 1500
$EndPAD
$PAD
Sh "2" O 591 866 0 0 0
Dr 315 0 0
At STD N 00E0FFFF
Ne 0 ""
Po 0 1500
$EndPAD
$PAD
Sh "3" O 591 866 0 0 0
Dr 315 0 0
At STD N 00E0FFFF
Ne 0 ""
Po 1000 1500
$EndPAD
$PAD
Sh "4" O 591 866 0 0 0
Dr 315 0 0
At STD N 00E0FFFF
Ne 0 ""
Po 1000 -1500
$EndPAD
$PAD
Sh "5" O 591 866 0 0 0
Dr 315 0 0
At STD N 00E0FFFF
Ne 0 ""
Po 0 -1500
$EndPAD
$PAD
Sh "6" O 591 866 0 0 0
Dr 315 0 0
At STD N 00E0FFFF
Ne 0 ""
Po -1000 -1500
$EndPAD
$SHAPE3D
Na "walter\pth_circuits\dil_6-300.wrl"
Sc 1.000000 1.000000 1.000000
Of 0.000000 0.000000 0.000000
Ro 0.000000 0.000000 0.000000
$EndSHAPE3D
$EndMODULE  dil_6-300
$MODULE dil_8-300
Po 0 0 0 15 4E4CD4E4 00000000 ~~
Li dil_8-300
Cd IC, DIL8 x 0,3"
Kw DIL
Sc 00000000
AR
Op 0 0 0
T0 0 -2520 600 450 0 113 N V 21 N"U***"
T1 0 2520 600 450 0 113 N V 21 N"DIL_8-300"
DS 2400 1300 -2400 1300 150 21
DS -2400 -1300 2400 -1300 150 21
DS -2000 -500 -2400 -500 150 21
DS -2000 500 -2400 500 150 21
DS 2400 -1300 2400 1300 150 21
DS -2400 1300 -2400 -1300 150 21
DS -2000 -500 -2000 500 150 21
$PAD
Sh "1" O 591 866 0 0 0
Dr 315 0 0
At STD N 00E0FFFF
Ne 0 ""
Po -1500 1500
$EndPAD
$PAD
Sh "2" O 591 866 0 0 0
Dr 315 0 0
At STD N 00E0FFFF
Ne 0 ""
Po -500 1500
$EndPAD
$PAD
Sh "3" O 591 866 0 0 0
Dr 315 0 0
At STD N 00E0FFFF
Ne 0 ""
Po 500 1500
$EndPAD
$PAD
Sh "4" O 591 866 0 0 0
Dr 315 0 0
At STD N 00E0FFFF
Ne 0 ""
Po 1500 1500
$EndPAD
$PAD
Sh "5" O 591 866 0 0 0
Dr 315 0 0
At STD N 00E0FFFF
Ne 0 ""
Po 1500 -1500
$EndPAD
$PAD
Sh "6" O 591 866 0 0 0
Dr 315 0 0
At STD N 00E0FFFF
Ne 0 ""
Po 500 -1500
$EndPAD
$PAD
Sh "7" O 591 866 0 0 0
Dr 315 0 0
At STD N 00E0FFFF
Ne 0 ""
Po -500 -1500
$EndPAD
$PAD
Sh "8" O 591 866 0 0 0
Dr 315 0 0
At STD N 00E0FFFF
Ne 0 ""
Po -1500 -1500
$EndPAD
$SHAPE3D
Na "walter\pth_circuits\dil_8-300.wrl"
Sc 1.000000 1.000000 1.000000
Of 0.000000 0.000000 0.000000
Ro 0.000000 0.000000 0.000000
$EndSHAPE3D
$EndMODULE  dil_8-300
$MODULE dil_8-300_socket
Po 0 0 0 15 4E4CD59F 00000000 ~~
Li dil_8-300_socket
Cd IC, DIL8 x 0,3", with socket
Kw DIL
Sc 00000000
AR
Op 0 0 0
T0 0 -2500 600 450 0 113 N V 21 N"U***"
T1 0 2600 600 450 0 113 N V 21 N"DIL_8-300_socket"
DS 800 500 -800 500 100 21
DS -800 -500 800 -500 100 21
DS 2000 2000 -2000 2000 150 21
DS -2400 1300 2400 1300 150 21
DS 2000 -2000 -2000 -2000 150 21
DS -2400 -1300 2400 -1300 150 21
DA -2000 0 -2000 -500 900 100 21
DA -2000 0 -1500 0 900 100 21
DS -2000 500 -2400 500 150 21
DS -2000 -500 -2400 -500 150 21
DS -800 -500 -800 500 100 21
DS 800 500 800 -500 100 21
DS 2000 -2000 2000 2000 150 21
DS -2000 2000 -2000 -2000 150 21
DS 2400 -1300 2400 1300 150 21
DS -2400 1300 -2400 -1300 150 21
$PAD
Sh "1" O 591 866 0 0 0
Dr 315 0 0
At STD N 00E0FFFF
Ne 0 ""
Po -1500 1500
$EndPAD
$PAD
Sh "2" O 591 866 0 0 0
Dr 315 0 0
At STD N 00E0FFFF
Ne 0 ""
Po -500 1500
$EndPAD
$PAD
Sh "3" O 591 866 0 0 0
Dr 315 0 0
At STD N 00E0FFFF
Ne 0 ""
Po 500 1500
$EndPAD
$PAD
Sh "4" O 591 866 0 0 0
Dr 315 0 0
At STD N 00E0FFFF
Ne 0 ""
Po 1500 1500
$EndPAD
$PAD
Sh "5" O 591 866 0 0 0
Dr 315 0 0
At STD N 00E0FFFF
Ne 0 ""
Po 1500 -1500
$EndPAD
$PAD
Sh "6" O 591 866 0 0 0
Dr 315 0 0
At STD N 00E0FFFF
Ne 0 ""
Po 500 -1500
$EndPAD
$PAD
Sh "7" O 591 866 0 0 0
Dr 315 0 0
At STD N 00E0FFFF
Ne 0 ""
Po -500 -1500
$EndPAD
$PAD
Sh "8" O 591 866 0 0 0
Dr 315 0 0
At STD N 00E0FFFF
Ne 0 ""
Po -1500 -1500
$EndPAD
$SHAPE3D
Na "walter\pth_circuits\dil_8-300_socket.wrl"
Sc 1.000000 1.000000 1.000000
Of 0.000000 0.000000 0.000000
Ro 0.000000 0.000000 0.000000
$EndSHAPE3D
$EndMODULE  dil_8-300_socket
$MODULE dil_14-300_socket
Po 0 0 0 15 4E4CD8C8 00000000 ~~
Li dil_14-300_socket
Cd IC, DIL14 x 0,3", with socket
Kw DIL
Sc 00000000
AR
Op 0 0 0
T0 0 -2500 600 450 0 113 N V 21 N"U***"
T1 0 2600 600 450 0 113 N V 21 N"DIL_14-300_socket"
DS 3500 -2000 -3500 -2000 150 21
DS -3500 2000 3500 2000 150 21
DS 3900 1300 -3900 1300 150 21
DS -3900 -1300 3900 -1300 150 21
DS 2300 500 -2300 500 100 21
DS -2300 -500 2300 -500 100 21
DA -3500 0 -3500 -500 900 100 21
DA -3500 0 -3000 0 900 100 21
DS -3500 500 -3900 500 150 21
DS -3500 -500 -3900 -500 150 21
DS -2300 -500 -2300 500 100 21
DS 2300 500 2300 -500 100 21
DS 3500 -2000 3500 2000 150 21
DS -3500 2000 -3500 -2000 150 21
DS 3900 -1300 3900 1300 150 21
DS -3900 1300 -3900 -1300 150 21
$PAD
Sh "1" O 591 866 0 0 0
Dr 315 0 0
At STD N 00E0FFFF
Ne 0 ""
Po -3000 1500
$EndPAD
$PAD
Sh "2" O 591 866 0 0 0
Dr 315 0 0
At STD N 00E0FFFF
Ne 0 ""
Po -2000 1500
$EndPAD
$PAD
Sh "3" O 591 866 0 0 0
Dr 315 0 0
At STD N 00E0FFFF
Ne 0 ""
Po -1000 1500
$EndPAD
$PAD
Sh "4" O 591 866 0 0 0
Dr 315 0 0
At STD N 00E0FFFF
Ne 0 ""
Po 0 1500
$EndPAD
$PAD
Sh "5" O 591 866 0 0 0
Dr 315 0 0
At STD N 00E0FFFF
Ne 0 ""
Po 1000 1500
$EndPAD
$PAD
Sh "6" O 591 866 0 0 0
Dr 315 0 0
At STD N 00E0FFFF
Ne 0 ""
Po 2000 1500
$EndPAD
$PAD
Sh "7" O 591 866 0 0 0
Dr 315 0 0
At STD N 00E0FFFF
Ne 0 ""
Po 3000 1500
$EndPAD
$PAD
Sh "8" O 591 866 0 0 0
Dr 315 0 0
At STD N 00E0FFFF
Ne 0 ""
Po 3000 -1500
$EndPAD
$PAD
Sh "9" O 591 866 0 0 0
Dr 315 0 0
At STD N 00E0FFFF
Ne 0 ""
Po 2000 -1500
$EndPAD
$PAD
Sh "10" O 591 866 0 0 0
Dr 315 0 0
At STD N 00E0FFFF
Ne 0 ""
Po 1000 -1500
$EndPAD
$PAD
Sh "11" O 591 866 0 0 0
Dr 315 0 0
At STD N 00E0FFFF
Ne 0 ""
Po 0 -1500
$EndPAD
$PAD
Sh "12" O 591 866 0 0 0
Dr 315 0 0
At STD N 00E0FFFF
Ne 0 ""
Po -1000 -1500
$EndPAD
$PAD
Sh "13" O 591 866 0 0 0
Dr 315 0 0
At STD N 00E0FFFF
Ne 0 ""
Po -2000 -1500
$EndPAD
$PAD
Sh "14" O 591 866 0 0 0
Dr 315 0 0
At STD N 00E0FFFF
Ne 0 ""
Po -3000 -1500
$EndPAD
$SHAPE3D
Na "walter\pth_circuits\dil_14-300_socket.wrl"
Sc 1.000000 1.000000 1.000000
Of 0.000000 0.000000 0.000000
Ro 0.000000 0.000000 0.000000
$EndSHAPE3D
$EndMODULE  dil_14-300_socket
$MODULE dil_14-300
Po 0 0 0 15 4E4CD90A 00000000 ~~
Li dil_14-300
Cd IC, DIL14 x 0,3"
Kw DIL
Sc 00000000
AR
Op 0 0 0
T0 0 -2500 600 450 0 113 N V 21 N"U***"
T1 0 2600 600 450 0 113 N V 21 N"DIL_14-300"
DS -3500 -500 -3500 500 150 21
DS 3900 1300 -3900 1300 150 21
DS -3900 -1300 3900 -1300 150 21
DS -3500 500 -3900 500 150 21
DS -3500 -500 -3900 -500 150 21
DS 3900 -1300 3900 1300 150 21
DS -3900 1300 -3900 -1300 150 21
$PAD
Sh "1" O 591 866 0 0 0
Dr 315 0 0
At STD N 00E0FFFF
Ne 0 ""
Po -3000 1500
$EndPAD
$PAD
Sh "2" O 591 866 0 0 0
Dr 315 0 0
At STD N 00E0FFFF
Ne 0 ""
Po -2000 1500
$EndPAD
$PAD
Sh "3" O 591 866 0 0 0
Dr 315 0 0
At STD N 00E0FFFF
Ne 0 ""
Po -1000 1500
$EndPAD
$PAD
Sh "4" O 591 866 0 0 0
Dr 315 0 0
At STD N 00E0FFFF
Ne 0 ""
Po 0 1500
$EndPAD
$PAD
Sh "5" O 591 866 0 0 0
Dr 315 0 0
At STD N 00E0FFFF
Ne 0 ""
Po 1000 1500
$EndPAD
$PAD
Sh "6" O 591 866 0 0 0
Dr 315 0 0
At STD N 00E0FFFF
Ne 0 ""
Po 2000 1500
$EndPAD
$PAD
Sh "7" O 591 866 0 0 0
Dr 315 0 0
At STD N 00E0FFFF
Ne 0 ""
Po 3000 1500
$EndPAD
$PAD
Sh "8" O 591 866 0 0 0
Dr 315 0 0
At STD N 00E0FFFF
Ne 0 ""
Po 3000 -1500
$EndPAD
$PAD
Sh "9" O 591 866 0 0 0
Dr 315 0 0
At STD N 00E0FFFF
Ne 0 ""
Po 2000 -1500
$EndPAD
$PAD
Sh "10" O 591 866 0 0 0
Dr 315 0 0
At STD N 00E0FFFF
Ne 0 ""
Po 1000 -1500
$EndPAD
$PAD
Sh "11" O 591 866 0 0 0
Dr 315 0 0
At STD N 00E0FFFF
Ne 0 ""
Po 0 -1500
$EndPAD
$PAD
Sh "12" O 591 866 0 0 0
Dr 315 0 0
At STD N 00E0FFFF
Ne 0 ""
Po -1000 -1500
$EndPAD
$PAD
Sh "13" O 591 866 0 0 0
Dr 315 0 0
At STD N 00E0FFFF
Ne 0 ""
Po -2000 -1500
$EndPAD
$PAD
Sh "14" O 591 866 0 0 0
Dr 315 0 0
At STD N 00E0FFFF
Ne 0 ""
Po -3000 -1500
$EndPAD
$SHAPE3D
Na "walter\pth_circuits\dil_14-300.wrl"
Sc 1.000000 1.000000 1.000000
Of 0.000000 0.000000 0.000000
Ro 0.000000 0.000000 0.000000
$EndSHAPE3D
$EndMODULE  dil_14-300
$MODULE dil_16-300
Po 0 0 0 15 4E4CDAD0 00000000 ~~
Li dil_16-300
Cd IC, DIL16 x 0,3"
Kw DIL
Sc 00000000
AR
Op 0 0 0
T0 0 -2500 600 450 0 113 N V 21 N"U***"
T1 0 2600 600 450 0 113 N V 21 N"DIL_16-300"
DS -4000 -500 -4000 500 150 21
DS 4400 1300 -4400 1300 150 21
DS -4400 -1300 4400 -1300 150 21
DS -4000 500 -4400 500 150 21
DS -4000 -500 -4400 -500 150 21
DS 4400 -1300 4400 1300 150 21
DS -4400 1300 -4400 -1300 150 21
$PAD
Sh "1" O 591 866 0 0 0
Dr 315 0 0
At STD N 00E0FFFF
Ne 0 ""
Po -3500 1500
$EndPAD
$PAD
Sh "2" O 591 866 0 0 0
Dr 315 0 0
At STD N 00E0FFFF
Ne 0 ""
Po -2500 1500
$EndPAD
$PAD
Sh "3" O 591 866 0 0 0
Dr 315 0 0
At STD N 00E0FFFF
Ne 0 ""
Po -1500 1500
$EndPAD
$PAD
Sh "4" O 591 866 0 0 0
Dr 315 0 0
At STD N 00E0FFFF
Ne 0 ""
Po -500 1500
$EndPAD
$PAD
Sh "5" O 591 866 0 0 0
Dr 315 0 0
At STD N 00E0FFFF
Ne 0 ""
Po 500 1500
$EndPAD
$PAD
Sh "6" O 591 866 0 0 0
Dr 315 0 0
At STD N 00E0FFFF
Ne 0 ""
Po 1500 1500
$EndPAD
$PAD
Sh "7" O 591 866 0 0 0
Dr 315 0 0
At STD N 00E0FFFF
Ne 0 ""
Po 2500 1500
$EndPAD
$PAD
Sh "8" O 591 866 0 0 0
Dr 315 0 0
At STD N 00E0FFFF
Ne 0 ""
Po 3500 1500
$EndPAD
$PAD
Sh "9" O 591 866 0 0 0
Dr 315 0 0
At STD N 00E0FFFF
Ne 0 ""
Po 3500 -1500
$EndPAD
$PAD
Sh "10" O 591 866 0 0 0
Dr 315 0 0
At STD N 00E0FFFF
Ne 0 ""
Po 2500 -1500
$EndPAD
$PAD
Sh "11" O 591 866 0 0 0
Dr 315 0 0
At STD N 00E0FFFF
Ne 0 ""
Po 1500 -1500
$EndPAD
$PAD
Sh "12" O 591 866 0 0 0
Dr 315 0 0
At STD N 00E0FFFF
Ne 0 ""
Po 500 -1500
$EndPAD
$PAD
Sh "13" O 591 866 0 0 0
Dr 315 0 0
At STD N 00E0FFFF
Ne 0 ""
Po -500 -1500
$EndPAD
$PAD
Sh "14" O 591 866 0 0 0
Dr 315 0 0
At STD N 00E0FFFF
Ne 0 ""
Po -1500 -1500
$EndPAD
$PAD
Sh "15" O 591 866 0 0 0
Dr 315 0 0
At STD N 00E0FFFF
Ne 0 ""
Po -2500 -1500
$EndPAD
$PAD
Sh "16" O 591 866 0 0 0
Dr 315 0 0
At STD N 00E0FFFF
Ne 0 ""
Po -3500 -1500
$EndPAD
$SHAPE3D
Na "walter\pth_circuits\dil_16-300.wrl"
Sc 1.000000 1.000000 1.000000
Of 0.000000 0.000000 0.000000
Ro 0.000000 0.000000 0.000000
$EndSHAPE3D
$EndMODULE  dil_16-300
$MODULE dil_16-300_socket
Po 0 0 0 15 4E4CDB4A 00000000 ~~
Li dil_16-300_socket
Cd IC, DIL16 x 0,3", with socket
Kw DIL
Sc 00000000
AR
Op 0 0 0
T0 0 -2500 600 450 0 113 N V 21 N"U***"
T1 0 2600 600 450 0 113 N V 21 N"DIL_16-300_socket"
DS 2800 500 -2800 500 100 21
DS -2800 -500 2800 -500 100 21
DS 4000 -2000 -4000 -2000 150 21
DS -4000 2000 4000 2000 150 21
DS 4400 1300 -4400 1300 150 21
DS -4400 -1300 4400 -1300 150 21
DA -4000 0 -4000 -500 900 100 21
DA -4000 0 -3500 0 900 100 21
DS -4000 500 -4400 500 150 21
DS -4000 -500 -4400 -500 150 21
DS -2800 -500 -2800 500 100 21
DS 2800 500 2800 -500 100 21
DS 4000 -2000 4000 2000 150 21
DS -4000 2000 -4000 -2000 150 21
DS 4400 -1300 4400 1300 150 21
DS -4400 1300 -4400 -1300 150 21
$PAD
Sh "1" O 591 866 0 0 0
Dr 315 0 0
At STD N 00E0FFFF
Ne 0 ""
Po -3500 1500
$EndPAD
$PAD
Sh "2" O 591 866 0 0 0
Dr 315 0 0
At STD N 00E0FFFF
Ne 0 ""
Po -2500 1500
$EndPAD
$PAD
Sh "3" O 591 866 0 0 0
Dr 315 0 0
At STD N 00E0FFFF
Ne 0 ""
Po -1500 1500
$EndPAD
$PAD
Sh "4" O 591 866 0 0 0
Dr 315 0 0
At STD N 00E0FFFF
Ne 0 ""
Po -500 1500
$EndPAD
$PAD
Sh "5" O 591 866 0 0 0
Dr 315 0 0
At STD N 00E0FFFF
Ne 0 ""
Po 500 1500
$EndPAD
$PAD
Sh "6" O 591 866 0 0 0
Dr 315 0 0
At STD N 00E0FFFF
Ne 0 ""
Po 1500 1500
$EndPAD
$PAD
Sh "7" O 591 866 0 0 0
Dr 315 0 0
At STD N 00E0FFFF
Ne 0 ""
Po 2500 1500
$EndPAD
$PAD
Sh "8" O 591 866 0 0 0
Dr 315 0 0
At STD N 00E0FFFF
Ne 0 ""
Po 3500 1500
$EndPAD
$PAD
Sh "9" O 591 866 0 0 0
Dr 315 0 0
At STD N 00E0FFFF
Ne 0 ""
Po 3500 -1500
$EndPAD
$PAD
Sh "10" O 591 866 0 0 0
Dr 315 0 0
At STD N 00E0FFFF
Ne 0 ""
Po 2500 -1500
$EndPAD
$PAD
Sh "11" O 591 866 0 0 0
Dr 315 0 0
At STD N 00E0FFFF
Ne 0 ""
Po 1500 -1500
$EndPAD
$PAD
Sh "12" O 591 866 0 0 0
Dr 315 0 0
At STD N 00E0FFFF
Ne 0 ""
Po 500 -1500
$EndPAD
$PAD
Sh "13" O 591 866 0 0 0
Dr 315 0 0
At STD N 00E0FFFF
Ne 0 ""
Po -500 -1500
$EndPAD
$PAD
Sh "14" O 591 866 0 0 0
Dr 315 0 0
At STD N 00E0FFFF
Ne 0 ""
Po -1500 -1500
$EndPAD
$PAD
Sh "15" O 591 866 0 0 0
Dr 315 0 0
At STD N 00E0FFFF
Ne 0 ""
Po -2500 -1500
$EndPAD
$PAD
Sh "16" O 591 866 0 0 0
Dr 315 0 0
At STD N 00E0FFFF
Ne 0 ""
Po -3500 -1500
$EndPAD
$SHAPE3D
Na "walter\pth_circuits\dil_16-300_socket.wrl"
Sc 1.000000 1.000000 1.000000
Of 0.000000 0.000000 0.000000
Ro 0.000000 0.000000 0.000000
$EndSHAPE3D
$EndMODULE  dil_16-300_socket
$MODULE dil_18-300
Po 0 0 0 15 4E4CDCDC 00000000 ~~
Li dil_18-300
Cd IC, DIL18 x 0,3"
Kw DIL
Sc 00000000
AR
Op 0 0 0
T0 0 -2500 600 450 0 113 N V 21 N"U***"
T1 0 2600 600 450 0 113 N V 21 N"DIL_18-300"
DS -4500 -500 -4500 500 150 21
DS -4900 1300 4900 1300 150 21
DS -4900 -1300 4900 -1300 150 21
DS -4500 500 -4900 500 150 21
DS -4500 -500 -4900 -500 150 21
DS 4900 -1300 4900 1300 150 21
DS -4900 1300 -4900 -1300 150 21
$PAD
Sh "1" O 591 866 0 0 0
Dr 315 0 0
At STD N 00E0FFFF
Ne 0 ""
Po -4000 1500
$EndPAD
$PAD
Sh "2" O 591 866 0 0 0
Dr 315 0 0
At STD N 00E0FFFF
Ne 0 ""
Po -3000 1500
$EndPAD
$PAD
Sh "3" O 591 866 0 0 0
Dr 315 0 0
At STD N 00E0FFFF
Ne 0 ""
Po -2000 1500
$EndPAD
$PAD
Sh "4" O 591 866 0 0 0
Dr 315 0 0
At STD N 00E0FFFF
Ne 0 ""
Po -1000 1500
$EndPAD
$PAD
Sh "5" O 591 866 0 0 0
Dr 315 0 0
At STD N 00E0FFFF
Ne 0 ""
Po 0 1500
$EndPAD
$PAD
Sh "6" O 591 866 0 0 0
Dr 315 0 0
At STD N 00E0FFFF
Ne 0 ""
Po 1000 1500
$EndPAD
$PAD
Sh "7" O 591 866 0 0 0
Dr 315 0 0
At STD N 00E0FFFF
Ne 0 ""
Po 2000 1500
$EndPAD
$PAD
Sh "8" O 591 866 0 0 0
Dr 315 0 0
At STD N 00E0FFFF
Ne 0 ""
Po 3000 1500
$EndPAD
$PAD
Sh "9" O 591 866 0 0 0
Dr 315 0 0
At STD N 00E0FFFF
Ne 0 ""
Po 4000 1500
$EndPAD
$PAD
Sh "10" O 591 866 0 0 0
Dr 315 0 0
At STD N 00E0FFFF
Ne 0 ""
Po 4000 -1500
$EndPAD
$PAD
Sh "11" O 591 866 0 0 0
Dr 315 0 0
At STD N 00E0FFFF
Ne 0 ""
Po 3000 -1500
$EndPAD
$PAD
Sh "12" O 591 866 0 0 0
Dr 315 0 0
At STD N 00E0FFFF
Ne 0 ""
Po 2000 -1500
$EndPAD
$PAD
Sh "13" O 591 866 0 0 0
Dr 315 0 0
At STD N 00E0FFFF
Ne 0 ""
Po 1000 -1500
$EndPAD
$PAD
Sh "14" O 591 866 0 0 0
Dr 315 0 0
At STD N 00E0FFFF
Ne 0 ""
Po 0 -1500
$EndPAD
$PAD
Sh "15" O 591 866 0 0 0
Dr 315 0 0
At STD N 00E0FFFF
Ne 0 ""
Po -1000 -1500
$EndPAD
$PAD
Sh "16" O 591 866 0 0 0
Dr 315 0 0
At STD N 00E0FFFF
Ne 0 ""
Po -2000 -1500
$EndPAD
$PAD
Sh "17" O 591 866 0 0 0
Dr 315 0 0
At STD N 00E0FFFF
Ne 0 ""
Po -3000 -1500
$EndPAD
$PAD
Sh "18" O 591 866 0 0 0
Dr 315 0 0
At STD N 00E0FFFF
Ne 0 ""
Po -4000 -1500
$EndPAD
$SHAPE3D
Na "walter\pth_circuits\dil_18-300.wrl"
Sc 1.000000 1.000000 1.000000
Of 0.000000 0.000000 0.000000
Ro 0.000000 0.000000 0.000000
$EndSHAPE3D
$EndMODULE  dil_18-300
$MODULE dil_18-300_socket
Po 0 0 0 15 4E4CDD3B 00000000 ~~
Li dil_18-300_socket
Cd IC, DIL18 x 0,3", with socket
Kw DIL
Sc 00000000
AR
Op 0 0 0
T0 0 -2500 600 450 0 113 N V 21 N"U***"
T1 0 2600 600 450 0 113 N V 21 N"DIL_18-300_socket"
DS 3300 500 -3300 500 100 21
DS -3300 -500 3300 -500 100 21
DS 4500 2000 -4500 2000 150 21
DS -4900 1300 4900 1300 150 21
DS -4500 -2000 4500 -2000 150 21
DS -4900 -1300 4900 -1300 150 21
DA -4500 0 -4500 -500 900 100 21
DA -4500 0 -4000 0 900 100 21
DS -4500 500 -4900 500 150 21
DS -4500 -500 -4900 -500 150 21
DS -3300 -500 -3300 500 100 21
DS 3300 500 3300 -500 100 21
DS 4500 -2000 4500 2000 150 21
DS -4500 2000 -4500 -2000 150 21
DS 4900 -1300 4900 1300 150 21
DS -4900 1300 -4900 -1300 150 21
$PAD
Sh "1" O 591 866 0 0 0
Dr 315 0 0
At STD N 00E0FFFF
Ne 0 ""
Po -4000 1500
$EndPAD
$PAD
Sh "2" O 591 866 0 0 0
Dr 315 0 0
At STD N 00E0FFFF
Ne 0 ""
Po -3000 1500
$EndPAD
$PAD
Sh "3" O 591 866 0 0 0
Dr 315 0 0
At STD N 00E0FFFF
Ne 0 ""
Po -2000 1500
$EndPAD
$PAD
Sh "4" O 591 866 0 0 0
Dr 315 0 0
At STD N 00E0FFFF
Ne 0 ""
Po -1000 1500
$EndPAD
$PAD
Sh "5" O 591 866 0 0 0
Dr 315 0 0
At STD N 00E0FFFF
Ne 0 ""
Po 0 1500
$EndPAD
$PAD
Sh "6" O 591 866 0 0 0
Dr 315 0 0
At STD N 00E0FFFF
Ne 0 ""
Po 1000 1500
$EndPAD
$PAD
Sh "7" O 591 866 0 0 0
Dr 315 0 0
At STD N 00E0FFFF
Ne 0 ""
Po 2000 1500
$EndPAD
$PAD
Sh "8" O 591 866 0 0 0
Dr 315 0 0
At STD N 00E0FFFF
Ne 0 ""
Po 3000 1500
$EndPAD
$PAD
Sh "9" O 591 866 0 0 0
Dr 315 0 0
At STD N 00E0FFFF
Ne 0 ""
Po 4000 1500
$EndPAD
$PAD
Sh "10" O 591 866 0 0 0
Dr 315 0 0
At STD N 00E0FFFF
Ne 0 ""
Po 4000 -1500
$EndPAD
$PAD
Sh "11" O 591 866 0 0 0
Dr 315 0 0
At STD N 00E0FFFF
Ne 0 ""
Po 3000 -1500
$EndPAD
$PAD
Sh "12" O 591 866 0 0 0
Dr 315 0 0
At STD N 00E0FFFF
Ne 0 ""
Po 2000 -1500
$EndPAD
$PAD
Sh "13" O 591 866 0 0 0
Dr 315 0 0
At STD N 00E0FFFF
Ne 0 ""
Po 1000 -1500
$EndPAD
$PAD
Sh "14" O 591 866 0 0 0
Dr 315 0 0
At STD N 00E0FFFF
Ne 0 ""
Po 0 -1500
$EndPAD
$PAD
Sh "15" O 591 866 0 0 0
Dr 315 0 0
At STD N 00E0FFFF
Ne 0 ""
Po -1000 -1500
$EndPAD
$PAD
Sh "16" O 591 866 0 0 0
Dr 315 0 0
At STD N 00E0FFFF
Ne 0 ""
Po -2000 -1500
$EndPAD
$PAD
Sh "17" O 591 866 0 0 0
Dr 315 0 0
At STD N 00E0FFFF
Ne 0 ""
Po -3000 -1500
$EndPAD
$PAD
Sh "18" O 591 866 0 0 0
Dr 315 0 0
At STD N 00E0FFFF
Ne 0 ""
Po -4000 -1500
$EndPAD
$SHAPE3D
Na "walter\pth_circuits\dil_18-300_socket.wrl"
Sc 1.000000 1.000000 1.000000
Of 0.000000 0.000000 0.000000
Ro 0.000000 0.000000 0.000000
$EndSHAPE3D
$EndMODULE  dil_18-300_socket
$MODULE dil_20-300_socket
Po 0 0 0 15 4E4CDE34 00000000 ~~
Li dil_20-300_socket
Cd IC, DIL20 x 0,3", with socket
Kw DIL
Sc 00000000
AR
Op 0 0 0
T0 0 -2500 600 450 0 113 N V 21 N"U***"
T1 0 2600 600 450 0 113 N V 21 N"DIL_20-300_socket"
DS 3800 500 -3800 500 100 21
DS -3800 -500 3800 -500 100 21
DS 5000 2000 -5000 2000 150 21
DS 5400 1300 -5400 1300 150 21
DS -5000 -2000 5000 -2000 150 21
DS -5400 -1300 5400 -1300 150 21
DS -5000 -500 -5000 500 150 21
DA -5000 0 -5000 -500 900 100 21
DA -5000 0 -4500 0 900 100 21
DS -5000 500 -5400 500 150 21
DS -5000 -500 -5400 -500 150 21
DS -3800 -500 -3800 500 100 21
DS 3800 500 3800 -500 100 21
DS 5000 -2000 5000 2000 150 21
DS -5000 2000 -5000 -2000 150 21
DS 5400 -1300 5400 1300 150 21
DS -5400 1300 -5400 -1300 150 21
$PAD
Sh "1" O 591 866 0 0 0
Dr 315 0 0
At STD N 00E0FFFF
Ne 0 ""
Po -4500 1500
$EndPAD
$PAD
Sh "2" O 591 866 0 0 0
Dr 315 0 0
At STD N 00E0FFFF
Ne 0 ""
Po -3500 1500
$EndPAD
$PAD
Sh "3" O 591 866 0 0 0
Dr 315 0 0
At STD N 00E0FFFF
Ne 0 ""
Po -2500 1500
$EndPAD
$PAD
Sh "4" O 591 866 0 0 0
Dr 315 0 0
At STD N 00E0FFFF
Ne 0 ""
Po -1500 1500
$EndPAD
$PAD
Sh "5" O 591 866 0 0 0
Dr 315 0 0
At STD N 00E0FFFF
Ne 0 ""
Po -500 1500
$EndPAD
$PAD
Sh "6" O 591 866 0 0 0
Dr 315 0 0
At STD N 00E0FFFF
Ne 0 ""
Po 500 1500
$EndPAD
$PAD
Sh "7" O 591 866 0 0 0
Dr 315 0 0
At STD N 00E0FFFF
Ne 0 ""
Po 1500 1500
$EndPAD
$PAD
Sh "8" O 591 866 0 0 0
Dr 315 0 0
At STD N 00E0FFFF
Ne 0 ""
Po 2500 1500
$EndPAD
$PAD
Sh "9" O 591 866 0 0 0
Dr 315 0 0
At STD N 00E0FFFF
Ne 0 ""
Po 3500 1500
$EndPAD
$PAD
Sh "10" O 591 866 0 0 0
Dr 315 0 0
At STD N 00E0FFFF
Ne 0 ""
Po 4500 1500
$EndPAD
$PAD
Sh "11" O 591 866 0 0 0
Dr 315 0 0
At STD N 00E0FFFF
Ne 0 ""
Po 4500 -1500
$EndPAD
$PAD
Sh "12" O 591 866 0 0 0
Dr 315 0 0
At STD N 00E0FFFF
Ne 0 ""
Po 3500 -1500
$EndPAD
$PAD
Sh "13" O 591 866 0 0 0
Dr 315 0 0
At STD N 00E0FFFF
Ne 0 ""
Po 2500 -1500
$EndPAD
$PAD
Sh "14" O 591 866 0 0 0
Dr 315 0 0
At STD N 00E0FFFF
Ne 0 ""
Po 1500 -1500
$EndPAD
$PAD
Sh "15" O 591 866 0 0 0
Dr 315 0 0
At STD N 00E0FFFF
Ne 0 ""
Po 500 -1500
$EndPAD
$PAD
Sh "16" O 591 866 0 0 0
Dr 315 0 0
At STD N 00E0FFFF
Ne 0 ""
Po -500 -1500
$EndPAD
$PAD
Sh "17" O 591 866 0 0 0
Dr 315 0 0
At STD N 00E0FFFF
Ne 0 ""
Po -1500 -1500
$EndPAD
$PAD
Sh "18" O 591 866 0 0 0
Dr 315 0 0
At STD N 00E0FFFF
Ne 0 ""
Po -2500 -1500
$EndPAD
$PAD
Sh "19" O 591 866 0 0 0
Dr 315 0 0
At STD N 00E0FFFF
Ne 0 ""
Po -3500 -1500
$EndPAD
$PAD
Sh "20" O 591 866 0 0 0
Dr 315 0 0
At STD N 00E0FFFF
Ne 0 ""
Po -4500 -1500
$EndPAD
$SHAPE3D
Na "walter\pth_circuits\dil_20-300_socket.wrl"
Sc 1.000000 1.000000 1.000000
Of 0.000000 0.000000 0.000000
Ro 0.000000 0.000000 0.000000
$EndSHAPE3D
$EndMODULE  dil_20-300_socket
$MODULE dil_20-300
Po 0 0 0 15 4E4CDE6B 00000000 ~~
Li dil_20-300
Cd IC, DIL20 x 0,3"
Kw DIL
Sc 00000000
AR
Op 0 0 0
T0 0 -2500 600 450 0 113 N V 21 N"U***"
T1 0 2600 600 450 0 113 N V 21 N"DIL_20-300"
DS 5400 1300 -5400 1300 150 21
DS -5400 -1300 5400 -1300 150 21
DS -5000 -500 -5000 500 150 21
DS -5000 500 -5400 500 150 21
DS -5000 -500 -5400 -500 150 21
DS 5400 -1300 5400 1300 150 21
DS -5400 1300 -5400 -1300 150 21
$PAD
Sh "1" O 591 866 0 0 0
Dr 315 0 0
At STD N 00E0FFFF
Ne 0 ""
Po -4500 1500
$EndPAD
$PAD
Sh "2" O 591 866 0 0 0
Dr 315 0 0
At STD N 00E0FFFF
Ne 0 ""
Po -3500 1500
$EndPAD
$PAD
Sh "3" O 591 866 0 0 0
Dr 315 0 0
At STD N 00E0FFFF
Ne 0 ""
Po -2500 1500
$EndPAD
$PAD
Sh "4" O 591 866 0 0 0
Dr 315 0 0
At STD N 00E0FFFF
Ne 0 ""
Po -1500 1500
$EndPAD
$PAD
Sh "5" O 591 866 0 0 0
Dr 315 0 0
At STD N 00E0FFFF
Ne 0 ""
Po -500 1500
$EndPAD
$PAD
Sh "6" O 591 866 0 0 0
Dr 315 0 0
At STD N 00E0FFFF
Ne 0 ""
Po 500 1500
$EndPAD
$PAD
Sh "7" O 591 866 0 0 0
Dr 315 0 0
At STD N 00E0FFFF
Ne 0 ""
Po 1500 1500
$EndPAD
$PAD
Sh "8" O 591 866 0 0 0
Dr 315 0 0
At STD N 00E0FFFF
Ne 0 ""
Po 2500 1500
$EndPAD
$PAD
Sh "9" O 591 866 0 0 0
Dr 315 0 0
At STD N 00E0FFFF
Ne 0 ""
Po 3500 1500
$EndPAD
$PAD
Sh "10" O 591 866 0 0 0
Dr 315 0 0
At STD N 00E0FFFF
Ne 0 ""
Po 4500 1500
$EndPAD
$PAD
Sh "11" O 591 866 0 0 0
Dr 315 0 0
At STD N 00E0FFFF
Ne 0 ""
Po 4500 -1500
$EndPAD
$PAD
Sh "12" O 591 866 0 0 0
Dr 315 0 0
At STD N 00E0FFFF
Ne 0 ""
Po 3500 -1500
$EndPAD
$PAD
Sh "13" O 591 866 0 0 0
Dr 315 0 0
At STD N 00E0FFFF
Ne 0 ""
Po 2500 -1500
$EndPAD
$PAD
Sh "14" O 591 866 0 0 0
Dr 315 0 0
At STD N 00E0FFFF
Ne 0 ""
Po 1500 -1500
$EndPAD
$PAD
Sh "15" O 591 866 0 0 0
Dr 315 0 0
At STD N 00E0FFFF
Ne 0 ""
Po 500 -1500
$EndPAD
$PAD
Sh "16" O 591 866 0 0 0
Dr 315 0 0
At STD N 00E0FFFF
Ne 0 ""
Po -500 -1500
$EndPAD
$PAD
Sh "17" O 591 866 0 0 0
Dr 315 0 0
At STD N 00E0FFFF
Ne 0 ""
Po -1500 -1500
$EndPAD
$PAD
Sh "18" O 591 866 0 0 0
Dr 315 0 0
At STD N 00E0FFFF
Ne 0 ""
Po -2500 -1500
$EndPAD
$PAD
Sh "19" O 591 866 0 0 0
Dr 315 0 0
At STD N 00E0FFFF
Ne 0 ""
Po -3500 -1500
$EndPAD
$PAD
Sh "20" O 591 866 0 0 0
Dr 315 0 0
At STD N 00E0FFFF
Ne 0 ""
Po -4500 -1500
$EndPAD
$SHAPE3D
Na "walter\pth_circuits\dil_20-300.wrl"
Sc 1.000000 1.000000 1.000000
Of 0.000000 0.000000 0.000000
Ro 0.000000 0.000000 0.000000
$EndSHAPE3D
$EndMODULE  dil_20-300
$MODULE dil_22-300_socket
Po 0 0 0 15 4E4CDFF3 00000000 ~~
Li dil_22-300_socket
Cd IC, DIL22 x 0,3", with socket
Kw DIL
Sc 00000000
AR
Op 0 0 0
T0 0 -2500 600 450 0 113 N V 21 N"U***"
T1 0 2600 600 450 0 113 N V 21 N"DIL_22-300_socket"
DS 5500 2000 -5500 2000 150 21
DS -5500 -2000 5500 -2000 150 21
DS 5900 1300 -5900 1300 150 21
DS -5900 -1300 5900 -1300 150 21
DS 500 -500 500 500 100 21
DS -500 -500 -500 500 100 21
DS -4300 500 4300 500 100 21
DS 4300 -500 -4300 -500 100 21
DS -5500 -500 -5500 500 150 21
DA -5500 0 -5500 -500 900 100 21
DA -5500 0 -5000 0 900 100 21
DS -5500 500 -5900 500 150 21
DS -5500 -500 -5900 -500 150 21
DS -4300 -500 -4300 500 100 21
DS 4300 500 4300 -500 100 21
DS 5500 -2000 5500 2000 150 21
DS -5500 2000 -5500 -2000 150 21
DS 5900 -1300 5900 1300 150 21
DS -5900 1300 -5900 -1300 150 21
$PAD
Sh "1" O 591 866 0 0 0
Dr 315 0 0
At STD N 00E0FFFF
Ne 0 ""
Po -5000 1500
$EndPAD
$PAD
Sh "2" O 591 866 0 0 0
Dr 315 0 0
At STD N 00E0FFFF
Ne 0 ""
Po -4000 1500
$EndPAD
$PAD
Sh "3" O 591 866 0 0 0
Dr 315 0 0
At STD N 00E0FFFF
Ne 0 ""
Po -3000 1500
$EndPAD
$PAD
Sh "4" O 591 866 0 0 0
Dr 315 0 0
At STD N 00E0FFFF
Ne 0 ""
Po -2000 1500
$EndPAD
$PAD
Sh "5" O 591 866 0 0 0
Dr 315 0 0
At STD N 00E0FFFF
Ne 0 ""
Po -1000 1500
$EndPAD
$PAD
Sh "6" O 591 866 0 0 0
Dr 315 0 0
At STD N 00E0FFFF
Ne 0 ""
Po 0 1500
$EndPAD
$PAD
Sh "7" O 591 866 0 0 0
Dr 315 0 0
At STD N 00E0FFFF
Ne 0 ""
Po 1000 1500
$EndPAD
$PAD
Sh "8" O 591 866 0 0 0
Dr 315 0 0
At STD N 00E0FFFF
Ne 0 ""
Po 2000 1500
$EndPAD
$PAD
Sh "9" O 591 866 0 0 0
Dr 315 0 0
At STD N 00E0FFFF
Ne 0 ""
Po 3000 1500
$EndPAD
$PAD
Sh "10" O 591 866 0 0 0
Dr 315 0 0
At STD N 00E0FFFF
Ne 0 ""
Po 4000 1500
$EndPAD
$PAD
Sh "11" O 591 866 0 0 0
Dr 315 0 0
At STD N 00E0FFFF
Ne 0 ""
Po 5000 1500
$EndPAD
$PAD
Sh "12" O 591 866 0 0 0
Dr 315 0 0
At STD N 00E0FFFF
Ne 0 ""
Po 5000 -1500
$EndPAD
$PAD
Sh "13" O 591 866 0 0 0
Dr 315 0 0
At STD N 00E0FFFF
Ne 0 ""
Po 4000 -1500
$EndPAD
$PAD
Sh "14" O 591 866 0 0 0
Dr 315 0 0
At STD N 00E0FFFF
Ne 0 ""
Po 3000 -1500
$EndPAD
$PAD
Sh "15" O 591 866 0 0 0
Dr 315 0 0
At STD N 00E0FFFF
Ne 0 ""
Po 2000 -1500
$EndPAD
$PAD
Sh "16" O 591 866 0 0 0
Dr 315 0 0
At STD N 00E0FFFF
Ne 0 ""
Po 1000 -1500
$EndPAD
$PAD
Sh "17" O 591 866 0 0 0
Dr 315 0 0
At STD N 00E0FFFF
Ne 0 ""
Po 0 -1500
$EndPAD
$PAD
Sh "18" O 591 866 0 0 0
Dr 315 0 0
At STD N 00E0FFFF
Ne 0 ""
Po -1000 -1500
$EndPAD
$PAD
Sh "19" O 591 866 0 0 0
Dr 315 0 0
At STD N 00E0FFFF
Ne 0 ""
Po -2000 -1500
$EndPAD
$PAD
Sh "20" O 591 866 0 0 0
Dr 315 0 0
At STD N 00E0FFFF
Ne 0 ""
Po -3000 -1500
$EndPAD
$PAD
Sh "21" O 591 866 0 0 0
Dr 315 0 0
At STD N 00E0FFFF
Ne 0 ""
Po -4000 -1500
$EndPAD
$PAD
Sh "22" O 591 866 0 0 0
Dr 315 0 0
At STD N 00E0FFFF
Ne 0 ""
Po -5000 -1500
$EndPAD
$SHAPE3D
Na "walter\pth_circuits\dil_22-300_socket.wrl"
Sc 1.000000 1.000000 1.000000
Of 0.000000 0.000000 0.000000
Ro 0.000000 0.000000 0.000000
$EndSHAPE3D
$EndMODULE  dil_22-300_socket
$MODULE dil_22-300
Po 0 0 0 15 4E4CE025 00000000 ~~
Li dil_22-300
Cd IC, DIL22 x 0,3"
Kw DIL
Sc 00000000
AR
Op 0 0 0
T0 0 -2500 600 450 0 113 N V 21 N"U***"
T1 0 2600 600 450 0 113 N V 21 N"DIL_22-300"
DS 5900 1300 -5900 1300 150 21
DS -5900 -1300 5900 -1300 150 21
DS -5500 -500 -5500 500 150 21
DS -5500 500 -5900 500 150 21
DS -5500 -500 -5900 -500 150 21
DS 5900 -1300 5900 1300 150 21
DS -5900 1300 -5900 -1300 150 21
$PAD
Sh "1" O 591 866 0 0 0
Dr 315 0 0
At STD N 00E0FFFF
Ne 0 ""
Po -5000 1500
$EndPAD
$PAD
Sh "2" O 591 866 0 0 0
Dr 315 0 0
At STD N 00E0FFFF
Ne 0 ""
Po -4000 1500
$EndPAD
$PAD
Sh "3" O 591 866 0 0 0
Dr 315 0 0
At STD N 00E0FFFF
Ne 0 ""
Po -3000 1500
$EndPAD
$PAD
Sh "4" O 591 866 0 0 0
Dr 315 0 0
At STD N 00E0FFFF
Ne 0 ""
Po -2000 1500
$EndPAD
$PAD
Sh "5" O 591 866 0 0 0
Dr 315 0 0
At STD N 00E0FFFF
Ne 0 ""
Po -1000 1500
$EndPAD
$PAD
Sh "6" O 591 866 0 0 0
Dr 315 0 0
At STD N 00E0FFFF
Ne 0 ""
Po 0 1500
$EndPAD
$PAD
Sh "7" O 591 866 0 0 0
Dr 315 0 0
At STD N 00E0FFFF
Ne 0 ""
Po 1000 1500
$EndPAD
$PAD
Sh "8" O 591 866 0 0 0
Dr 315 0 0
At STD N 00E0FFFF
Ne 0 ""
Po 2000 1500
$EndPAD
$PAD
Sh "9" O 591 866 0 0 0
Dr 315 0 0
At STD N 00E0FFFF
Ne 0 ""
Po 3000 1500
$EndPAD
$PAD
Sh "10" O 591 866 0 0 0
Dr 315 0 0
At STD N 00E0FFFF
Ne 0 ""
Po 4000 1500
$EndPAD
$PAD
Sh "11" O 591 866 0 0 0
Dr 315 0 0
At STD N 00E0FFFF
Ne 0 ""
Po 5000 1500
$EndPAD
$PAD
Sh "12" O 591 866 0 0 0
Dr 315 0 0
At STD N 00E0FFFF
Ne 0 ""
Po 5000 -1500
$EndPAD
$PAD
Sh "13" O 591 866 0 0 0
Dr 315 0 0
At STD N 00E0FFFF
Ne 0 ""
Po 4000 -1500
$EndPAD
$PAD
Sh "14" O 591 866 0 0 0
Dr 315 0 0
At STD N 00E0FFFF
Ne 0 ""
Po 3000 -1500
$EndPAD
$PAD
Sh "15" O 591 866 0 0 0
Dr 315 0 0
At STD N 00E0FFFF
Ne 0 ""
Po 2000 -1500
$EndPAD
$PAD
Sh "16" O 591 866 0 0 0
Dr 315 0 0
At STD N 00E0FFFF
Ne 0 ""
Po 1000 -1500
$EndPAD
$PAD
Sh "17" O 591 866 0 0 0
Dr 315 0 0
At STD N 00E0FFFF
Ne 0 ""
Po 0 -1500
$EndPAD
$PAD
Sh "18" O 591 866 0 0 0
Dr 315 0 0
At STD N 00E0FFFF
Ne 0 ""
Po -1000 -1500
$EndPAD
$PAD
Sh "19" O 591 866 0 0 0
Dr 315 0 0
At STD N 00E0FFFF
Ne 0 ""
Po -2000 -1500
$EndPAD
$PAD
Sh "20" O 591 866 0 0 0
Dr 315 0 0
At STD N 00E0FFFF
Ne 0 ""
Po -3000 -1500
$EndPAD
$PAD
Sh "21" O 591 866 0 0 0
Dr 315 0 0
At STD N 00E0FFFF
Ne 0 ""
Po -4000 -1500
$EndPAD
$PAD
Sh "22" O 591 866 0 0 0
Dr 315 0 0
At STD N 00E0FFFF
Ne 0 ""
Po -5000 -1500
$EndPAD
$SHAPE3D
Na "walter\pth_circuits\dil_22-300.wrl"
Sc 1.000000 1.000000 1.000000
Of 0.000000 0.000000 0.000000
Ro 0.000000 0.000000 0.000000
$EndSHAPE3D
$EndMODULE  dil_22-300
$MODULE dil_24-300_socket
Po 0 0 0 15 4E4CE15F 00000000 ~~
Li dil_24-300_socket
Cd IC, DIL24 x 0,3", with socket
Kw DIL
Sc 00000000
AR
Op 0 0 0
T0 0 -2500 600 450 0 113 N V 21 N"U***"
T1 0 2600 600 450 0 113 N V 21 N"DIL_24-300_socket"
DS 4800 500 -4800 500 100 21
DS -4800 -500 4800 -500 100 21
DS -6000 2000 6000 2000 150 21
DS 6400 1300 -6400 1300 150 21
DS -6000 -2000 6000 -2000 150 21
DS -6400 -1300 6400 -1300 150 21
DS 500 -500 500 500 100 21
DS -500 -500 -500 500 100 21
DS -6000 -500 -6000 500 150 21
DA -6000 0 -6000 -500 900 100 21
DA -6000 0 -5500 0 900 100 21
DS -6000 500 -6400 500 150 21
DS -6000 -500 -6400 -500 150 21
DS -4800 -500 -4800 500 100 21
DS 4800 500 4800 -500 100 21
DS 6000 -2000 6000 2000 150 21
DS -6000 2000 -6000 -2000 150 21
DS 6400 -1300 6400 1300 150 21
DS -6400 1300 -6400 -1300 150 21
$PAD
Sh "1" O 591 866 0 0 0
Dr 315 0 0
At STD N 00E0FFFF
Ne 0 ""
Po -5500 1500
$EndPAD
$PAD
Sh "2" O 591 866 0 0 0
Dr 315 0 0
At STD N 00E0FFFF
Ne 0 ""
Po -4500 1500
$EndPAD
$PAD
Sh "3" O 591 866 0 0 0
Dr 315 0 0
At STD N 00E0FFFF
Ne 0 ""
Po -3500 1500
$EndPAD
$PAD
Sh "4" O 591 866 0 0 0
Dr 315 0 0
At STD N 00E0FFFF
Ne 0 ""
Po -2500 1500
$EndPAD
$PAD
Sh "5" O 591 866 0 0 0
Dr 315 0 0
At STD N 00E0FFFF
Ne 0 ""
Po -1500 1500
$EndPAD
$PAD
Sh "6" O 591 866 0 0 0
Dr 315 0 0
At STD N 00E0FFFF
Ne 0 ""
Po -500 1500
$EndPAD
$PAD
Sh "7" O 591 866 0 0 0
Dr 315 0 0
At STD N 00E0FFFF
Ne 0 ""
Po 500 1500
$EndPAD
$PAD
Sh "8" O 591 866 0 0 0
Dr 315 0 0
At STD N 00E0FFFF
Ne 0 ""
Po 1500 1500
$EndPAD
$PAD
Sh "9" O 591 866 0 0 0
Dr 315 0 0
At STD N 00E0FFFF
Ne 0 ""
Po 2500 1500
$EndPAD
$PAD
Sh "10" O 591 866 0 0 0
Dr 315 0 0
At STD N 00E0FFFF
Ne 0 ""
Po 3500 1500
$EndPAD
$PAD
Sh "11" O 591 866 0 0 0
Dr 315 0 0
At STD N 00E0FFFF
Ne 0 ""
Po 4500 1500
$EndPAD
$PAD
Sh "12" O 591 866 0 0 0
Dr 315 0 0
At STD N 00E0FFFF
Ne 0 ""
Po 5500 1500
$EndPAD
$PAD
Sh "13" O 591 866 0 0 0
Dr 315 0 0
At STD N 00E0FFFF
Ne 0 ""
Po 5500 -1500
$EndPAD
$PAD
Sh "14" O 591 866 0 0 0
Dr 315 0 0
At STD N 00E0FFFF
Ne 0 ""
Po 4500 -1500
$EndPAD
$PAD
Sh "15" O 591 866 0 0 0
Dr 315 0 0
At STD N 00E0FFFF
Ne 0 ""
Po 3500 -1500
$EndPAD
$PAD
Sh "16" O 591 866 0 0 0
Dr 315 0 0
At STD N 00E0FFFF
Ne 0 ""
Po 2500 -1500
$EndPAD
$PAD
Sh "17" O 591 866 0 0 0
Dr 315 0 0
At STD N 00E0FFFF
Ne 0 ""
Po 1500 -1500
$EndPAD
$PAD
Sh "18" O 591 866 0 0 0
Dr 315 0 0
At STD N 00E0FFFF
Ne 0 ""
Po 500 -1500
$EndPAD
$PAD
Sh "19" O 591 866 0 0 0
Dr 315 0 0
At STD N 00E0FFFF
Ne 0 ""
Po -500 -1500
$EndPAD
$PAD
Sh "20" O 591 866 0 0 0
Dr 315 0 0
At STD N 00E0FFFF
Ne 0 ""
Po -1500 -1500
$EndPAD
$PAD
Sh "21" O 591 866 0 0 0
Dr 315 0 0
At STD N 00E0FFFF
Ne 0 ""
Po -2500 -1500
$EndPAD
$PAD
Sh "22" O 591 866 0 0 0
Dr 315 0 0
At STD N 00E0FFFF
Ne 0 ""
Po -3500 -1500
$EndPAD
$PAD
Sh "23" O 591 866 0 0 0
Dr 315 0 0
At STD N 00E0FFFF
Ne 0 ""
Po -4500 -1500
$EndPAD
$PAD
Sh "24" O 591 866 0 0 0
Dr 315 0 0
At STD N 00E0FFFF
Ne 0 ""
Po -5500 -1500
$EndPAD
$SHAPE3D
Na "walter\pth_circuits\dil_24-300_socket.wrl"
Sc 1.000000 1.000000 1.000000
Of 0.000000 0.000000 0.000000
Ro 0.000000 0.000000 0.000000
$EndSHAPE3D
$EndMODULE  dil_24-300_socket
$MODULE dil_24-300
Po 0 0 0 15 4E4CE197 00000000 ~~
Li dil_24-300
Cd IC, DIL24 x 0,3"
Kw DIL
Sc 00000000
AR
Op 0 0 0
T0 0 -2500 600 450 0 113 N V 21 N"U***"
T1 0 2600 600 450 0 113 N V 21 N"DIL_24-300"
DS 6400 1300 -6400 1300 150 21
DS -6400 -1300 6400 -1300 150 21
DS -6000 -500 -6000 500 150 21
DS -6000 500 -6400 500 150 21
DS -6000 -500 -6400 -500 150 21
DS 6400 -1300 6400 1300 150 21
DS -6400 1300 -6400 -1300 150 21
$PAD
Sh "1" O 591 866 0 0 0
Dr 315 0 0
At STD N 00E0FFFF
Ne 0 ""
Po -5500 1500
$EndPAD
$PAD
Sh "2" O 591 866 0 0 0
Dr 315 0 0
At STD N 00E0FFFF
Ne 0 ""
Po -4500 1500
$EndPAD
$PAD
Sh "3" O 591 866 0 0 0
Dr 315 0 0
At STD N 00E0FFFF
Ne 0 ""
Po -3500 1500
$EndPAD
$PAD
Sh "4" O 591 866 0 0 0
Dr 315 0 0
At STD N 00E0FFFF
Ne 0 ""
Po -2500 1500
$EndPAD
$PAD
Sh "5" O 591 866 0 0 0
Dr 315 0 0
At STD N 00E0FFFF
Ne 0 ""
Po -1500 1500
$EndPAD
$PAD
Sh "6" O 591 866 0 0 0
Dr 315 0 0
At STD N 00E0FFFF
Ne 0 ""
Po -500 1500
$EndPAD
$PAD
Sh "7" O 591 866 0 0 0
Dr 315 0 0
At STD N 00E0FFFF
Ne 0 ""
Po 500 1500
$EndPAD
$PAD
Sh "8" O 591 866 0 0 0
Dr 315 0 0
At STD N 00E0FFFF
Ne 0 ""
Po 1500 1500
$EndPAD
$PAD
Sh "9" O 591 866 0 0 0
Dr 315 0 0
At STD N 00E0FFFF
Ne 0 ""
Po 2500 1500
$EndPAD
$PAD
Sh "10" O 591 866 0 0 0
Dr 315 0 0
At STD N 00E0FFFF
Ne 0 ""
Po 3500 1500
$EndPAD
$PAD
Sh "11" O 591 866 0 0 0
Dr 315 0 0
At STD N 00E0FFFF
Ne 0 ""
Po 4500 1500
$EndPAD
$PAD
Sh "12" O 591 866 0 0 0
Dr 315 0 0
At STD N 00E0FFFF
Ne 0 ""
Po 5500 1500
$EndPAD
$PAD
Sh "13" O 591 866 0 0 0
Dr 315 0 0
At STD N 00E0FFFF
Ne 0 ""
Po 5500 -1500
$EndPAD
$PAD
Sh "14" O 591 866 0 0 0
Dr 315 0 0
At STD N 00E0FFFF
Ne 0 ""
Po 4500 -1500
$EndPAD
$PAD
Sh "15" O 591 866 0 0 0
Dr 315 0 0
At STD N 00E0FFFF
Ne 0 ""
Po 3500 -1500
$EndPAD
$PAD
Sh "16" O 591 866 0 0 0
Dr 315 0 0
At STD N 00E0FFFF
Ne 0 ""
Po 2500 -1500
$EndPAD
$PAD
Sh "17" O 591 866 0 0 0
Dr 315 0 0
At STD N 00E0FFFF
Ne 0 ""
Po 1500 -1500
$EndPAD
$PAD
Sh "18" O 591 866 0 0 0
Dr 315 0 0
At STD N 00E0FFFF
Ne 0 ""
Po 500 -1500
$EndPAD
$PAD
Sh "19" O 591 866 0 0 0
Dr 315 0 0
At STD N 00E0FFFF
Ne 0 ""
Po -500 -1500
$EndPAD
$PAD
Sh "20" O 591 866 0 0 0
Dr 315 0 0
At STD N 00E0FFFF
Ne 0 ""
Po -1500 -1500
$EndPAD
$PAD
Sh "21" O 591 866 0 0 0
Dr 315 0 0
At STD N 00E0FFFF
Ne 0 ""
Po -2500 -1500
$EndPAD
$PAD
Sh "22" O 591 866 0 0 0
Dr 315 0 0
At STD N 00E0FFFF
Ne 0 ""
Po -3500 -1500
$EndPAD
$PAD
Sh "23" O 591 866 0 0 0
Dr 315 0 0
At STD N 00E0FFFF
Ne 0 ""
Po -4500 -1500
$EndPAD
$PAD
Sh "24" O 591 866 0 0 0
Dr 315 0 0
At STD N 00E0FFFF
Ne 0 ""
Po -5500 -1500
$EndPAD
$SHAPE3D
Na "walter\pth_circuits\dil_24-300.wrl"
Sc 1.000000 1.000000 1.000000
Of 0.000000 0.000000 0.000000
Ro 0.000000 0.000000 0.000000
$EndSHAPE3D
$EndMODULE  dil_24-300
$MODULE dil_28-300_socket
Po 0 0 0 15 4E4CE305 00000000 ~~
Li dil_28-300_socket
Cd IC, DIL28 x 0,3", with socket
Kw DIL
Sc 00000000
AR
Op 0 0 0
T0 0 -2500 600 450 0 113 N V 21 N"U***"
T1 0 2600 600 450 0 113 N V 21 N"DIL_28-300_socket"
DS -7000 -2000 7000 -2000 150 21
DS 7400 -1300 -7400 -1300 150 21
DS -7000 2000 7000 2000 150 21
DS 7400 1300 -7400 1300 150 21
DS -5800 500 5800 500 100 21
DS 5800 -500 -5800 -500 100 21
DS 500 -500 500 500 100 21
DS -500 -500 -500 500 100 21
DS -7000 -500 -7000 500 150 21
DA -7000 0 -7000 -500 900 100 21
DA -7000 0 -6500 0 900 100 21
DS -7000 500 -7400 500 150 21
DS -7000 -500 -7400 -500 150 21
DS -5800 -500 -5800 500 100 21
DS 5800 500 5800 -500 100 21
DS 7000 -2000 7000 2000 150 21
DS -7000 2000 -7000 -2000 150 21
DS 7400 -1300 7400 1300 150 21
DS -7400 1300 -7400 -1300 150 21
$PAD
Sh "1" O 591 866 0 0 0
Dr 315 0 0
At STD N 00E0FFFF
Ne 0 ""
Po -6500 1500
$EndPAD
$PAD
Sh "2" O 591 866 0 0 0
Dr 315 0 0
At STD N 00E0FFFF
Ne 0 ""
Po -5500 1500
$EndPAD
$PAD
Sh "3" O 591 866 0 0 0
Dr 315 0 0
At STD N 00E0FFFF
Ne 0 ""
Po -4500 1500
$EndPAD
$PAD
Sh "4" O 591 866 0 0 0
Dr 315 0 0
At STD N 00E0FFFF
Ne 0 ""
Po -3500 1500
$EndPAD
$PAD
Sh "5" O 591 866 0 0 0
Dr 315 0 0
At STD N 00E0FFFF
Ne 0 ""
Po -2500 1500
$EndPAD
$PAD
Sh "6" O 591 866 0 0 0
Dr 315 0 0
At STD N 00E0FFFF
Ne 0 ""
Po -1500 1500
$EndPAD
$PAD
Sh "7" O 591 866 0 0 0
Dr 315 0 0
At STD N 00E0FFFF
Ne 0 ""
Po -500 1500
$EndPAD
$PAD
Sh "8" O 591 866 0 0 0
Dr 315 0 0
At STD N 00E0FFFF
Ne 0 ""
Po 500 1500
$EndPAD
$PAD
Sh "9" O 591 866 0 0 0
Dr 315 0 0
At STD N 00E0FFFF
Ne 0 ""
Po 1500 1500
$EndPAD
$PAD
Sh "10" O 591 866 0 0 0
Dr 315 0 0
At STD N 00E0FFFF
Ne 0 ""
Po 2500 1500
$EndPAD
$PAD
Sh "11" O 591 866 0 0 0
Dr 315 0 0
At STD N 00E0FFFF
Ne 0 ""
Po 3500 1500
$EndPAD
$PAD
Sh "12" O 591 866 0 0 0
Dr 315 0 0
At STD N 00E0FFFF
Ne 0 ""
Po 4500 1500
$EndPAD
$PAD
Sh "13" O 591 866 0 0 0
Dr 315 0 0
At STD N 00E0FFFF
Ne 0 ""
Po 5500 1500
$EndPAD
$PAD
Sh "14" O 591 866 0 0 0
Dr 315 0 0
At STD N 00E0FFFF
Ne 0 ""
Po 6500 1500
$EndPAD
$PAD
Sh "15" O 591 866 0 0 0
Dr 315 0 0
At STD N 00E0FFFF
Ne 0 ""
Po 6500 -1500
$EndPAD
$PAD
Sh "16" O 591 866 0 0 0
Dr 315 0 0
At STD N 00E0FFFF
Ne 0 ""
Po 5500 -1500
$EndPAD
$PAD
Sh "17" O 591 866 0 0 0
Dr 315 0 0
At STD N 00E0FFFF
Ne 0 ""
Po 4500 -1500
$EndPAD
$PAD
Sh "18" O 591 866 0 0 0
Dr 315 0 0
At STD N 00E0FFFF
Ne 0 ""
Po 3500 -1500
$EndPAD
$PAD
Sh "19" O 591 866 0 0 0
Dr 315 0 0
At STD N 00E0FFFF
Ne 0 ""
Po 2500 -1500
$EndPAD
$PAD
Sh "20" O 591 866 0 0 0
Dr 315 0 0
At STD N 00E0FFFF
Ne 0 ""
Po 1500 -1500
$EndPAD
$PAD
Sh "21" O 591 866 0 0 0
Dr 315 0 0
At STD N 00E0FFFF
Ne 0 ""
Po 500 -1500
$EndPAD
$PAD
Sh "22" O 591 866 0 0 0
Dr 315 0 0
At STD N 00E0FFFF
Ne 0 ""
Po -500 -1500
$EndPAD
$PAD
Sh "23" O 591 866 0 0 0
Dr 315 0 0
At STD N 00E0FFFF
Ne 0 ""
Po -1500 -1500
$EndPAD
$PAD
Sh "24" O 591 866 0 0 0
Dr 315 0 0
At STD N 00E0FFFF
Ne 0 ""
Po -2500 -1500
$EndPAD
$PAD
Sh "25" O 591 866 0 0 0
Dr 315 0 0
At STD N 00E0FFFF
Ne 0 ""
Po -3500 -1500
$EndPAD
$PAD
Sh "26" O 591 866 0 0 0
Dr 315 0 0
At STD N 00E0FFFF
Ne 0 ""
Po -4500 -1500
$EndPAD
$PAD
Sh "27" O 591 866 0 0 0
Dr 315 0 0
At STD N 00E0FFFF
Ne 0 ""
Po -5500 -1500
$EndPAD
$PAD
Sh "28" O 591 866 0 0 0
Dr 315 0 0
At STD N 00E0FFFF
Ne 0 ""
Po -6500 -1500
$EndPAD
$SHAPE3D
Na "walter\pth_circuits\dil_28-300_socket.wrl"
Sc 1.000000 1.000000 1.000000
Of 0.000000 0.000000 0.000000
Ro 0.000000 0.000000 0.000000
$EndSHAPE3D
$EndMODULE  dil_28-300_socket
$MODULE dil_28-300
Po 0 0 0 15 4E4CE348 00000000 ~~
Li dil_28-300
Cd IC, DIL28 x 0,3"
Kw DIL
Sc 00000000
AR
Op 0 0 0
T0 0 -2500 600 450 0 113 N V 21 N"U***"
T1 0 2600 600 450 0 113 N V 21 N"DIL_28-300"
DS 7400 -1300 -7400 -1300 150 21
DS 7400 1300 -7400 1300 150 21
DS -7000 -500 -7000 500 150 21
DS -7000 500 -7400 500 150 21
DS -7000 -500 -7400 -500 150 21
DS 7400 -1300 7400 1300 150 21
DS -7400 1300 -7400 -1300 150 21
$PAD
Sh "1" O 591 866 0 0 0
Dr 315 0 0
At STD N 00E0FFFF
Ne 0 ""
Po -6500 1500
$EndPAD
$PAD
Sh "2" O 591 866 0 0 0
Dr 315 0 0
At STD N 00E0FFFF
Ne 0 ""
Po -5500 1500
$EndPAD
$PAD
Sh "3" O 591 866 0 0 0
Dr 315 0 0
At STD N 00E0FFFF
Ne 0 ""
Po -4500 1500
$EndPAD
$PAD
Sh "4" O 591 866 0 0 0
Dr 315 0 0
At STD N 00E0FFFF
Ne 0 ""
Po -3500 1500
$EndPAD
$PAD
Sh "5" O 591 866 0 0 0
Dr 315 0 0
At STD N 00E0FFFF
Ne 0 ""
Po -2500 1500
$EndPAD
$PAD
Sh "6" O 591 866 0 0 0
Dr 315 0 0
At STD N 00E0FFFF
Ne 0 ""
Po -1500 1500
$EndPAD
$PAD
Sh "7" O 591 866 0 0 0
Dr 315 0 0
At STD N 00E0FFFF
Ne 0 ""
Po -500 1500
$EndPAD
$PAD
Sh "8" O 591 866 0 0 0
Dr 315 0 0
At STD N 00E0FFFF
Ne 0 ""
Po 500 1500
$EndPAD
$PAD
Sh "9" O 591 866 0 0 0
Dr 315 0 0
At STD N 00E0FFFF
Ne 0 ""
Po 1500 1500
$EndPAD
$PAD
Sh "10" O 591 866 0 0 0
Dr 315 0 0
At STD N 00E0FFFF
Ne 0 ""
Po 2500 1500
$EndPAD
$PAD
Sh "11" O 591 866 0 0 0
Dr 315 0 0
At STD N 00E0FFFF
Ne 0 ""
Po 3500 1500
$EndPAD
$PAD
Sh "12" O 591 866 0 0 0
Dr 315 0 0
At STD N 00E0FFFF
Ne 0 ""
Po 4500 1500
$EndPAD
$PAD
Sh "13" O 591 866 0 0 0
Dr 315 0 0
At STD N 00E0FFFF
Ne 0 ""
Po 5500 1500
$EndPAD
$PAD
Sh "14" O 591 866 0 0 0
Dr 315 0 0
At STD N 00E0FFFF
Ne 0 ""
Po 6500 1500
$EndPAD
$PAD
Sh "15" O 591 866 0 0 0
Dr 315 0 0
At STD N 00E0FFFF
Ne 0 ""
Po 6500 -1500
$EndPAD
$PAD
Sh "16" O 591 866 0 0 0
Dr 315 0 0
At STD N 00E0FFFF
Ne 0 ""
Po 5500 -1500
$EndPAD
$PAD
Sh "17" O 591 866 0 0 0
Dr 315 0 0
At STD N 00E0FFFF
Ne 0 ""
Po 4500 -1500
$EndPAD
$PAD
Sh "18" O 591 866 0 0 0
Dr 315 0 0
At STD N 00E0FFFF
Ne 0 ""
Po 3500 -1500
$EndPAD
$PAD
Sh "19" O 591 866 0 0 0
Dr 315 0 0
At STD N 00E0FFFF
Ne 0 ""
Po 2500 -1500
$EndPAD
$PAD
Sh "20" O 591 866 0 0 0
Dr 315 0 0
At STD N 00E0FFFF
Ne 0 ""
Po 1500 -1500
$EndPAD
$PAD
Sh "21" O 591 866 0 0 0
Dr 315 0 0
At STD N 00E0FFFF
Ne 0 ""
Po 500 -1500
$EndPAD
$PAD
Sh "22" O 591 866 0 0 0
Dr 315 0 0
At STD N 00E0FFFF
Ne 0 ""
Po -500 -1500
$EndPAD
$PAD
Sh "23" O 591 866 0 0 0
Dr 315 0 0
At STD N 00E0FFFF
Ne 0 ""
Po -1500 -1500
$EndPAD
$PAD
Sh "24" O 591 866 0 0 0
Dr 315 0 0
At STD N 00E0FFFF
Ne 0 ""
Po -2500 -1500
$EndPAD
$PAD
Sh "25" O 591 866 0 0 0
Dr 315 0 0
At STD N 00E0FFFF
Ne 0 ""
Po -3500 -1500
$EndPAD
$PAD
Sh "26" O 591 866 0 0 0
Dr 315 0 0
At STD N 00E0FFFF
Ne 0 ""
Po -4500 -1500
$EndPAD
$PAD
Sh "27" O 591 866 0 0 0
Dr 315 0 0
At STD N 00E0FFFF
Ne 0 ""
Po -5500 -1500
$EndPAD
$PAD
Sh "28" O 591 866 0 0 0
Dr 315 0 0
At STD N 00E0FFFF
Ne 0 ""
Po -6500 -1500
$EndPAD
$SHAPE3D
Na "walter\pth_circuits\dil_28-300.wrl"
Sc 1.000000 1.000000 1.000000
Of 0.000000 0.000000 0.000000
Ro 0.000000 0.000000 0.000000
$EndSHAPE3D
$EndMODULE  dil_28-300
$MODULE dil_24-600_socket
Po 0 0 0 15 4E4CE47E 00000000 ~~
Li dil_24-600_socket
Cd IC, DIL24 x 0,6", with socket
Kw DIL
Sc 00000000
AR
Op 0 0 0
T0 0 -4000 600 450 0 113 N V 21 N"U***"
T1 0 4100 600 450 0 113 N V 21 N"DIL_24-600_socket"
DS -4800 2000 -4800 -2000 100 21
DS -500 -2000 -500 2000 100 21
DS 500 2000 500 -2000 100 21
DS 4800 -2000 4800 2000 100 21
DS 6400 2800 6400 -2800 150 21
DS 6000 -3500 6000 3500 150 21
DS -6000 3500 -6000 -3500 150 21
DS -6400 -2800 -6400 2800 150 21
DS 4800 2000 -4800 2000 100 21
DS -4800 -2000 4800 -2000 100 21
DS -6000 3500 6000 3500 150 21
DS 6400 2800 -6400 2800 150 21
DS -6000 -3500 6000 -3500 150 21
DS -6400 -2800 6400 -2800 150 21
DS -6000 -500 -6000 500 150 21
DA -6000 0 -6000 -500 900 100 21
DA -6000 0 -5500 0 900 100 21
DS -6000 500 -6400 500 150 21
DS -6000 -500 -6400 -500 150 21
$PAD
Sh "1" O 591 866 0 0 0
Dr 315 0 0
At STD N 00E0FFFF
Ne 0 ""
Po -5500 3000
$EndPAD
$PAD
Sh "2" O 591 866 0 0 0
Dr 315 0 0
At STD N 00E0FFFF
Ne 0 ""
Po -4500 3000
$EndPAD
$PAD
Sh "3" O 591 866 0 0 0
Dr 315 0 0
At STD N 00E0FFFF
Ne 0 ""
Po -3500 3000
$EndPAD
$PAD
Sh "4" O 591 866 0 0 0
Dr 315 0 0
At STD N 00E0FFFF
Ne 0 ""
Po -2500 3000
$EndPAD
$PAD
Sh "5" O 591 866 0 0 0
Dr 315 0 0
At STD N 00E0FFFF
Ne 0 ""
Po -1500 3000
$EndPAD
$PAD
Sh "6" O 591 866 0 0 0
Dr 315 0 0
At STD N 00E0FFFF
Ne 0 ""
Po -500 3000
$EndPAD
$PAD
Sh "7" O 591 866 0 0 0
Dr 315 0 0
At STD N 00E0FFFF
Ne 0 ""
Po 500 3000
$EndPAD
$PAD
Sh "8" O 591 866 0 0 0
Dr 315 0 0
At STD N 00E0FFFF
Ne 0 ""
Po 1500 3000
$EndPAD
$PAD
Sh "9" O 591 866 0 0 0
Dr 315 0 0
At STD N 00E0FFFF
Ne 0 ""
Po 2500 3000
$EndPAD
$PAD
Sh "10" O 591 866 0 0 0
Dr 315 0 0
At STD N 00E0FFFF
Ne 0 ""
Po 3500 3000
$EndPAD
$PAD
Sh "11" O 591 866 0 0 0
Dr 315 0 0
At STD N 00E0FFFF
Ne 0 ""
Po 4500 3000
$EndPAD
$PAD
Sh "12" O 591 866 0 0 0
Dr 315 0 0
At STD N 00E0FFFF
Ne 0 ""
Po 5500 3000
$EndPAD
$PAD
Sh "13" O 591 866 0 0 0
Dr 315 0 0
At STD N 00E0FFFF
Ne 0 ""
Po 5500 -3000
$EndPAD
$PAD
Sh "14" O 591 866 0 0 0
Dr 315 0 0
At STD N 00E0FFFF
Ne 0 ""
Po 4500 -3000
$EndPAD
$PAD
Sh "15" O 591 866 0 0 0
Dr 315 0 0
At STD N 00E0FFFF
Ne 0 ""
Po 3500 -3000
$EndPAD
$PAD
Sh "16" O 591 866 0 0 0
Dr 315 0 0
At STD N 00E0FFFF
Ne 0 ""
Po 2500 -3000
$EndPAD
$PAD
Sh "17" O 591 866 0 0 0
Dr 315 0 0
At STD N 00E0FFFF
Ne 0 ""
Po 1500 -3000
$EndPAD
$PAD
Sh "18" O 591 866 0 0 0
Dr 315 0 0
At STD N 00E0FFFF
Ne 0 ""
Po 500 -3000
$EndPAD
$PAD
Sh "19" O 591 866 0 0 0
Dr 315 0 0
At STD N 00E0FFFF
Ne 0 ""
Po -500 -3000
$EndPAD
$PAD
Sh "20" O 591 866 0 0 0
Dr 315 0 0
At STD N 00E0FFFF
Ne 0 ""
Po -1500 -3000
$EndPAD
$PAD
Sh "21" O 591 866 0 0 0
Dr 315 0 0
At STD N 00E0FFFF
Ne 0 ""
Po -2500 -3000
$EndPAD
$PAD
Sh "22" O 591 866 0 0 0
Dr 315 0 0
At STD N 00E0FFFF
Ne 0 ""
Po -3500 -3000
$EndPAD
$PAD
Sh "23" O 591 866 0 0 0
Dr 315 0 0
At STD N 00E0FFFF
Ne 0 ""
Po -4500 -3000
$EndPAD
$PAD
Sh "24" O 591 866 0 0 0
Dr 315 0 0
At STD N 00E0FFFF
Ne 0 ""
Po -5500 -3000
$EndPAD
$SHAPE3D
Na "walter\pth_circuits\dil_24-600_socket.wrl"
Sc 1.000000 1.000000 1.000000
Of 0.000000 0.000000 0.000000
Ro 0.000000 0.000000 0.000000
$EndSHAPE3D
$EndMODULE  dil_24-600_socket
$MODULE dil_24-600
Po 0 0 0 15 4E4CE4CD 00000000 ~~
Li dil_24-600
Cd IC, DIL24 x 0,6"
Kw DIL
Sc 00000000
AR
Op 0 0 0
T0 0 -4000 600 450 0 113 N V 21 N"U***"
T1 0 4100 600 450 0 113 N V 21 N"DIL_24-600"
DS 6400 2800 6400 -2800 150 21
DS -6400 -2800 -6400 2800 150 21
DS 6400 2800 -6400 2800 150 21
DS -6400 -2800 6400 -2800 150 21
DS -6000 -500 -6000 500 150 21
DS -6000 500 -6400 500 150 21
DS -6000 -500 -6400 -500 150 21
$PAD
Sh "1" O 591 866 0 0 0
Dr 315 0 0
At STD N 00E0FFFF
Ne 0 ""
Po -5500 3000
$EndPAD
$PAD
Sh "2" O 591 866 0 0 0
Dr 315 0 0
At STD N 00E0FFFF
Ne 0 ""
Po -4500 3000
$EndPAD
$PAD
Sh "3" O 591 866 0 0 0
Dr 315 0 0
At STD N 00E0FFFF
Ne 0 ""
Po -3500 3000
$EndPAD
$PAD
Sh "4" O 591 866 0 0 0
Dr 315 0 0
At STD N 00E0FFFF
Ne 0 ""
Po -2500 3000
$EndPAD
$PAD
Sh "5" O 591 866 0 0 0
Dr 315 0 0
At STD N 00E0FFFF
Ne 0 ""
Po -1500 3000
$EndPAD
$PAD
Sh "6" O 591 866 0 0 0
Dr 315 0 0
At STD N 00E0FFFF
Ne 0 ""
Po -500 3000
$EndPAD
$PAD
Sh "7" O 591 866 0 0 0
Dr 315 0 0
At STD N 00E0FFFF
Ne 0 ""
Po 500 3000
$EndPAD
$PAD
Sh "8" O 591 866 0 0 0
Dr 315 0 0
At STD N 00E0FFFF
Ne 0 ""
Po 1500 3000
$EndPAD
$PAD
Sh "9" O 591 866 0 0 0
Dr 315 0 0
At STD N 00E0FFFF
Ne 0 ""
Po 2500 3000
$EndPAD
$PAD
Sh "10" O 591 866 0 0 0
Dr 315 0 0
At STD N 00E0FFFF
Ne 0 ""
Po 3500 3000
$EndPAD
$PAD
Sh "11" O 591 866 0 0 0
Dr 315 0 0
At STD N 00E0FFFF
Ne 0 ""
Po 4500 3000
$EndPAD
$PAD
Sh "12" O 591 866 0 0 0
Dr 315 0 0
At STD N 00E0FFFF
Ne 0 ""
Po 5500 3000
$EndPAD
$PAD
Sh "13" O 591 866 0 0 0
Dr 315 0 0
At STD N 00E0FFFF
Ne 0 ""
Po 5500 -3000
$EndPAD
$PAD
Sh "14" O 591 866 0 0 0
Dr 315 0 0
At STD N 00E0FFFF
Ne 0 ""
Po 4500 -3000
$EndPAD
$PAD
Sh "15" O 591 866 0 0 0
Dr 315 0 0
At STD N 00E0FFFF
Ne 0 ""
Po 3500 -3000
$EndPAD
$PAD
Sh "16" O 591 866 0 0 0
Dr 315 0 0
At STD N 00E0FFFF
Ne 0 ""
Po 2500 -3000
$EndPAD
$PAD
Sh "17" O 591 866 0 0 0
Dr 315 0 0
At STD N 00E0FFFF
Ne 0 ""
Po 1500 -3000
$EndPAD
$PAD
Sh "18" O 591 866 0 0 0
Dr 315 0 0
At STD N 00E0FFFF
Ne 0 ""
Po 500 -3000
$EndPAD
$PAD
Sh "19" O 591 866 0 0 0
Dr 315 0 0
At STD N 00E0FFFF
Ne 0 ""
Po -500 -3000
$EndPAD
$PAD
Sh "20" O 591 866 0 0 0
Dr 315 0 0
At STD N 00E0FFFF
Ne 0 ""
Po -1500 -3000
$EndPAD
$PAD
Sh "21" O 591 866 0 0 0
Dr 315 0 0
At STD N 00E0FFFF
Ne 0 ""
Po -2500 -3000
$EndPAD
$PAD
Sh "22" O 591 866 0 0 0
Dr 315 0 0
At STD N 00E0FFFF
Ne 0 ""
Po -3500 -3000
$EndPAD
$PAD
Sh "23" O 591 866 0 0 0
Dr 315 0 0
At STD N 00E0FFFF
Ne 0 ""
Po -4500 -3000
$EndPAD
$PAD
Sh "24" O 591 866 0 0 0
Dr 315 0 0
At STD N 00E0FFFF
Ne 0 ""
Po -5500 -3000
$EndPAD
$SHAPE3D
Na "walter\pth_circuits\dil_24-600.wrl"
Sc 1.000000 1.000000 1.000000
Of 0.000000 0.000000 0.000000
Ro 0.000000 0.000000 0.000000
$EndSHAPE3D
$EndMODULE  dil_24-600
$MODULE dil_28-600_socket
Po 0 0 0 15 4E4CE5E9 00000000 ~~
Li dil_28-600_socket
Cd IC, DIL28 x 0,6", with socket
Kw DIL
Sc 00000000
AR
Op 0 0 0
T0 0 -4000 600 450 0 113 N V 21 N"U***"
T1 0 4100 600 450 0 113 N V 21 N"DIL_28-600_socket"
DS 7400 2800 7400 -2800 150 21
DS 7000 -3500 7000 3500 150 21
DS -7000 3500 -7000 -3500 150 21
DS -7400 -2800 -7400 2800 150 21
DS -500 -2000 -500 2000 100 21
DS 500 2000 500 -2000 100 21
DS 5800 -2000 5800 2000 100 21
DS -5800 -2000 -5800 2000 100 21
DS -7000 -3500 7000 -3500 150 21
DS 7400 -2800 -7400 -2800 150 21
DS -7000 3500 7000 3500 150 21
DS 7400 2800 -7400 2800 150 21
DS -5800 2000 5800 2000 100 21
DS 5800 -2000 -5800 -2000 100 21
DS -7000 -500 -7000 500 150 21
DA -7000 0 -7000 -500 900 100 21
DA -7000 0 -6500 0 900 100 21
DS -7000 500 -7400 500 150 21
DS -7000 -500 -7400 -500 150 21
$PAD
Sh "1" O 591 866 0 0 0
Dr 315 0 0
At STD N 00E0FFFF
Ne 0 ""
Po -6500 3000
$EndPAD
$PAD
Sh "2" O 591 866 0 0 0
Dr 315 0 0
At STD N 00E0FFFF
Ne 0 ""
Po -5500 3000
$EndPAD
$PAD
Sh "3" O 591 866 0 0 0
Dr 315 0 0
At STD N 00E0FFFF
Ne 0 ""
Po -4500 3000
$EndPAD
$PAD
Sh "4" O 591 866 0 0 0
Dr 315 0 0
At STD N 00E0FFFF
Ne 0 ""
Po -3500 3000
$EndPAD
$PAD
Sh "5" O 591 866 0 0 0
Dr 315 0 0
At STD N 00E0FFFF
Ne 0 ""
Po -2500 3000
$EndPAD
$PAD
Sh "6" O 591 866 0 0 0
Dr 315 0 0
At STD N 00E0FFFF
Ne 0 ""
Po -1500 3000
$EndPAD
$PAD
Sh "7" O 591 866 0 0 0
Dr 315 0 0
At STD N 00E0FFFF
Ne 0 ""
Po -500 3000
$EndPAD
$PAD
Sh "8" O 591 866 0 0 0
Dr 315 0 0
At STD N 00E0FFFF
Ne 0 ""
Po 500 3000
$EndPAD
$PAD
Sh "9" O 591 866 0 0 0
Dr 315 0 0
At STD N 00E0FFFF
Ne 0 ""
Po 1500 3000
$EndPAD
$PAD
Sh "10" O 591 866 0 0 0
Dr 315 0 0
At STD N 00E0FFFF
Ne 0 ""
Po 2500 3000
$EndPAD
$PAD
Sh "11" O 591 866 0 0 0
Dr 315 0 0
At STD N 00E0FFFF
Ne 0 ""
Po 3500 3000
$EndPAD
$PAD
Sh "12" O 591 866 0 0 0
Dr 315 0 0
At STD N 00E0FFFF
Ne 0 ""
Po 4500 3000
$EndPAD
$PAD
Sh "13" O 591 866 0 0 0
Dr 315 0 0
At STD N 00E0FFFF
Ne 0 ""
Po 5500 3000
$EndPAD
$PAD
Sh "14" O 591 866 0 0 0
Dr 315 0 0
At STD N 00E0FFFF
Ne 0 ""
Po 6500 3000
$EndPAD
$PAD
Sh "15" O 591 866 0 0 0
Dr 315 0 0
At STD N 00E0FFFF
Ne 0 ""
Po 6500 -3000
$EndPAD
$PAD
Sh "16" O 591 866 0 0 0
Dr 315 0 0
At STD N 00E0FFFF
Ne 0 ""
Po 5500 -3000
$EndPAD
$PAD
Sh "17" O 591 866 0 0 0
Dr 315 0 0
At STD N 00E0FFFF
Ne 0 ""
Po 4500 -3000
$EndPAD
$PAD
Sh "18" O 591 866 0 0 0
Dr 315 0 0
At STD N 00E0FFFF
Ne 0 ""
Po 3500 -3000
$EndPAD
$PAD
Sh "19" O 591 866 0 0 0
Dr 315 0 0
At STD N 00E0FFFF
Ne 0 ""
Po 2500 -3000
$EndPAD
$PAD
Sh "20" O 591 866 0 0 0
Dr 315 0 0
At STD N 00E0FFFF
Ne 0 ""
Po 1500 -3000
$EndPAD
$PAD
Sh "21" O 591 866 0 0 0
Dr 315 0 0
At STD N 00E0FFFF
Ne 0 ""
Po 500 -3000
$EndPAD
$PAD
Sh "22" O 591 866 0 0 0
Dr 315 0 0
At STD N 00E0FFFF
Ne 0 ""
Po -500 -3000
$EndPAD
$PAD
Sh "23" O 591 866 0 0 0
Dr 315 0 0
At STD N 00E0FFFF
Ne 0 ""
Po -1500 -3000
$EndPAD
$PAD
Sh "24" O 591 866 0 0 0
Dr 315 0 0
At STD N 00E0FFFF
Ne 0 ""
Po -2500 -3000
$EndPAD
$PAD
Sh "25" O 591 866 0 0 0
Dr 315 0 0
At STD N 00E0FFFF
Ne 0 ""
Po -3500 -3000
$EndPAD
$PAD
Sh "26" O 591 866 0 0 0
Dr 315 0 0
At STD N 00E0FFFF
Ne 0 ""
Po -4500 -3000
$EndPAD
$PAD
Sh "27" O 591 866 0 0 0
Dr 315 0 0
At STD N 00E0FFFF
Ne 0 ""
Po -5500 -3000
$EndPAD
$PAD
Sh "28" O 591 866 0 0 0
Dr 315 0 0
At STD N 00E0FFFF
Ne 0 ""
Po -6500 -3000
$EndPAD
$SHAPE3D
Na "walter\pth_circuits\dil_28-600_socket.wrl"
Sc 1.000000 1.000000 1.000000
Of 0.000000 0.000000 0.000000
Ro 0.000000 0.000000 0.000000
$EndSHAPE3D
$EndMODULE  dil_28-600_socket
$MODULE dil_28-600
Po 0 0 0 15 4E4CE61C 00000000 ~~
Li dil_28-600
Cd IC, DIL28 x 0,6"
Kw DIL
Sc 00000000
AR
Op 0 0 0
T0 0 -4000 600 450 0 113 N V 21 N"U***"
T1 0 4100 600 450 0 113 N V 21 N"DIL_28-600"
DS 7400 2800 7400 -2800 150 21
DS -7400 -2800 -7400 2800 150 21
DS 7400 -2800 -7400 -2800 150 21
DS 7400 2800 -7400 2800 150 21
DS -7000 -500 -7000 500 150 21
DS -7000 500 -7400 500 150 21
DS -7000 -500 -7400 -500 150 21
$PAD
Sh "1" O 591 866 0 0 0
Dr 315 0 0
At STD N 00E0FFFF
Ne 0 ""
Po -6500 3000
$EndPAD
$PAD
Sh "2" O 591 866 0 0 0
Dr 315 0 0
At STD N 00E0FFFF
Ne 0 ""
Po -5500 3000
$EndPAD
$PAD
Sh "3" O 591 866 0 0 0
Dr 315 0 0
At STD N 00E0FFFF
Ne 0 ""
Po -4500 3000
$EndPAD
$PAD
Sh "4" O 591 866 0 0 0
Dr 315 0 0
At STD N 00E0FFFF
Ne 0 ""
Po -3500 3000
$EndPAD
$PAD
Sh "5" O 591 866 0 0 0
Dr 315 0 0
At STD N 00E0FFFF
Ne 0 ""
Po -2500 3000
$EndPAD
$PAD
Sh "6" O 591 866 0 0 0
Dr 315 0 0
At STD N 00E0FFFF
Ne 0 ""
Po -1500 3000
$EndPAD
$PAD
Sh "7" O 591 866 0 0 0
Dr 315 0 0
At STD N 00E0FFFF
Ne 0 ""
Po -500 3000
$EndPAD
$PAD
Sh "8" O 591 866 0 0 0
Dr 315 0 0
At STD N 00E0FFFF
Ne 0 ""
Po 500 3000
$EndPAD
$PAD
Sh "9" O 591 866 0 0 0
Dr 315 0 0
At STD N 00E0FFFF
Ne 0 ""
Po 1500 3000
$EndPAD
$PAD
Sh "10" O 591 866 0 0 0
Dr 315 0 0
At STD N 00E0FFFF
Ne 0 ""
Po 2500 3000
$EndPAD
$PAD
Sh "11" O 591 866 0 0 0
Dr 315 0 0
At STD N 00E0FFFF
Ne 0 ""
Po 3500 3000
$EndPAD
$PAD
Sh "12" O 591 866 0 0 0
Dr 315 0 0
At STD N 00E0FFFF
Ne 0 ""
Po 4500 3000
$EndPAD
$PAD
Sh "13" O 591 866 0 0 0
Dr 315 0 0
At STD N 00E0FFFF
Ne 0 ""
Po 5500 3000
$EndPAD
$PAD
Sh "14" O 591 866 0 0 0
Dr 315 0 0
At STD N 00E0FFFF
Ne 0 ""
Po 6500 3000
$EndPAD
$PAD
Sh "15" O 591 866 0 0 0
Dr 315 0 0
At STD N 00E0FFFF
Ne 0 ""
Po 6500 -3000
$EndPAD
$PAD
Sh "16" O 591 866 0 0 0
Dr 315 0 0
At STD N 00E0FFFF
Ne 0 ""
Po 5500 -3000
$EndPAD
$PAD
Sh "17" O 591 866 0 0 0
Dr 315 0 0
At STD N 00E0FFFF
Ne 0 ""
Po 4500 -3000
$EndPAD
$PAD
Sh "18" O 591 866 0 0 0
Dr 315 0 0
At STD N 00E0FFFF
Ne 0 ""
Po 3500 -3000
$EndPAD
$PAD
Sh "19" O 591 866 0 0 0
Dr 315 0 0
At STD N 00E0FFFF
Ne 0 ""
Po 2500 -3000
$EndPAD
$PAD
Sh "20" O 591 866 0 0 0
Dr 315 0 0
At STD N 00E0FFFF
Ne 0 ""
Po 1500 -3000
$EndPAD
$PAD
Sh "21" O 591 866 0 0 0
Dr 315 0 0
At STD N 00E0FFFF
Ne 0 ""
Po 500 -3000
$EndPAD
$PAD
Sh "22" O 591 866 0 0 0
Dr 315 0 0
At STD N 00E0FFFF
Ne 0 ""
Po -500 -3000
$EndPAD
$PAD
Sh "23" O 591 866 0 0 0
Dr 315 0 0
At STD N 00E0FFFF
Ne 0 ""
Po -1500 -3000
$EndPAD
$PAD
Sh "24" O 591 866 0 0 0
Dr 315 0 0
At STD N 00E0FFFF
Ne 0 ""
Po -2500 -3000
$EndPAD
$PAD
Sh "25" O 591 866 0 0 0
Dr 315 0 0
At STD N 00E0FFFF
Ne 0 ""
Po -3500 -3000
$EndPAD
$PAD
Sh "26" O 591 866 0 0 0
Dr 315 0 0
At STD N 00E0FFFF
Ne 0 ""
Po -4500 -3000
$EndPAD
$PAD
Sh "27" O 591 866 0 0 0
Dr 315 0 0
At STD N 00E0FFFF
Ne 0 ""
Po -5500 -3000
$EndPAD
$PAD
Sh "28" O 591 866 0 0 0
Dr 315 0 0
At STD N 00E0FFFF
Ne 0 ""
Po -6500 -3000
$EndPAD
$SHAPE3D
Na "walter\pth_circuits\dil_28-600.wrl"
Sc 1.000000 1.000000 1.000000
Of 0.000000 0.000000 0.000000
Ro 0.000000 0.000000 0.000000
$EndSHAPE3D
$EndMODULE  dil_28-600
$MODULE dil_40-600_socket
Po 0 0 0 15 4E4CE7B1 00000000 ~~
Li dil_40-600_socket
Cd IC, DIL40 x 0,6", with socket
Kw DIL
Sc 00000000
AR
Op 0 0 0
T0 0 -4000 600 450 0 113 N V 21 N"U***"
T1 0 4100 600 450 0 113 N V 21 N"DIL_40-600_socket"
DS -8800 -2000 8800 -2000 100 21
DS 8800 2000 -8800 2000 100 21
DS -10000 3500 10000 3500 150 21
DS 10400 2800 -10400 2800 150 21
DS -10000 -3500 10000 -3500 150 21
DS 10400 -2800 -10400 -2800 150 21
DS 10400 2800 10400 -2800 150 21
DS 10000 -3500 10000 3500 150 21
DS -10000 3500 -10000 -3500 150 21
DS -10400 -2800 -10400 2800 150 21
DS -500 -2000 -500 2000 100 21
DS 500 2000 500 -2000 100 21
DS 8800 -2000 8800 2000 100 21
DS -8800 -2000 -8800 2000 100 21
DS -10000 -500 -10000 500 150 21
DA -10000 0 -10000 -500 900 100 21
DA -10000 0 -9500 0 900 100 21
DS -10000 500 -10400 500 150 21
DS -10000 -500 -10400 -500 150 21
$PAD
Sh "1" O 591 866 0 0 0
Dr 315 0 0
At STD N 00E0FFFF
Ne 0 ""
Po -9500 3000
$EndPAD
$PAD
Sh "2" O 591 866 0 0 0
Dr 315 0 0
At STD N 00E0FFFF
Ne 0 ""
Po -8500 3000
$EndPAD
$PAD
Sh "3" O 591 866 0 0 0
Dr 315 0 0
At STD N 00E0FFFF
Ne 0 ""
Po -7500 3000
$EndPAD
$PAD
Sh "4" O 591 866 0 0 0
Dr 315 0 0
At STD N 00E0FFFF
Ne 0 ""
Po -6500 3000
$EndPAD
$PAD
Sh "5" O 591 866 0 0 0
Dr 315 0 0
At STD N 00E0FFFF
Ne 0 ""
Po -5500 3000
$EndPAD
$PAD
Sh "6" O 591 866 0 0 0
Dr 315 0 0
At STD N 00E0FFFF
Ne 0 ""
Po -4500 3000
$EndPAD
$PAD
Sh "7" O 591 866 0 0 0
Dr 315 0 0
At STD N 00E0FFFF
Ne 0 ""
Po -3500 3000
$EndPAD
$PAD
Sh "8" O 591 866 0 0 0
Dr 315 0 0
At STD N 00E0FFFF
Ne 0 ""
Po -2500 3000
$EndPAD
$PAD
Sh "9" O 591 866 0 0 0
Dr 315 0 0
At STD N 00E0FFFF
Ne 0 ""
Po -1500 3000
$EndPAD
$PAD
Sh "10" O 591 866 0 0 0
Dr 315 0 0
At STD N 00E0FFFF
Ne 0 ""
Po -500 3000
$EndPAD
$PAD
Sh "11" O 591 866 0 0 0
Dr 315 0 0
At STD N 00E0FFFF
Ne 0 ""
Po 500 3000
$EndPAD
$PAD
Sh "12" O 591 866 0 0 0
Dr 315 0 0
At STD N 00E0FFFF
Ne 0 ""
Po 1500 3000
$EndPAD
$PAD
Sh "13" O 591 866 0 0 0
Dr 315 0 0
At STD N 00E0FFFF
Ne 0 ""
Po 2500 3000
$EndPAD
$PAD
Sh "14" O 591 866 0 0 0
Dr 315 0 0
At STD N 00E0FFFF
Ne 0 ""
Po 3500 3000
$EndPAD
$PAD
Sh "15" O 591 866 0 0 0
Dr 315 0 0
At STD N 00E0FFFF
Ne 0 ""
Po 4500 3000
$EndPAD
$PAD
Sh "16" O 591 866 0 0 0
Dr 315 0 0
At STD N 00E0FFFF
Ne 0 ""
Po 5500 3000
$EndPAD
$PAD
Sh "17" O 591 866 0 0 0
Dr 315 0 0
At STD N 00E0FFFF
Ne 0 ""
Po 6500 3000
$EndPAD
$PAD
Sh "18" O 591 866 0 0 0
Dr 315 0 0
At STD N 00E0FFFF
Ne 0 ""
Po 7500 3000
$EndPAD
$PAD
Sh "19" O 591 866 0 0 0
Dr 315 0 0
At STD N 00E0FFFF
Ne 0 ""
Po 8500 3000
$EndPAD
$PAD
Sh "20" O 591 866 0 0 0
Dr 315 0 0
At STD N 00E0FFFF
Ne 0 ""
Po 9500 3000
$EndPAD
$PAD
Sh "21" O 591 866 0 0 0
Dr 315 0 0
At STD N 00E0FFFF
Ne 0 ""
Po 9500 -3000
$EndPAD
$PAD
Sh "22" O 591 866 0 0 0
Dr 315 0 0
At STD N 00E0FFFF
Ne 0 ""
Po 8500 -3000
$EndPAD
$PAD
Sh "23" O 591 866 0 0 0
Dr 315 0 0
At STD N 00E0FFFF
Ne 0 ""
Po 7500 -3000
$EndPAD
$PAD
Sh "24" O 591 866 0 0 0
Dr 315 0 0
At STD N 00E0FFFF
Ne 0 ""
Po 6500 -3000
$EndPAD
$PAD
Sh "25" O 591 866 0 0 0
Dr 315 0 0
At STD N 00E0FFFF
Ne 0 ""
Po 5500 -3000
$EndPAD
$PAD
Sh "26" O 591 866 0 0 0
Dr 315 0 0
At STD N 00E0FFFF
Ne 0 ""
Po 4500 -3000
$EndPAD
$PAD
Sh "27" O 591 866 0 0 0
Dr 315 0 0
At STD N 00E0FFFF
Ne 0 ""
Po 3500 -3000
$EndPAD
$PAD
Sh "28" O 591 866 0 0 0
Dr 315 0 0
At STD N 00E0FFFF
Ne 0 ""
Po 2500 -3000
$EndPAD
$PAD
Sh "29" O 591 866 0 0 0
Dr 315 0 0
At STD N 00E0FFFF
Ne 0 ""
Po 1500 -3000
$EndPAD
$PAD
Sh "30" O 591 866 0 0 0
Dr 315 0 0
At STD N 00E0FFFF
Ne 0 ""
Po 500 -3000
$EndPAD
$PAD
Sh "31" O 591 866 0 0 0
Dr 315 0 0
At STD N 00E0FFFF
Ne 0 ""
Po -500 -3000
$EndPAD
$PAD
Sh "32" O 591 866 0 0 0
Dr 315 0 0
At STD N 00E0FFFF
Ne 0 ""
Po -1500 -3000
$EndPAD
$PAD
Sh "33" O 591 866 0 0 0
Dr 315 0 0
At STD N 00E0FFFF
Ne 0 ""
Po -2500 -3000
$EndPAD
$PAD
Sh "34" O 591 866 0 0 0
Dr 315 0 0
At STD N 00E0FFFF
Ne 0 ""
Po -3500 -3000
$EndPAD
$PAD
Sh "35" O 591 866 0 0 0
Dr 315 0 0
At STD N 00E0FFFF
Ne 0 ""
Po -4500 -3000
$EndPAD
$PAD
Sh "36" O 591 866 0 0 0
Dr 315 0 0
At STD N 00E0FFFF
Ne 0 ""
Po -5500 -3000
$EndPAD
$PAD
Sh "37" O 591 866 0 0 0
Dr 315 0 0
At STD N 00E0FFFF
Ne 0 ""
Po -6500 -3000
$EndPAD
$PAD
Sh "38" O 591 866 0 0 0
Dr 315 0 0
At STD N 00E0FFFF
Ne 0 ""
Po -7500 -3000
$EndPAD
$PAD
Sh "39" O 591 866 0 0 0
Dr 315 0 0
At STD N 00E0FFFF
Ne 0 ""
Po -8500 -3000
$EndPAD
$PAD
Sh "40" O 591 866 0 0 0
Dr 315 0 0
At STD N 00E0FFFF
Ne 0 ""
Po -9500 -3000
$EndPAD
$SHAPE3D
Na "walter\pth_circuits\dil_40-600_socket.wrl"
Sc 1.000000 1.000000 1.000000
Of 0.000000 0.000000 0.000000
Ro 0.000000 0.000000 0.000000
$EndSHAPE3D
$EndMODULE  dil_40-600_socket
$MODULE dil_40-600
Po 0 0 0 15 4E4CE7F7 00000000 ~~
Li dil_40-600
Cd IC, DIL40 x 0,6"
Kw DIL
Sc 00000000
AR
Op 0 0 0
T0 0 -4000 600 450 0 113 N V 21 N"U***"
T1 0 4100 600 450 0 113 N V 21 N"DIL_40-600"
DS 10400 2800 -10400 2800 150 21
DS 10400 -2800 -10400 -2800 150 21
DS 10400 2800 10400 -2800 150 21
DS -10400 -2800 -10400 2800 150 21
DS -10000 -500 -10000 500 150 21
DS -10000 500 -10400 500 150 21
DS -10000 -500 -10400 -500 150 21
$PAD
Sh "1" O 591 866 0 0 0
Dr 315 0 0
At STD N 00E0FFFF
Ne 0 ""
Po -9500 3000
$EndPAD
$PAD
Sh "2" O 591 866 0 0 0
Dr 315 0 0
At STD N 00E0FFFF
Ne 0 ""
Po -8500 3000
$EndPAD
$PAD
Sh "3" O 591 866 0 0 0
Dr 315 0 0
At STD N 00E0FFFF
Ne 0 ""
Po -7500 3000
$EndPAD
$PAD
Sh "4" O 591 866 0 0 0
Dr 315 0 0
At STD N 00E0FFFF
Ne 0 ""
Po -6500 3000
$EndPAD
$PAD
Sh "5" O 591 866 0 0 0
Dr 315 0 0
At STD N 00E0FFFF
Ne 0 ""
Po -5500 3000
$EndPAD
$PAD
Sh "6" O 591 866 0 0 0
Dr 315 0 0
At STD N 00E0FFFF
Ne 0 ""
Po -4500 3000
$EndPAD
$PAD
Sh "7" O 591 866 0 0 0
Dr 315 0 0
At STD N 00E0FFFF
Ne 0 ""
Po -3500 3000
$EndPAD
$PAD
Sh "8" O 591 866 0 0 0
Dr 315 0 0
At STD N 00E0FFFF
Ne 0 ""
Po -2500 3000
$EndPAD
$PAD
Sh "9" O 591 866 0 0 0
Dr 315 0 0
At STD N 00E0FFFF
Ne 0 ""
Po -1500 3000
$EndPAD
$PAD
Sh "10" O 591 866 0 0 0
Dr 315 0 0
At STD N 00E0FFFF
Ne 0 ""
Po -500 3000
$EndPAD
$PAD
Sh "11" O 591 866 0 0 0
Dr 315 0 0
At STD N 00E0FFFF
Ne 0 ""
Po 500 3000
$EndPAD
$PAD
Sh "12" O 591 866 0 0 0
Dr 315 0 0
At STD N 00E0FFFF
Ne 0 ""
Po 1500 3000
$EndPAD
$PAD
Sh "13" O 591 866 0 0 0
Dr 315 0 0
At STD N 00E0FFFF
Ne 0 ""
Po 2500 3000
$EndPAD
$PAD
Sh "14" O 591 866 0 0 0
Dr 315 0 0
At STD N 00E0FFFF
Ne 0 ""
Po 3500 3000
$EndPAD
$PAD
Sh "15" O 591 866 0 0 0
Dr 315 0 0
At STD N 00E0FFFF
Ne 0 ""
Po 4500 3000
$EndPAD
$PAD
Sh "16" O 591 866 0 0 0
Dr 315 0 0
At STD N 00E0FFFF
Ne 0 ""
Po 5500 3000
$EndPAD
$PAD
Sh "17" O 591 866 0 0 0
Dr 315 0 0
At STD N 00E0FFFF
Ne 0 ""
Po 6500 3000
$EndPAD
$PAD
Sh "18" O 591 866 0 0 0
Dr 315 0 0
At STD N 00E0FFFF
Ne 0 ""
Po 7500 3000
$EndPAD
$PAD
Sh "19" O 591 866 0 0 0
Dr 315 0 0
At STD N 00E0FFFF
Ne 0 ""
Po 8500 3000
$EndPAD
$PAD
Sh "20" O 591 866 0 0 0
Dr 315 0 0
At STD N 00E0FFFF
Ne 0 ""
Po 9500 3000
$EndPAD
$PAD
Sh "21" O 591 866 0 0 0
Dr 315 0 0
At STD N 00E0FFFF
Ne 0 ""
Po 9500 -3000
$EndPAD
$PAD
Sh "22" O 591 866 0 0 0
Dr 315 0 0
At STD N 00E0FFFF
Ne 0 ""
Po 8500 -3000
$EndPAD
$PAD
Sh "23" O 591 866 0 0 0
Dr 315 0 0
At STD N 00E0FFFF
Ne 0 ""
Po 7500 -3000
$EndPAD
$PAD
Sh "24" O 591 866 0 0 0
Dr 315 0 0
At STD N 00E0FFFF
Ne 0 ""
Po 6500 -3000
$EndPAD
$PAD
Sh "25" O 591 866 0 0 0
Dr 315 0 0
At STD N 00E0FFFF
Ne 0 ""
Po 5500 -3000
$EndPAD
$PAD
Sh "26" O 591 866 0 0 0
Dr 315 0 0
At STD N 00E0FFFF
Ne 0 ""
Po 4500 -3000
$EndPAD
$PAD
Sh "27" O 591 866 0 0 0
Dr 315 0 0
At STD N 00E0FFFF
Ne 0 ""
Po 3500 -3000
$EndPAD
$PAD
Sh "28" O 591 866 0 0 0
Dr 315 0 0
At STD N 00E0FFFF
Ne 0 ""
Po 2500 -3000
$EndPAD
$PAD
Sh "29" O 591 866 0 0 0
Dr 315 0 0
At STD N 00E0FFFF
Ne 0 ""
Po 1500 -3000
$EndPAD
$PAD
Sh "30" O 591 866 0 0 0
Dr 315 0 0
At STD N 00E0FFFF
Ne 0 ""
Po 500 -3000
$EndPAD
$PAD
Sh "31" O 591 866 0 0 0
Dr 315 0 0
At STD N 00E0FFFF
Ne 0 ""
Po -500 -3000
$EndPAD
$PAD
Sh "32" O 591 866 0 0 0
Dr 315 0 0
At STD N 00E0FFFF
Ne 0 ""
Po -1500 -3000
$EndPAD
$PAD
Sh "33" O 591 866 0 0 0
Dr 315 0 0
At STD N 00E0FFFF
Ne 0 ""
Po -2500 -3000
$EndPAD
$PAD
Sh "34" O 591 866 0 0 0
Dr 315 0 0
At STD N 00E0FFFF
Ne 0 ""
Po -3500 -3000
$EndPAD
$PAD
Sh "35" O 591 866 0 0 0
Dr 315 0 0
At STD N 00E0FFFF
Ne 0 ""
Po -4500 -3000
$EndPAD
$PAD
Sh "36" O 591 866 0 0 0
Dr 315 0 0
At STD N 00E0FFFF
Ne 0 ""
Po -5500 -3000
$EndPAD
$PAD
Sh "37" O 591 866 0 0 0
Dr 315 0 0
At STD N 00E0FFFF
Ne 0 ""
Po -6500 -3000
$EndPAD
$PAD
Sh "38" O 591 866 0 0 0
Dr 315 0 0
At STD N 00E0FFFF
Ne 0 ""
Po -7500 -3000
$EndPAD
$PAD
Sh "39" O 591 866 0 0 0
Dr 315 0 0
At STD N 00E0FFFF
Ne 0 ""
Po -8500 -3000
$EndPAD
$PAD
Sh "40" O 591 866 0 0 0
Dr 315 0 0
At STD N 00E0FFFF
Ne 0 ""
Po -9500 -3000
$EndPAD
$SHAPE3D
Na "walter\pth_circuits\dil_40-600.wrl"
Sc 1.000000 1.000000 1.000000
Of 0.000000 0.000000 0.000000
Ro 0.000000 0.000000 0.000000
$EndSHAPE3D
$EndMODULE  dil_40-600
$MODULE dil_48-600_socket
Po 0 0 0 15 4E4CE9C4 00000000 ~~
Li dil_48-600_socket
Cd IC, DIL48 x 0,6", with socket
Kw DIL
Sc 00000000
AR
Op 0 0 0
T0 0 -4000 600 450 0 113 N V 21 N"U***"
T1 0 4100 600 450 0 113 N V 21 N"DIL_48-600_socket"
DS -12000 -3500 12000 -3500 150 21
DS 12400 -2800 -12400 -2800 150 21
DS -12000 3500 12000 3500 150 21
DS 12400 2800 -12400 2800 150 21
DS -10800 2000 10800 2000 100 21
DS 10800 -2000 -10800 -2000 100 21
DS 12400 2800 12400 -2800 150 21
DS 12000 -3500 12000 3500 150 21
DS -12000 3500 -12000 -3500 150 21
DS -12400 -2800 -12400 2800 150 21
DS -500 -2000 -500 2000 100 21
DS 500 2000 500 -2000 100 21
DS 10800 -2000 10800 2000 100 21
DS -10800 -2000 -10800 2000 100 21
DS -12000 -500 -12000 500 150 21
DA -12000 0 -12000 -500 900 100 21
DA -12000 0 -11500 0 900 100 21
DS -12000 500 -12400 500 150 21
DS -12000 -500 -12400 -500 150 21
$PAD
Sh "1" O 591 866 0 0 0
Dr 315 0 0
At STD N 00E0FFFF
Ne 0 ""
Po -11500 3000
$EndPAD
$PAD
Sh "2" O 591 866 0 0 0
Dr 315 0 0
At STD N 00E0FFFF
Ne 0 ""
Po -10500 3000
$EndPAD
$PAD
Sh "3" O 591 866 0 0 0
Dr 315 0 0
At STD N 00E0FFFF
Ne 0 ""
Po -9500 3000
$EndPAD
$PAD
Sh "4" O 591 866 0 0 0
Dr 315 0 0
At STD N 00E0FFFF
Ne 0 ""
Po -8500 3000
$EndPAD
$PAD
Sh "5" O 591 866 0 0 0
Dr 315 0 0
At STD N 00E0FFFF
Ne 0 ""
Po -7500 3000
$EndPAD
$PAD
Sh "6" O 591 866 0 0 0
Dr 315 0 0
At STD N 00E0FFFF
Ne 0 ""
Po -6500 3000
$EndPAD
$PAD
Sh "7" O 591 866 0 0 0
Dr 315 0 0
At STD N 00E0FFFF
Ne 0 ""
Po -5500 3000
$EndPAD
$PAD
Sh "8" O 591 866 0 0 0
Dr 315 0 0
At STD N 00E0FFFF
Ne 0 ""
Po -4500 3000
$EndPAD
$PAD
Sh "9" O 591 866 0 0 0
Dr 315 0 0
At STD N 00E0FFFF
Ne 0 ""
Po -3500 3000
$EndPAD
$PAD
Sh "10" O 591 866 0 0 0
Dr 315 0 0
At STD N 00E0FFFF
Ne 0 ""
Po -2500 3000
$EndPAD
$PAD
Sh "11" O 591 866 0 0 0
Dr 315 0 0
At STD N 00E0FFFF
Ne 0 ""
Po -1500 3000
$EndPAD
$PAD
Sh "12" O 591 866 0 0 0
Dr 315 0 0
At STD N 00E0FFFF
Ne 0 ""
Po -500 3000
$EndPAD
$PAD
Sh "13" O 591 866 0 0 0
Dr 315 0 0
At STD N 00E0FFFF
Ne 0 ""
Po 500 3000
$EndPAD
$PAD
Sh "14" O 591 866 0 0 0
Dr 315 0 0
At STD N 00E0FFFF
Ne 0 ""
Po 1500 3000
$EndPAD
$PAD
Sh "15" O 591 866 0 0 0
Dr 315 0 0
At STD N 00E0FFFF
Ne 0 ""
Po 2500 3000
$EndPAD
$PAD
Sh "16" O 591 866 0 0 0
Dr 315 0 0
At STD N 00E0FFFF
Ne 0 ""
Po 3500 3000
$EndPAD
$PAD
Sh "17" O 591 866 0 0 0
Dr 315 0 0
At STD N 00E0FFFF
Ne 0 ""
Po 4500 3000
$EndPAD
$PAD
Sh "18" O 591 866 0 0 0
Dr 315 0 0
At STD N 00E0FFFF
Ne 0 ""
Po 5500 3000
$EndPAD
$PAD
Sh "19" O 591 866 0 0 0
Dr 315 0 0
At STD N 00E0FFFF
Ne 0 ""
Po 6500 3000
$EndPAD
$PAD
Sh "20" O 591 866 0 0 0
Dr 315 0 0
At STD N 00E0FFFF
Ne 0 ""
Po 7500 3000
$EndPAD
$PAD
Sh "21" O 591 866 0 0 0
Dr 315 0 0
At STD N 00E0FFFF
Ne 0 ""
Po 8500 3000
$EndPAD
$PAD
Sh "22" O 591 866 0 0 0
Dr 315 0 0
At STD N 00E0FFFF
Ne 0 ""
Po 9500 3000
$EndPAD
$PAD
Sh "23" O 591 866 0 0 0
Dr 315 0 0
At STD N 00E0FFFF
Ne 0 ""
Po 10500 3000
$EndPAD
$PAD
Sh "24" O 591 866 0 0 0
Dr 315 0 0
At STD N 00E0FFFF
Ne 0 ""
Po 11500 3000
$EndPAD
$PAD
Sh "25" O 591 866 0 0 0
Dr 315 0 0
At STD N 00E0FFFF
Ne 0 ""
Po 11500 -3000
$EndPAD
$PAD
Sh "26" O 591 866 0 0 0
Dr 315 0 0
At STD N 00E0FFFF
Ne 0 ""
Po 10500 -3000
$EndPAD
$PAD
Sh "27" O 591 866 0 0 0
Dr 315 0 0
At STD N 00E0FFFF
Ne 0 ""
Po 9500 -3000
$EndPAD
$PAD
Sh "28" O 591 866 0 0 0
Dr 315 0 0
At STD N 00E0FFFF
Ne 0 ""
Po 8500 -3000
$EndPAD
$PAD
Sh "29" O 591 866 0 0 0
Dr 315 0 0
At STD N 00E0FFFF
Ne 0 ""
Po 7500 -3000
$EndPAD
$PAD
Sh "30" O 591 866 0 0 0
Dr 315 0 0
At STD N 00E0FFFF
Ne 0 ""
Po 6500 -3000
$EndPAD
$PAD
Sh "31" O 591 866 0 0 0
Dr 315 0 0
At STD N 00E0FFFF
Ne 0 ""
Po 5500 -3000
$EndPAD
$PAD
Sh "32" O 591 866 0 0 0
Dr 315 0 0
At STD N 00E0FFFF
Ne 0 ""
Po 4500 -3000
$EndPAD
$PAD
Sh "33" O 591 866 0 0 0
Dr 315 0 0
At STD N 00E0FFFF
Ne 0 ""
Po 3500 -3000
$EndPAD
$PAD
Sh "34" O 591 866 0 0 0
Dr 315 0 0
At STD N 00E0FFFF
Ne 0 ""
Po 2500 -3000
$EndPAD
$PAD
Sh "35" O 591 866 0 0 0
Dr 315 0 0
At STD N 00E0FFFF
Ne 0 ""
Po 1500 -3000
$EndPAD
$PAD
Sh "36" O 591 866 0 0 0
Dr 315 0 0
At STD N 00E0FFFF
Ne 0 ""
Po 500 -3000
$EndPAD
$PAD
Sh "37" O 591 866 0 0 0
Dr 315 0 0
At STD N 00E0FFFF
Ne 0 ""
Po -500 -3000
$EndPAD
$PAD
Sh "38" O 591 866 0 0 0
Dr 315 0 0
At STD N 00E0FFFF
Ne 0 ""
Po -1500 -3000
$EndPAD
$PAD
Sh "39" O 591 866 0 0 0
Dr 315 0 0
At STD N 00E0FFFF
Ne 0 ""
Po -2500 -3000
$EndPAD
$PAD
Sh "40" O 591 866 0 0 0
Dr 315 0 0
At STD N 00E0FFFF
Ne 0 ""
Po -3500 -3000
$EndPAD
$PAD
Sh "41" O 591 866 0 0 0
Dr 315 0 0
At STD N 00E0FFFF
Ne 0 ""
Po -4500 -3000
$EndPAD
$PAD
Sh "42" O 591 866 0 0 0
Dr 315 0 0
At STD N 00E0FFFF
Ne 0 ""
Po -5500 -3000
$EndPAD
$PAD
Sh "43" O 591 866 0 0 0
Dr 315 0 0
At STD N 00E0FFFF
Ne 0 ""
Po -6500 -3000
$EndPAD
$PAD
Sh "44" O 591 866 0 0 0
Dr 315 0 0
At STD N 00E0FFFF
Ne 0 ""
Po -7500 -3000
$EndPAD
$PAD
Sh "45" O 591 866 0 0 0
Dr 315 0 0
At STD N 00E0FFFF
Ne 0 ""
Po -8500 -3000
$EndPAD
$PAD
Sh "46" O 591 866 0 0 0
Dr 315 0 0
At STD N 00E0FFFF
Ne 0 ""
Po -9500 -3000
$EndPAD
$PAD
Sh "47" O 591 866 0 0 0
Dr 315 0 0
At STD N 00E0FFFF
Ne 0 ""
Po -10500 -3000
$EndPAD
$PAD
Sh "48" O 591 866 0 0 0
Dr 315 0 0
At STD N 00E0FFFF
Ne 0 ""
Po -11500 -3000
$EndPAD
$SHAPE3D
Na "walter\pth_circuits\dil_48-600_socket.wrl"
Sc 1.000000 1.000000 1.000000
Of 0.000000 0.000000 0.000000
Ro 0.000000 0.000000 0.000000
$EndSHAPE3D
$EndMODULE  dil_48-600_socket
$MODULE dil_48-600
Po 0 0 0 15 4E4CEA36 00000000 ~~
Li dil_48-600
Cd IC, DIL48 x 0,6"
Kw DIL
Sc 00000000
AR 
Op 0 0 0
T0 0 -4000 600 450 0 113 N V 21 N"U***"
T1 0 4100 600 450 0 113 N V 21 N"DIL_48-600"
DS 12400 -2800 -12400 -2800 150 21
DS 12400 2800 -12400 2800 150 21
DS 12400 2800 12400 -2800 150 21
DS -12400 -2800 -12400 2800 150 21
DS -12000 -500 -12000 500 150 21
DS -12000 500 -12400 500 150 21
DS -12000 -500 -12400 -500 150 21
$PAD
Sh "1" O 591 866 0 0 0
Dr 315 0 0
At STD N 00E0FFFF
Ne 0 ""
Po -11500 3000
$EndPAD
$PAD
Sh "2" O 591 866 0 0 0
Dr 315 0 0
At STD N 00E0FFFF
Ne 0 ""
Po -10500 3000
$EndPAD
$PAD
Sh "3" O 591 866 0 0 0
Dr 315 0 0
At STD N 00E0FFFF
Ne 0 ""
Po -9500 3000
$EndPAD
$PAD
Sh "4" O 591 866 0 0 0
Dr 315 0 0
At STD N 00E0FFFF
Ne 0 ""
Po -8500 3000
$EndPAD
$PAD
Sh "5" O 591 866 0 0 0
Dr 315 0 0
At STD N 00E0FFFF
Ne 0 ""
Po -7500 3000
$EndPAD
$PAD
Sh "6" O 591 866 0 0 0
Dr 315 0 0
At STD N 00E0FFFF
Ne 0 ""
Po -6500 3000
$EndPAD
$PAD
Sh "7" O 591 866 0 0 0
Dr 315 0 0
At STD N 00E0FFFF
Ne 0 ""
Po -5500 3000
$EndPAD
$PAD
Sh "8" O 591 866 0 0 0
Dr 315 0 0
At STD N 00E0FFFF
Ne 0 ""
Po -4500 3000
$EndPAD
$PAD
Sh "9" O 591 866 0 0 0
Dr 315 0 0
At STD N 00E0FFFF
Ne 0 ""
Po -3500 3000
$EndPAD
$PAD
Sh "10" O 591 866 0 0 0
Dr 315 0 0
At STD N 00E0FFFF
Ne 0 ""
Po -2500 3000
$EndPAD
$PAD
Sh "11" O 591 866 0 0 0
Dr 315 0 0
At STD N 00E0FFFF
Ne 0 ""
Po -1500 3000
$EndPAD
$PAD
Sh "12" O 591 866 0 0 0
Dr 315 0 0
At STD N 00E0FFFF
Ne 0 ""
Po -500 3000
$EndPAD
$PAD
Sh "13" O 591 866 0 0 0
Dr 315 0 0
At STD N 00E0FFFF
Ne 0 ""
Po 500 3000
$EndPAD
$PAD
Sh "14" O 591 866 0 0 0
Dr 315 0 0
At STD N 00E0FFFF
Ne 0 ""
Po 1500 3000
$EndPAD
$PAD
Sh "15" O 591 866 0 0 0
Dr 315 0 0
At STD N 00E0FFFF
Ne 0 ""
Po 2500 3000
$EndPAD
$PAD
Sh "16" O 591 866 0 0 0
Dr 315 0 0
At STD N 00E0FFFF
Ne 0 ""
Po 3500 3000
$EndPAD
$PAD
Sh "17" O 591 866 0 0 0
Dr 315 0 0
At STD N 00E0FFFF
Ne 0 ""
Po 4500 3000
$EndPAD
$PAD
Sh "18" O 591 866 0 0 0
Dr 315 0 0
At STD N 00E0FFFF
Ne 0 ""
Po 5500 3000
$EndPAD
$PAD
Sh "19" O 591 866 0 0 0
Dr 315 0 0
At STD N 00E0FFFF
Ne 0 ""
Po 6500 3000
$EndPAD
$PAD
Sh "20" O 591 866 0 0 0
Dr 315 0 0
At STD N 00E0FFFF
Ne 0 ""
Po 7500 3000
$EndPAD
$PAD
Sh "21" O 591 866 0 0 0
Dr 315 0 0
At STD N 00E0FFFF
Ne 0 ""
Po 8500 3000
$EndPAD
$PAD
Sh "22" O 591 866 0 0 0
Dr 315 0 0
At STD N 00E0FFFF
Ne 0 ""
Po 9500 3000
$EndPAD
$PAD
Sh "23" O 591 866 0 0 0
Dr 315 0 0
At STD N 00E0FFFF
Ne 0 ""
Po 10500 3000
$EndPAD
$PAD
Sh "24" O 591 866 0 0 0
Dr 315 0 0
At STD N 00E0FFFF
Ne 0 ""
Po 11500 3000
$EndPAD
$PAD
Sh "25" O 591 866 0 0 0
Dr 315 0 0
At STD N 00E0FFFF
Ne 0 ""
Po 11500 -3000
$EndPAD
$PAD
Sh "26" O 591 866 0 0 0
Dr 315 0 0
At STD N 00E0FFFF
Ne 0 ""
Po 10500 -3000
$EndPAD
$PAD
Sh "27" O 591 866 0 0 0
Dr 315 0 0
At STD N 00E0FFFF
Ne 0 ""
Po 9500 -3000
$EndPAD
$PAD
Sh "28" O 591 866 0 0 0
Dr 315 0 0
At STD N 00E0FFFF
Ne 0 ""
Po 8500 -3000
$EndPAD
$PAD
Sh "29" O 591 866 0 0 0
Dr 315 0 0
At STD N 00E0FFFF
Ne 0 ""
Po 7500 -3000
$EndPAD
$PAD
Sh "30" O 591 866 0 0 0
Dr 315 0 0
At STD N 00E0FFFF
Ne 0 ""
Po 6500 -3000
$EndPAD
$PAD
Sh "31" O 591 866 0 0 0
Dr 315 0 0
At STD N 00E0FFFF
Ne 0 ""
Po 5500 -3000
$EndPAD
$PAD
Sh "32" O 591 866 0 0 0
Dr 315 0 0
At STD N 00E0FFFF
Ne 0 ""
Po 4500 -3000
$EndPAD
$PAD
Sh "33" O 591 866 0 0 0
Dr 315 0 0
At STD N 00E0FFFF
Ne 0 ""
Po 3500 -3000
$EndPAD
$PAD
Sh "34" O 591 866 0 0 0
Dr 315 0 0
At STD N 00E0FFFF
Ne 0 ""
Po 2500 -3000
$EndPAD
$PAD
Sh "35" O 591 866 0 0 0
Dr 315 0 0
At STD N 00E0FFFF
Ne 0 ""
Po 1500 -3000
$EndPAD
$PAD
Sh "36" O 591 866 0 0 0
Dr 315 0 0
At STD N 00E0FFFF
Ne 0 ""
Po 500 -3000
$EndPAD
$PAD
Sh "37" O 591 866 0 0 0
Dr 315 0 0
At STD N 00E0FFFF
Ne 0 ""
Po -500 -3000
$EndPAD
$PAD
Sh "38" O 591 866 0 0 0
Dr 315 0 0
At STD N 00E0FFFF
Ne 0 ""
Po -1500 -3000
$EndPAD
$PAD
Sh "39" O 591 866 0 0 0
Dr 315 0 0
At STD N 00E0FFFF
Ne 0 ""
Po -2500 -3000
$EndPAD
$PAD
Sh "40" O 591 866 0 0 0
Dr 315 0 0
At STD N 00E0FFFF
Ne 0 ""
Po -3500 -3000
$EndPAD
$PAD
Sh "41" O 591 866 0 0 0
Dr 315 0 0
At STD N 00E0FFFF
Ne 0 ""
Po -4500 -3000
$EndPAD
$PAD
Sh "42" O 591 866 0 0 0
Dr 315 0 0
At STD N 00E0FFFF
Ne 0 ""
Po -5500 -3000
$EndPAD
$PAD
Sh "43" O 591 866 0 0 0
Dr 315 0 0
At STD N 00E0FFFF
Ne 0 ""
Po -6500 -3000
$EndPAD
$PAD
Sh "44" O 591 866 0 0 0
Dr 315 0 0
At STD N 00E0FFFF
Ne 0 ""
Po -7500 -3000
$EndPAD
$PAD
Sh "45" O 591 866 0 0 0
Dr 315 0 0
At STD N 00E0FFFF
Ne 0 ""
Po -8500 -3000
$EndPAD
$PAD
Sh "46" O 591 866 0 0 0
Dr 315 0 0
At STD N 00E0FFFF
Ne 0 ""
Po -9500 -3000
$EndPAD
$PAD
Sh "47" O 591 866 0 0 0
Dr 315 0 0
At STD N 00E0FFFF
Ne 0 ""
Po -10500 -3000
$EndPAD
$PAD
Sh "48" O 591 866 0 0 0
Dr 315 0 0
At STD N 00E0FFFF
Ne 0 ""
Po -11500 -3000
$EndPAD
$SHAPE3D
Na "walter\pth_circuits\dil_48-600.wrl"
Sc 1.000000 1.000000 1.000000
Of 0.000000 0.000000 0.000000
Ro 0.000000 0.000000 0.000000
$EndSHAPE3D
$EndMODULE  dil_48-600
$EndLIBRARY
