register,a,dmc:Register
register,dmc:rootPublicKey,registerRootPublicKey
update1,a,dmc:Update
update1,dmc:container,register
update1,dmc:timestamp,0
update1,rdf:value,initial-value
update1Signature,a,rdf-signify:Signature
update1Signature,rdf-signify:message,update1
update1Signature,rdf:value,valid-signature
update2,a,dmc:Update
update2,dmc:container,register
update2,dmc:timestamp,1
update2,rdf:value,second-value
update2Signature,a,rdf-signify:Signature
update2Signature,rdf-signify:message,update2
update2Signature,rdf:value,valid-signature
