package com.ventiun.postpricing.rule;

import com.ventiun.postpricing.model.FactoringPostPricingDataObject;

dialect "mvel";

rule "EVALUATION_COMPLETED"
	when
		fppdo : FactoringPostPricingDataObject(disbursementAmount <= disbursementMaxAmount, isSponsored == "FALSE", isRisk == "FALSE")
	then
		fppdo.setPostPricingResult( "EVALUATION_COMPLETED" );
end

rule "EVALUATION_PENDING_VERFICATION_02"
	when
    		fppdo : FactoringPostPricingDataObject(disbursementAmount <= disbursementMaxAmount, isSponsored == "TRUE")
	then
		fppdo.setPostPricingResult( "EVALUATION_PENDING_VERFICATION_02" );
end

rule "EVALUATION_PENDING_VERFICATION_03"
	when
    		fppdo : FactoringPostPricingDataObject(disbursementAmount <= disbursementMaxAmount, isRisk == "TRUE")
	then
		fppdo.setPostPricingResult( "EVALUATION_PENDING_VERFICATION_03" );
end

rule "EVALUATION_PENDING_VERFICATION_01"
	when
    		fppdo : FactoringPostPricingDataObject(disbursementAmount > disbursementMaxAmount, isRisk == "FALSE")
	then
		fppdo.setPostPricingResult( "EVALUATION_PENDING_VERFICATION_01" );
end

rule "EVALUATION_PENDING_VERFICATION_04"
	when
    		fppdo : FactoringPostPricingDataObject(disbursementAmount > disbursementMaxAmount, isRisk == "TRUE")
	then
		fppdo.setPostPricingResult( "EVALUATION_PENDING_VERFICATION_04" );
end