<svg width="25" height="29" viewBox="0 0 25 29" fill="none" xmlns="http://www.w3.org/2000/svg">
<path fill-rule="evenodd" clip-rule="evenodd" d="M16.3502 4.682C17.0601 3.6655 17.4477 2.46143 17.4634 1.22447C17.4705 1.179 17.4631 1.10244 17.4547 1.01545C17.4477 0.943485 17.44 0.864386 17.4393 0.789874C17.4264 0.673238 17.3911 0.542224 17.2382 0.601341C16.8584 0.632306 16.4843 0.71179 16.125 0.837814C14.3377 1.46573 12.9879 2.60013 12.1707 4.34168C11.7463 5.18142 11.5658 6.12196 11.6494 7.05786C11.6623 7.24479 11.7379 7.27994 11.8988 7.27994C12.3252 7.29521 12.7508 7.23126 13.1536 7.0914C14.4683 6.68091 15.5984 5.82913 16.3502 4.682ZM9.86367 7.67941C9.00555 7.33243 8.09053 7.14504 7.1642 7.12659C6.69522 7.10177 6.2253 7.15249 5.77263 7.27677C3.35791 7.99416 1.67677 9.52161 0.682566 11.816C0.0664163 13.2252 -0.052631 14.7782 0.0181538 16.3312C0.102808 17.7419 0.382122 19.1343 0.848266 20.4694C1.48162 22.35 2.41712 24.1165 3.61853 25.7004C4.10596 26.4171 4.69616 27.0593 5.37045 27.6066C6.50622 28.4757 7.72565 28.7697 9.11078 28.276C9.48778 28.1514 9.85778 28.0069 10.2192 27.843C11.5949 27.2537 13.1406 27.1866 14.5628 27.6545C14.7972 27.7343 15.022 27.8344 15.247 27.9347C15.4544 28.027 15.6619 28.1195 15.8772 28.1961C16.3672 28.4353 16.9093 28.5498 17.4549 28.5295C18.0005 28.5091 18.5324 28.3545 19.003 28.0795C19.6383 27.719 20.2069 27.2532 20.6841 26.7022C22.0959 25.0969 23.2427 23.2796 24.0818 21.3178C24.1767 21.1149 24.1638 21.067 23.9515 20.9983C23.1904 20.6801 22.5048 20.2071 21.9389 19.6098C20.6133 18.2469 20.0502 16.5885 20.2111 14.6951C20.3881 12.6884 21.3935 11.1369 23.1423 10.0776C23.3305 9.97217 23.3305 9.93223 23.1889 9.77246C22.8368 9.31304 22.4132 8.9123 21.9341 8.58533C20.269 7.27997 18.3948 6.80065 16.3035 7.27997C15.6192 7.4663 14.9471 7.69414 14.2909 7.96221C13.3915 8.33173 12.3985 8.41383 11.4499 8.19708C11.192 8.11903 10.9443 8.03452 10.6971 7.95019C10.423 7.85669 10.1496 7.76341 9.86367 7.67941Z" fill="#0798D4"/>
</svg>
