<svg width="23" height="36" viewBox="0 0 23 36" fill="none" xmlns="http://www.w3.org/2000/svg">
<path d="M1.96696 15.1266C0.34396 16.6984 0.34396 19.3016 1.96696 20.8734L15.4673 33.9479C18.005 36.4056 22.25 34.6073 22.25 31.0745L22.25 4.92553C22.25 1.39273 18.005 -0.405574 15.4673 2.05215L1.96696 15.1266Z" fill="#0B98D4"/>
</svg>
