<svg width="54" height="38" viewBox="0 0 54 38" fill="none" xmlns="http://www.w3.org/2000/svg">
<path fill-rule="evenodd" clip-rule="evenodd" d="M40.8173 14.0624H48.9879C50.1388 14.0654 51.2418 14.5215 52.0559 15.3309C52.8699 16.1404 53.3287 17.2374 53.3322 18.3824V33.2363C53.3287 34.3814 52.8699 35.4786 52.056 36.2883C51.242 37.098 50.139 37.5544 48.9879 37.5579H4.34431C3.19318 37.5544 2.09019 37.098 1.27622 36.2883C0.462244 35.4786 0.0034375 34.3814 0 33.2363V18.3824C0.00343954 17.2374 0.462298 16.1404 1.27632 15.3309C2.09033 14.5215 3.19333 14.0654 4.34431 14.0624H12.7332L21.2312 5.58141V5.41937C21.2263 3.98702 21.7935 2.61136 22.8081 1.59504C23.8228 0.578716 25.2017 0.00497432 26.6417 3.21927e-05C28.0816 -0.00490993 29.4645 0.559352 30.4861 1.56869C31.5078 2.57802 32.0846 3.94975 32.0895 5.3821L40.8173 14.0624ZM27.7578 3.80262C27.4363 3.58896 27.0584 3.47492 26.6718 3.47492H26.6653C26.148 3.47664 25.6525 3.68226 25.2873 4.04673C24.9221 4.4112 24.7171 4.90479 24.7171 5.41937C24.7171 5.80395 24.8317 6.17989 25.0465 6.49965C25.2613 6.81941 25.5666 7.06864 25.9238 7.21581C26.2809 7.36298 26.674 7.40149 27.0531 7.32646C27.4323 7.25143 27.7806 7.06624 28.054 6.7943C28.3273 6.52237 28.5135 6.1759 28.5889 5.79872C28.6643 5.42153 28.6256 5.03057 28.4777 4.67526C28.3297 4.31996 28.0792 4.01628 27.7578 3.80262ZM22.2591 8.55317L16.7354 14.0624H36.8395L31.1855 8.43489C30.6958 9.15952 30.0367 9.75521 29.2648 10.1709C28.4929 10.5865 27.6311 10.8097 26.7535 10.8213C25.8758 10.833 25.0084 10.6327 24.2256 10.2376C23.4428 9.84258 22.768 9.26458 22.2591 8.55317ZM10.2285 21.4176V30.1622H12.3636V27.1468H13.6816L15.4212 30.1622H18.1362L15.8907 26.7401C16.2258 26.6472 16.513 26.4987 16.7523 26.2947C17.0599 26.0237 17.2927 25.7047 17.4509 25.3376C17.609 24.9618 17.6881 24.5816 17.6881 24.197C17.6881 23.2618 17.4069 22.5669 16.8446 22.1124C16.2823 21.6492 15.5047 21.4176 14.5118 21.4176H10.2285ZM14.156 25.5867H12.3636V23.0564H14.2482C14.6085 23.0564 14.8852 23.1613 15.0785 23.371C15.2806 23.5808 15.3817 23.8867 15.3817 24.2888C15.3817 24.752 15.2718 25.0841 15.0522 25.2852C14.8325 25.4862 14.5338 25.5867 14.156 25.5867ZM19.5726 21.4176V30.1622H25.5956V28.5234H21.7076V26.6093H25.0816V24.9574H21.7076V23.0564H25.5956V21.4176H19.5726ZM27.385 21.4176V30.1622H29.3488V24.8348L33.4476 30.1622H35.0555V21.4176H33.0918V26.627L29.2038 21.4176H27.385ZM36.3027 23.0564H38.7673V30.1622H40.9024V23.0564H43.4065V21.4176H36.3027V23.0564Z" fill="white"/>
</svg>
