<svg width="9" height="12" viewBox="0 0 9 12" fill="none" xmlns="http://www.w3.org/2000/svg">
<path d="M7.50231 4.55885C8.31998 5.34565 8.31998 6.65436 7.50231 7.44115L3.38675 11.4014C2.11615 12.624 2.09485e-06 11.7235 2.07382e-06 9.9602L1.97937e-06 2.03981C1.95835e-06 0.276486 2.11615 -0.623993 3.38675 0.59865L7.50231 4.55885Z" fill="#7E7E7E"/>
</svg>
