<svg width="29" height="32" viewBox="0 0 29 32" fill="none" xmlns="http://www.w3.org/2000/svg">
<path fill-rule="evenodd" clip-rule="evenodd" d="M5.95538 30.1644C5.95538 30.8346 6.49868 31.3779 7.16888 31.3779H20.9218C21.592 31.3779 22.1353 30.8346 22.1353 30.1644C22.1353 29.4942 21.592 28.9509 20.9218 28.9509H7.16888C6.49868 28.9509 5.95538 29.4942 5.95538 30.1644ZM7.16888 27.333C6.49868 27.333 5.95538 26.7897 5.95538 26.1195C5.95538 25.4493 6.49868 24.906 7.16888 24.906H20.9218C21.592 24.906 22.1353 25.4493 22.1353 26.1195C22.1353 26.7897 21.592 27.333 20.9218 27.333H7.16888ZM8.38237 23.2881C7.04198 23.2881 5.95538 22.2015 5.95538 20.8611V15.1279H1.62125C0.162649 15.1279 -0.55125 13.3497 0.502448 12.3411L12.9266 0.448826C13.5523 -0.150042 14.5386 -0.150042 15.1642 0.448828L27.5884 12.3411C28.6421 13.3497 27.9282 15.1279 26.4696 15.1279H22.1353V20.8612C22.1353 22.2015 21.0487 23.2881 19.7083 23.2881H8.38237Z" fill="#0798D4"/>
</svg>
