<svg width="33" height="31" viewBox="0 0 33 31" fill="none" xmlns="http://www.w3.org/2000/svg">
<path d="M25.1445 13.315V3.55853L16.4997 0L7.8548 3.55853V13.315L0 16.55V27.4408L8.64486 31L16.4997 27.7656L24.3545 31L33 27.4408V16.55L25.1445 13.315ZM23.569 13.2572L16.4997 16.1676V8.09788L23.569 5.18755V13.2572ZM16.5992 1.82978L22.0026 4.02303L16.4997 6.21889L11.0956 4.02565L16.5992 1.82978ZM3.23814 17.0185L8.74174 14.82L10.2027 15.4104L14.1177 17.0218L8.64225 19.2065L3.23814 17.0185ZM15.7116 26.2481L8.64225 29.1591V21.0894L15.7116 18.1791V26.2481ZM18.953 17.0185L24.4566 14.82L29.86 17.0132L24.3564 19.2091L18.953 17.0185ZM31.4264 26.2481L24.3571 29.1591V21.0894L31.4264 18.1791V26.2481Z" fill="#0798D4"/>
</svg>
