<svg width="56" height="56" viewBox="0 0 56 56" fill="none" xmlns="http://www.w3.org/2000/svg">
<path fill-rule="evenodd" clip-rule="evenodd" d="M28 56C43.464 56 56 43.464 56 28C56 12.536 43.464 0 28 0C12.536 0 0 12.536 0 28C0 43.464 12.536 56 28 56ZM33.526 37.6902L23.859 28.0233L33.5264 18.3559C34.4686 17.4137 34.4686 15.8861 33.5264 14.9439C32.5843 14.0017 31.0567 14.0017 30.1145 14.9439L18.7697 26.2887C18.76 26.2981 18.7504 26.3075 18.7409 26.3171C17.7987 27.2593 17.7987 28.7868 18.7409 29.729L30.114 41.1022C31.0562 42.0444 32.5838 42.0444 33.526 41.1022C34.4682 40.16 34.4682 38.6324 33.526 37.6902Z" fill="#0798D4"/>
</svg>
