<svg width="30" height="30" viewBox="0 0 30 30" fill="none" xmlns="http://www.w3.org/2000/svg">
<circle cx="15" cy="15" r="15" fill="#0798D4"/>
<path fill-rule="evenodd" clip-rule="evenodd" d="M16.9458 8.91694C16.9458 7.85824 16.0875 7 15.0288 7C13.9701 7 13.1119 7.85824 13.1119 8.91694L13.1119 16.5841L11.2724 14.7447C10.5238 13.9961 9.31007 13.9961 8.56146 14.7447C7.81285 15.4933 7.81285 16.707 8.56146 17.4556L13.5316 22.4258C13.9346 22.8288 14.4725 23.0148 15 22.9839C15.5275 23.0148 16.0654 22.8288 16.4685 22.4258L21.4386 17.4556C22.1872 16.707 22.1872 15.4933 21.4386 14.7447C20.69 13.9961 19.4762 13.9961 18.7276 14.7447L16.9457 16.5265L16.9458 8.91694Z" fill="white"/>
</svg>
