<svg width="166" height="139" viewBox="0 0 166 139" fill="none" xmlns="http://www.w3.org/2000/svg">
<g clip-path="url(#clip0_357_2189)">
<path d="M34.7624 23.4026C31.6803 22.1143 25.3443 27.4784 22.5315 37.3334C20.5402 44.3079 22.0111 49.173 24.8261 49.173C27.6049 49.173 27.8764 42.6136 30.8702 36.0179C33.9975 29.1137 37.8557 24.6909 34.7624 23.4026Z" fill="url(#paint0_linear_357_2189)"/>
<path d="M144.951 37.3334C142.136 27.4784 135.813 22.1143 132.731 23.4026C129.649 24.6909 133.496 29.1137 136.623 36.0088C139.617 42.6136 139.889 49.164 142.667 49.164C145.471 49.173 146.942 44.3079 144.951 37.3334Z" fill="url(#paint1_linear_357_2189)"/>
<path d="M83.7423 0C56.7847 0 28.9128 27.5827 28.9128 57.0434C28.9128 81.0856 48.6542 95.2818 83.7423 95.2818C119.014 95.2818 138.57 80.7658 138.57 57.0434C138.57 27.898 110.779 0 83.7423 0Z" fill="url(#paint2_linear_357_2189)"/>
<path d="M83.7422 28.4877C58.527 28.4877 38.0864 34.7568 38.0864 53.8748C38.0864 58.3499 39.2314 62.741 41.3404 66.8281L68.4746 47.1771L93.9998 65.8891L106.369 45.7844L102.988 45.8774L110.956 39.5153L111.279 49.4951L109.102 47.1272L96.0387 75.9551L68.1487 58.867L49.2673 76.9735C57.477 84.4152 69.6332 89.3642 83.7422 89.3642C109.94 89.3642 129.396 72.3261 129.396 53.8839C129.396 34.7568 108.955 28.4877 83.7422 28.4877Z" fill="url(#paint3_linear_357_2189)"/>
<g opacity="0.65">
<path d="M92.9951 65.1429L93.9998 65.8778L106.369 45.7731L102.988 45.8661L107.301 42.4208L107.134 39.0504L99.304 46.2494L102.547 46.1088L92.9951 65.1429Z" fill="black"/>
<path d="M66.9245 48.2884L65.207 47.1544L44.9316 64.2243L66.9245 48.2884Z" fill="black"/>
<path d="M68.1487 58.867L66.7932 60.1689L95.0882 76.0594L95.2941 75.4992L68.1487 58.867Z" fill="black"/>
</g>
<path fill-rule="evenodd" clip-rule="evenodd" d="M117.251 133.264C116.35 133.261 115.454 133.143 114.583 132.912C113.713 132.686 112.903 132.27 112.211 131.694C111.447 131.036 110.865 130.192 110.521 129.243C110.105 128.192 109.897 126.831 109.899 125.16C109.899 122.804 110.472 120.942 111.618 119.573C112.765 118.205 114.504 117.525 116.837 117.532C117.305 117.542 117.771 117.591 118.231 117.68C118.803 117.784 119.368 117.928 119.921 118.111C120.144 118.18 120.362 118.265 120.573 118.364V111.646H123.657V129.687C123.667 130.275 123.461 130.847 123.078 131.293C122.659 131.775 122.136 132.155 121.55 132.407C120.887 132.704 120.19 132.919 119.475 133.046C118.742 133.186 117.997 133.259 117.251 133.264ZM117.341 130.558C118.115 130.575 118.886 130.465 119.625 130.231C120.255 130.014 120.571 129.726 120.573 129.37V121.077C120.063 120.782 119.513 120.562 118.941 120.424C118.398 120.289 117.84 120.219 117.28 120.215C116.447 120.181 115.62 120.382 114.895 120.796C114.261 121.193 113.776 121.789 113.515 122.49C113.192 123.37 113.039 124.303 113.062 125.239C113.054 126.147 113.177 127.05 113.427 127.922C113.638 128.685 114.091 129.357 114.716 129.839C115.339 130.318 116.214 130.558 117.341 130.558ZM76.1255 133.203C74.7783 133.203 73.7155 132.847 72.9371 132.134C72.1587 131.422 71.7679 130.372 71.7649 128.984V120.483H69.364V117.897H71.7649V113.735H74.9692V117.897H78.5898V120.483H74.9692V128.36C74.9692 129.052 75.0913 129.574 75.338 129.921C75.5847 130.268 76.0463 130.44 76.7184 130.44C77.0584 130.439 77.3968 130.394 77.7253 130.306C78.0261 130.231 78.3153 130.116 78.5852 129.964V132.729C78.2013 132.895 77.7986 133.015 77.3859 133.085C76.97 133.161 76.5483 133.2 76.1255 133.203ZM82.2034 132.817V119.265C82.6611 119.012 83.1369 118.793 83.6267 118.61C84.4256 118.301 85.2482 118.057 86.0865 117.881C87.0313 117.675 87.9956 117.571 88.9626 117.571C89.3716 117.561 89.7803 117.601 90.18 117.689C90.4534 117.755 90.7207 117.844 90.9788 117.956V120.451C90.5262 120.392 90.0525 120.348 89.5577 120.317C89.0633 120.288 88.5676 120.288 88.0733 120.317C87.58 120.346 87.0957 120.391 86.6205 120.451C86.1476 120.51 85.7154 120.569 85.3171 120.628V132.815L82.2034 132.817ZM97.2064 133.037C97.938 133.19 98.6835 133.266 99.4308 133.264C100.603 133.275 101.774 133.18 102.929 132.98C103.826 132.851 104.671 132.481 105.375 131.91C105.979 131.385 106.281 130.637 106.281 129.667V122.533C106.295 121.865 106.184 121.199 105.955 120.571C105.754 120.043 105.446 119.562 105.05 119.161C104.668 118.777 104.221 118.465 103.73 118.24C103.225 118.007 102.693 117.837 102.146 117.734C101.595 117.626 101.034 117.572 100.472 117.571C99.3698 117.567 98.2706 117.681 97.1928 117.911C96.1338 118.139 95.3282 118.442 94.7761 118.818V121.726C95.4255 121.212 96.1711 120.833 96.9688 120.612C97.8045 120.353 98.6736 120.218 99.5485 120.211C100.71 120.214 101.607 120.458 102.239 120.943C102.871 121.429 103.187 122.197 103.187 123.248V124.652C102.95 124.511 102.703 124.387 102.447 124.282C101.922 124.061 101.375 123.897 100.816 123.792C100.144 123.666 99.4622 123.606 98.7791 123.613C97.7842 123.585 96.7942 123.763 95.8713 124.137C95.097 124.463 94.4441 125.023 94.0044 125.741C93.57 126.454 93.3527 127.366 93.3527 128.476C93.3247 129.285 93.503 130.089 93.8709 130.81C94.1984 131.414 94.6792 131.921 95.2648 132.28C95.863 132.644 96.5201 132.9 97.2064 133.037ZM103.187 126.585V129.487C103.21 129.741 103.139 129.994 102.989 130.198C102.838 130.403 102.618 130.546 102.37 130.599C101.818 130.75 100.958 130.826 99.7906 130.826C99.2525 130.828 98.7177 130.743 98.2066 130.574C97.7245 130.419 97.2904 130.143 96.9462 129.771C96.5989 129.373 96.4182 128.856 96.4415 128.328C96.4211 127.981 96.491 127.634 96.6445 127.321C96.798 127.009 97.0298 126.741 97.3173 126.546C97.9011 126.15 98.7565 125.951 99.8834 125.951C100.685 125.945 101.483 126.05 102.255 126.264C102.574 126.346 102.886 126.453 103.187 126.585ZM128.045 112.697V115.52H131.367V112.697H128.045ZM128.133 117.986V132.817H131.276L131.247 117.986H128.133ZM135.754 119.115C136.23 118.881 136.721 118.678 137.223 118.507C137.792 118.312 138.37 118.148 138.956 118.015C139.569 117.876 140.192 117.767 140.826 117.689C141.435 117.611 142.049 117.572 142.663 117.571C144.066 117.571 145.212 117.763 146.103 118.149C146.949 118.498 147.651 119.128 148.089 119.934C148.524 120.734 148.742 121.74 148.743 122.951V132.817H145.63V123.366C145.632 122.991 145.589 122.617 145.503 122.252C145.411 121.882 145.239 121.536 144.998 121.241C144.712 120.908 144.344 120.657 143.93 120.512C143.343 120.316 142.725 120.225 142.106 120.245C141.005 120.253 139.914 120.444 138.875 120.81V132.817H135.754V119.115ZM155.369 132.357C156.368 132.942 157.589 133.244 159.033 133.264C159.618 133.259 160.2 133.179 160.766 133.028C161.338 132.885 161.894 132.686 162.427 132.434C162.594 132.358 162.757 132.274 162.916 132.184V133.194C162.919 133.709 162.819 134.22 162.619 134.695C162.378 135.205 161.963 135.611 161.449 135.84C160.866 136.143 159.991 136.294 158.824 136.294C158.223 136.295 157.622 136.24 157.03 136.131C156.448 136.022 155.921 135.897 155.446 135.759C154.971 135.62 154.577 135.493 154.26 135.373V138.233C154.922 138.445 155.595 138.619 156.276 138.753C157.185 138.932 158.109 139.017 159.035 139.007C160.139 139.03 161.24 138.877 162.296 138.553C163.098 138.308 163.834 137.881 164.445 137.306C164.973 136.794 165.379 136.169 165.631 135.478C165.883 134.767 166.008 134.018 166.002 133.264V121.433C166.034 120.628 165.746 119.842 165.201 119.249C164.618 118.655 163.894 118.221 163.097 117.986C162.155 117.699 161.175 117.559 160.191 117.571C159.207 117.567 158.226 117.682 157.27 117.913C156.345 118.13 155.48 118.552 154.738 119.147C153.947 119.811 153.344 120.672 152.988 121.642C152.563 122.713 152.35 124.089 152.35 125.772C152.352 127.36 152.604 128.708 153.106 129.816C153.573 130.882 154.365 131.772 155.369 132.357ZM161.284 130.51C160.712 130.657 160.124 130.733 159.533 130.737C158.172 130.739 157.165 130.277 156.512 129.351C155.859 128.426 155.532 127.207 155.532 125.695C155.522 124.762 155.642 123.832 155.889 122.933C156.094 122.137 156.56 121.435 157.213 120.939C157.854 120.454 158.778 120.211 159.985 120.211C160.472 120.212 160.956 120.266 161.431 120.372C161.832 120.444 162.206 120.624 162.513 120.891C162.655 121.042 162.764 121.221 162.833 121.416C162.902 121.611 162.929 121.819 162.913 122.025V129.841C162.406 130.144 161.857 130.369 161.284 130.51Z" fill="#0798D4"/>
<path fill-rule="evenodd" clip-rule="evenodd" d="M18.8882 112.697V115.52H22.2101V112.697H18.8882ZM18.9764 117.986V132.817H22.1196L22.0902 117.986H18.9764ZM6.40394 115.756V132.817H9.667V115.756H16.0664V112.994H0V115.756H6.40394ZM39.4963 122.951V132.817H36.3826V123.366C36.3835 122.991 36.3387 122.617 36.2491 122.252C36.1589 121.882 35.9873 121.536 35.7467 121.241C35.4608 120.908 35.0924 120.657 34.6786 120.513C34.0913 120.316 33.4737 120.225 32.8548 120.245C32.3173 120.245 31.7809 120.295 31.2526 120.395C30.7286 120.491 30.2132 120.63 29.7116 120.81V132.817H26.5979V119.115C27.0736 118.881 27.5642 118.678 28.0665 118.507C28.635 118.312 29.2137 118.148 29.7999 118.015C30.4124 117.876 31.0354 117.767 31.669 117.689C32.2784 117.611 32.8921 117.572 33.5065 117.571C34.9109 117.571 36.0477 117.764 36.9166 118.149C37.2491 118.29 37.5583 118.475 37.8366 118.697C37.9007 118.667 37.9651 118.638 38.0299 118.61C38.7922 118.272 39.5868 118.014 40.4014 117.838C41.1951 117.662 42.0054 117.573 42.8182 117.571C44.2212 117.571 45.3579 117.764 46.2283 118.149C47.0608 118.503 47.7464 119.133 48.1699 119.934C48.5953 120.734 48.808 121.74 48.808 122.951V132.817H45.6943V123.366C45.6941 122.991 45.6493 122.617 45.5608 122.252C45.4708 121.881 45.2983 121.535 45.0562 121.241C44.7713 120.908 44.4036 120.657 43.9904 120.513C43.403 120.316 42.7855 120.225 42.1665 120.245C41.6238 120.246 41.0841 120.326 40.5644 120.483C40.1144 120.619 39.6841 120.812 39.2839 121.057C39.4255 121.62 39.4963 122.251 39.4963 122.951ZM55.7911 132.373C56.9648 132.99 58.2765 133.297 59.6018 133.264C60.587 133.276 61.5708 133.184 62.5367 132.989C63.3388 132.822 64.1231 132.578 64.8788 132.261V129.379C64.4637 129.584 64.0384 129.768 63.6048 129.93C63.0791 130.124 62.5388 130.275 61.9891 130.383C61.3682 130.505 60.7368 130.564 60.1041 130.56C58.6016 130.562 57.4649 130.131 56.694 129.267C56.0181 128.51 55.6385 127.446 55.5552 126.074H65.9967C66.0447 124.556 65.8287 123.042 65.3585 121.599C64.9725 120.402 64.2204 119.357 63.2088 118.612C62.2192 117.9 60.9248 117.544 59.3257 117.544C57.1413 117.544 55.4456 118.212 54.2388 119.549C53.0319 120.885 52.4285 122.851 52.4285 125.446C52.427 127.13 52.7181 128.557 53.3019 129.726C53.8376 130.845 54.7075 131.77 55.7911 132.373ZM55.6305 123.754C55.7018 123.171 55.8141 122.672 55.9676 122.254C56.2557 121.471 56.6759 120.916 57.228 120.59C57.8439 120.248 58.5405 120.078 59.2443 120.1C60.4707 120.101 61.3706 120.453 61.9439 121.154C62.4195 121.737 62.7181 122.603 62.8396 123.754H55.6305Z" fill="#A0A2A1"/>
</g>
<defs>
<linearGradient id="paint0_linear_357_2189" x1="28.7567" y1="23.2143" x2="28.7567" y2="49.173" gradientUnits="userSpaceOnUse">
<stop stop-color="#14C9FE"/>
<stop offset="1" stop-color="#065FC2"/>
</linearGradient>
<linearGradient id="paint1_linear_357_2189" x1="138.725" y1="23.2143" x2="138.725" y2="49.173" gradientUnits="userSpaceOnUse">
<stop stop-color="#14C9FE"/>
<stop offset="1" stop-color="#065FC2"/>
</linearGradient>
<linearGradient id="paint2_linear_357_2189" x1="83.7423" y1="0" x2="83.7423" y2="95.2818" gradientUnits="userSpaceOnUse">
<stop stop-color="#14C9FE"/>
<stop offset="1" stop-color="#065FC2"/>
</linearGradient>
<linearGradient id="paint3_linear_357_2189" x1="83.7422" y1="28.4877" x2="83.7422" y2="89.3552" gradientUnits="userSpaceOnUse">
<stop stop-color="#333333"/>
<stop offset="1" stop-color="#070707"/>
</linearGradient>
<clipPath id="clip0_357_2189">
<rect width="166" height="139" fill="white"/>
</clipPath>
</defs>
</svg>
