<svg width="23" height="36" viewBox="0 0 23 36" fill="none" xmlns="http://www.w3.org/2000/svg">
<path d="M21.033 15.1266C22.656 16.6984 22.656 19.3016 21.033 20.8734L7.53275 33.9479C4.99498 36.4056 0.750001 34.6073 0.75 31.0745L0.75 4.92553C0.75 1.39273 4.99498 -0.405574 7.53275 2.05215L21.033 15.1266Z" fill="#0B98D4"/>
</svg>
