<svg width="28" height="25" viewBox="0 0 28 25" fill="none" xmlns="http://www.w3.org/2000/svg">
<path fill-rule="evenodd" clip-rule="evenodd" d="M15.9318 1.8142C10.8928 -1.99086 5.61282 1.37105 5.61282 1.37105L3.01412 10.5842C8.66872 7.37408 13.453 10.8167 13.453 10.8167L15.9318 1.8142ZM28.0002 3.33376C21.8788 6.4235 17.5214 2.89062 17.5214 2.89062L14.9365 11.7481C19.2842 15.9457 25.396 12.3322 25.396 12.3322L28.0002 3.33376ZM2.55325 12.261C2.55325 12.261 8.4819 8.8895 13.072 12.8245L10.2653 21.9733C10.2653 21.9733 6.547 18.3611 0 21.2895L2.55325 12.261ZM24.4912 14.7147C18.177 16.7404 14.4173 13.6205 14.4173 13.6205L11.944 22.4739C15.2478 26.5909 21.9366 23.4806 21.9366 23.4806L24.4912 14.7147Z" fill="#0798D4"/>
</svg>
