[
    {
        "name": "Dákiti",
        "url": "https://www.youtube.com/watch?v=TmKh7lAwnBI",
        "chain": "00000",
        "id": "TmKh7lAwnBI"
    },
    {
        "name": "A tu merced",
        "url": "https://www.youtube.com/watch?v=ublf6qfpuuo",
        "chain": "10000",
        "id": "ublf6qfpuuo"
    },
    {
        "name": "Si veo a tu mamá",
        "url": "https://www.youtube.com/watch?v=U03nHWOSr94",
        "chain": "01000",
        "id": "U03nHWOSr94"
    },
    {
        "name": "Si estuviésemos juntos",
        "url": "https://www.youtube.com/watch?v=EB7G3fUUaeA",
        "chain": "01110",
        "id": "EB7G3fUUaeA"
    },
    {
        "name": "La santa",
        "url": "https://www.youtube.com/watch?v=JUxITamPWrY",
        "chain": "00100",
        "id": "JUxITamPWrY"
    },
    {
        "name": "No me conoce",
        "url": "https://www.youtube.com/watch?v=w2C6RhQBYlg",
        "chain": "10100",
        "id": "w2C6RhQBYlg"
    },
    {
        "name": "Amorfoda",
        "url": "https://www.youtube.com/watch?v=kLpH1nSLJSs",
        "chain": "01100",
        "id": "kLpH1nSLJSs"
    },
    {
        "name": "Estamos bien",
        "url": "https://www.youtube.com/watch?v=bcHTl9h7TWI",
        "chain": "11100",
        "id": "bcHTl9h7TWI"
    },
    {
        "name": "Safaera",
        "url": "https://www.youtube.com/watch?v=jCQ_6XbATPc",
        "chain": "00010",
        "id": "jCQ_6XbATPc"
    },
    {
        "name": "Te boté",
        "url": "https://www.youtube.com/watch?v=9jI-z9QN6g8",
        "chain": "10010",
        "id": "9jI-z9QN6g8"
    }
    ,{
        "name": "Mia",
        "url": "https://www.youtube.com/watch?v=OSUxrSe5GbI",
        "chain": "01010",
        "id": "OSUxrSe5GbI"
    }
    ,{
        "name": "Cual es tu plan",
        "url": "https://www.youtube.com/watch?v=iMOYZJq6XQo",
        "chain": "11010",
        "id": "iMOYZJq6XQo"
    }
    ,{
        "name": "Me acostumbre",
        "url": "https://www.youtube.com/watch?v=xKKeqlBQ3Js",
        "chain": "00110",
        "id": "xKKeqlBQ3Js"
    }
    ,{
        "name": "Hoy cobré",
        "url": "https://www.youtube.com/watch?v=XJcXjUB0yqY",
        "chain": "10110",
        "id": "XJcXjUB0yqY" 
    }
    ,{
        "name": "Ser bichote",
        "url": "https://www.youtube.com/watch?v=4o5qgKxWjb0",
        "chain": "00001",
        "id": "4o5qgKxWjb0"
    },
    {
        "name": "Maldita pobreza",
        "url": "https://www.youtube.com/watch?v=ctutQRq76bU",
        "chain": "10001",
        "id": "ctutQRq76bU"
    },
    {
        "name": "Así soy yo",
        "url": "https://www.youtube.com/watch?v=FmA8gUGAvUQ",
        "chain": "01001",
        "id": "FmA8gUGAvUQ"
    },
    {
        "name": "Soy el diablo",
        "url": "https://www.youtube.com/watch?v=-njVpIGri3M",
        "chain": "11001",
        "id": "-njVpIGri3M"
    },
    {
        "name": "Un peso",
        "url": "https://www.youtube.com/watch?v=7o2_OnTFmmA",
        "chain": "00101",
        "id": "7o2_OnTFmmA"
    }
    ,{
        "name": "Soy peor",
        "url": "https://www.youtube.com/watch?v=ws00k_lIQ9U",
        "chain": "10101",
        "id": "ws00k_lIQ9U"
    }
]