<?xml version="1.0" encoding="iso-8859-1"?>
<!-- Generator: Adobe Illustrator 21.0.2, SVG Export Plug-In . SVG Version: 6.00 Build 0)  -->
<svg xmlns="http://www.w3.org/2000/svg" xmlns:xlink="http://www.w3.org/1999/xlink" version="1.1" id="Layer_1" x="0px" y="0px" viewBox="0 0 40 40" style="enable-background:new 0 0 40 40;" xml:space="preserve">
<g>
	<rect x="2.5" y="3.5" style="fill:#FFFFFF;" width="35" height="33"/>
	<g>
		<path style="fill:#4788C7;" d="M37,4v32H3V4H37 M38,3H2v34h36V3L38,3z"/>
	</g>
</g>
<g>
	<rect x="3" y="4" style="fill:#98CCFD;" width="34" height="8"/>
</g>
<rect x="6" y="7" style="fill:#FFFFFF;" width="2" height="2"/>
<rect x="10" y="7" style="fill:#FFFFFF;" width="2" height="2"/>
<rect x="14" y="7" style="fill:#FFFFFF;" width="2" height="2"/>
<g>
	<rect x="6" y="16" style="fill:#98CCFD;" width="13" height="17"/>
</g>
<path style="fill:#4788C7;" d="M33.5,17h-11c-0.275,0-0.5-0.225-0.5-0.5l0,0c0-0.275,0.225-0.5,0.5-0.5h11  c0.275,0,0.5,0.225,0.5,0.5l0,0C34,16.775,33.775,17,33.5,17z"/>
<path style="fill:#4788C7;" d="M33.5,21h-11c-0.275,0-0.5-0.225-0.5-0.5l0,0c0-0.275,0.225-0.5,0.5-0.5h11  c0.275,0,0.5,0.225,0.5,0.5l0,0C34,20.775,33.775,21,33.5,21z"/>
<path style="fill:#4788C7;" d="M33.5,25h-11c-0.275,0-0.5-0.225-0.5-0.5l0,0c0-0.275,0.225-0.5,0.5-0.5h11  c0.275,0,0.5,0.225,0.5,0.5l0,0C34,24.775,33.775,25,33.5,25z"/>
<path style="fill:#4788C7;" d="M33.5,29h-11c-0.275,0-0.5-0.225-0.5-0.5l0,0c0-0.275,0.225-0.5,0.5-0.5h11  c0.275,0,0.5,0.225,0.5,0.5l0,0C34,28.775,33.775,29,33.5,29z"/>
<path style="fill:#4788C7;" d="M33.5,33h-11c-0.275,0-0.5-0.225-0.5-0.5l0,0c0-0.275,0.225-0.5,0.5-0.5h11  c0.275,0,0.5,0.225,0.5,0.5l0,0C34,32.775,33.775,33,33.5,33z"/>
</svg>
