[
    {
        "username": "ivannofick",
        "firstName": "ivannofick",
        "lastName": "adha nugraha",
        "email": "ivannofick@gmail.com",
        "birthDate": "1997-04-18T12:30:00",
        "basicSalary": "39333.14",
        "status": "active",
        "group": "Departement Keuangan",
        "description": "2024-03-07T12:30:00"
    },
    {
        "username": "ivannofick",
        "firstName": "ivannofick",
        "lastName": "adha nugraha",
        "email": "ivannofick@gmail.com",
        "birthDate": "1997-04-18T12:30:00",
        "basicSalary": "3.14",
        "status": "active",
        "group": "Departement Keuangan",
        "description": "2024-03-07T12:30:00"
    },
    {
        "username": "ivannofick",
        "firstName": "ivannofick",
        "lastName": "adha nugraha",
        "email": "ivannofick@gmail.com",
        "birthDate": "1997-04-18T12:30:00",
        "basicSalary": "3.14",
        "status": "active",
        "group": "Departement Keuangan",
        "description": "2024-03-07T12:30:00"
    },
    {
        "username": "jansen",
        "firstName": "jansen",
        "lastName": "Smith",
        "email": "jansen@gmail.com",
        "birthDate": "1990-04-10T12:30:00",
        "basicSalary": "3.14",
        "status": "active",
        "group": "Departement Keuangan",
        "description": "2024-03-07T12:30:00"
    },
    {
        "username": "ivannofick",
        "firstName": "ivannofick",
        "lastName": "adha nugraha",
        "email": "ivannofick@gmail.com",
        "birthDate": "1997-04-18T12:30:00",
        "basicSalary": "3.14",
        "status": "active",
        "group": "Departement Keuangan",
        "description": "2024-03-07T12:30:00"
    },
    {
        "username": "ivannofick",
        "firstName": "ivannofick",
        "lastName": "adha nugraha",
        "email": "ivannofick@gmail.com",
        "birthDate": "1997-04-18T12:30:00",
        "basicSalary": "3.14",
        "status": "active",
        "group": "Departement Keuangan",
        "description": "2024-03-07T12:30:00"
    },
    {
        "username": "ivannofick",
        "firstName": "ivannofick",
        "lastName": "adha nugraha",
        "email": "ivannofick@gmail.com",
        "birthDate": "1997-04-18T12:30:00",
        "basicSalary": "3.14",
        "status": "active",
        "group": "Departement Keuangan",
        "description": "2024-03-07T12:30:00"
    },
    {
        "username": "ivannofick",
        "firstName": "ivannofick",
        "lastName": "adha nugraha",
        "email": "ivannofick@gmail.com",
        "birthDate": "1997-04-18T12:30:00",
        "basicSalary": "3.14",
        "status": "active",
        "group": "Departement Keuangan",
        "description": "2024-03-07T12:30:00"
    },
    {
        "username": "ivannofick",
        "firstName": "ivannofick",
        "lastName": "adha nugraha",
        "email": "ivannofick@gmail.com",
        "birthDate": "1997-04-18T12:30:00",
        "basicSalary": "3.14",
        "status": "active",
        "group": "Departement Keuangan",
        "description": "2024-03-07T12:30:00"
    },
    {
        "username": "ivannofick",
        "firstName": "ivannofick",
        "lastName": "adha nugraha",
        "email": "ivannofick@gmail.com",
        "birthDate": "1997-04-18T12:30:00",
        "basicSalary": "3.14",
        "status": "active",
        "group": "Departement Keuangan",
        "description": "2024-03-07T12:30:00"
    },
    {
        "username": "ivannofick",
        "firstName": "ivannofick",
        "lastName": "adha nugraha",
        "email": "ivannofick@gmail.com",
        "birthDate": "1997-04-18T12:30:00",
        "basicSalary": "3.14",
        "status": "active",
        "group": "Departement Keuangan",
        "description": "2024-03-07T12:30:00"
    },
    {
        "username": "ivannofick",
        "firstName": "ivannofick",
        "lastName": "adha nugraha",
        "email": "ivannofick@gmail.com",
        "birthDate": "1997-04-18T12:30:00",
        "basicSalary": "3.14",
        "status": "active",
        "group": "Departement Keuangan",
        "description": "2024-03-07T12:30:00"
    },
    {
        "username": "ivannofick",
        "firstName": "ivannofick",
        "lastName": "adha nugraha",
        "email": "ivannofick@gmail.com",
        "birthDate": "1997-04-18T12:30:00",
        "basicSalary": "3.14",
        "status": "active",
        "group": "Departement Keuangan",
        "description": "2024-03-07T12:30:00"
    },
    {
        "username": "ivannofick",
        "firstName": "ivannofick",
        "lastName": "adha nugraha",
        "email": "ivannofick@gmail.com",
        "birthDate": "1997-04-18T12:30:00",
        "basicSalary": "3.14",
        "status": "active",
        "group": "Departement Keuangan",
        "description": "2024-03-07T12:30:00"
    },
    {
        "username": "ivannofick",
        "firstName": "ivannofick",
        "lastName": "adha nugraha",
        "email": "ivannofick@gmail.com",
        "birthDate": "1997-04-18T12:30:00",
        "basicSalary": "3.14",
        "status": "active",
        "group": "Departement Keuangan",
        "description": "2024-03-07T12:30:00"
    },
    {
        "username": "ivannofick",
        "firstName": "ivannofick",
        "lastName": "adha nugraha",
        "email": "ivannofick@gmail.com",
        "birthDate": "1997-04-18T12:30:00",
        "basicSalary": "3.14",
        "status": "active",
        "group": "Departement Keuangan",
        "description": "2024-03-07T12:30:00"
    },
    {
        "username": "ivannofick",
        "firstName": "ivannofick",
        "lastName": "adha nugraha",
        "email": "ivannofick@gmail.com",
        "birthDate": "1997-04-18T12:30:00",
        "basicSalary": "3.14",
        "status": "active",
        "group": "Departement Keuangan",
        "description": "2024-03-07T12:30:00"
    },
    {
        "username": "ivannofick",
        "firstName": "ivannofick",
        "lastName": "adha nugraha",
        "email": "ivannofick@gmail.com",
        "birthDate": "1997-04-18T12:30:00",
        "basicSalary": "3.14",
        "status": "active",
        "group": "Departement Keuangan",
        "description": "2024-03-07T12:30:00"
    },
    {
        "username": "ivannofick",
        "firstName": "ivannofick",
        "lastName": "adha nugraha",
        "email": "ivannofick@gmail.com",
        "birthDate": "1997-04-18T12:30:00",
        "basicSalary": "3.14",
        "status": "active",
        "group": "Departement Keuangan",
        "description": "2024-03-07T12:30:00"
    },
    {
        "username": "ivannofick",
        "firstName": "ivannofick",
        "lastName": "adha nugraha",
        "email": "ivannofick@gmail.com",
        "birthDate": "1997-04-18T12:30:00",
        "basicSalary": "3.14",
        "status": "active",
        "group": "Departement Keuangan",
        "description": "2024-03-07T12:30:00"
    },
    {
        "username": "ivannofick",
        "firstName": "ivannofick",
        "lastName": "adha nugraha",
        "email": "ivannofick@gmail.com",
        "birthDate": "1997-04-18T12:30:00",
        "basicSalary": "3.14",
        "status": "active",
        "group": "Departement Keuangan",
        "description": "2024-03-07T12:30:00"
    },
    {
        "username": "ivannofick",
        "firstName": "ivannofick",
        "lastName": "adha nugraha",
        "email": "ivannofick@gmail.com",
        "birthDate": "1997-04-18T12:30:00",
        "basicSalary": "3.14",
        "status": "active",
        "group": "Departement Keuangan",
        "description": "2024-03-07T12:30:00"
    },
    {
        "username": "ivannofick",
        "firstName": "ivannofick",
        "lastName": "adha nugraha",
        "email": "ivannofick@gmail.com",
        "birthDate": "1997-04-18T12:30:00",
        "basicSalary": "3.14",
        "status": "active",
        "group": "Departement Keuangan",
        "description": "2024-03-07T12:30:00"
    },
    {
        "username": "ivannofick",
        "firstName": "ivannofick",
        "lastName": "adha nugraha",
        "email": "ivannofick@gmail.com",
        "birthDate": "1997-04-18T12:30:00",
        "basicSalary": "3.14",
        "status": "active",
        "group": "Departement Keuangan",
        "description": "2024-03-07T12:30:00"
    },
    {
        "username": "ivannofick",
        "firstName": "ivannofick",
        "lastName": "adha nugraha",
        "email": "ivannofick@gmail.com",
        "birthDate": "1997-04-18T12:30:00",
        "basicSalary": "3.14",
        "status": "active",
        "group": "Departement Keuangan",
        "description": "2024-03-07T12:30:00"
    },
    {
        "username": "ivannofick",
        "firstName": "ivannofick",
        "lastName": "adha nugraha",
        "email": "ivannofick@gmail.com",
        "birthDate": "1997-04-18T12:30:00",
        "basicSalary": "3.14",
        "status": "active",
        "group": "Departement Keuangan",
        "description": "2024-03-07T12:30:00"
    },
    {
        "username": "ivannofick",
        "firstName": "ivannofick",
        "lastName": "adha nugraha",
        "email": "ivannofick@gmail.com",
        "birthDate": "1997-04-18T12:30:00",
        "basicSalary": "3.14",
        "status": "active",
        "group": "Departement Keuangan",
        "description": "2024-03-07T12:30:00"
    },
    {
        "username": "ivannofick",
        "firstName": "ivannofick",
        "lastName": "adha nugraha",
        "email": "ivannofick@gmail.com",
        "birthDate": "1997-04-18T12:30:00",
        "basicSalary": "3.14",
        "status": "active",
        "group": "Departement Keuangan",
        "description": "2024-03-07T12:30:00"
    },
    {
        "username": "ivannofick",
        "firstName": "ivannofick",
        "lastName": "adha nugraha",
        "email": "ivannofick@gmail.com",
        "birthDate": "1997-04-18T12:30:00",
        "basicSalary": "3.14",
        "status": "active",
        "group": "Departement Keuangan",
        "description": "2024-03-07T12:30:00"
    },
    {
        "username": "ivannofick",
        "firstName": "ivannofick",
        "lastName": "adha nugraha",
        "email": "ivannofick@gmail.com",
        "birthDate": "1997-04-18T12:30:00",
        "basicSalary": "3.14",
        "status": "active",
        "group": "Departement Keuangan",
        "description": "2024-03-07T12:30:00"
    },
    {
        "username": "ivannofick",
        "firstName": "ivannofick",
        "lastName": "adha nugraha",
        "email": "ivannofick@gmail.com",
        "birthDate": "1997-04-18T12:30:00",
        "basicSalary": "3.14",
        "status": "active",
        "group": "Departement Keuangan",
        "description": "2024-03-07T12:30:00"
    },
    {
        "username": "ivannofick",
        "firstName": "ivannofick",
        "lastName": "adha nugraha",
        "email": "ivannofick@gmail.com",
        "birthDate": "1997-04-18T12:30:00",
        "basicSalary": "3.14",
        "status": "active",
        "group": "Departement Keuangan",
        "description": "2024-03-07T12:30:00"
    },
    {
        "username": "ivannofick",
        "firstName": "ivannofick",
        "lastName": "adha nugraha",
        "email": "ivannofick@gmail.com",
        "birthDate": "1997-04-18T12:30:00",
        "basicSalary": "3.14",
        "status": "active",
        "group": "Departement Keuangan",
        "description": "2024-03-07T12:30:00"
    },
    {
        "username": "ivannofick",
        "firstName": "ivannofick",
        "lastName": "adha nugraha",
        "email": "ivannofick@gmail.com",
        "birthDate": "1997-04-18T12:30:00",
        "basicSalary": "3.14",
        "status": "active",
        "group": "Departement Keuangan",
        "description": "2024-03-07T12:30:00"
    }
]