{
  "project_info": {
    "project_number": "254423318499",
    "project_id": "nettrade-60cbb",
    "storage_bucket": "nettrade-60cbb.appspot.com"
  },
  "client": [
    {
      "client_info": {
        "mobilesdk_app_id": "1:254423318499:android:6d138fed6427d449cdaad6",
        "android_client_info": {
          "package_name": "com.admin.nextrade"
        }
      },
      "oauth_client": [],
      "api_key": [
        {
          "current_key": "AIzaSyA_z40kqY6GXnFGJz5ck4NhHpxtm6a9_9c"
        }
      ],
      "services": {
        "appinvite_service": {
          "other_platform_oauth_client": []
        }
      }
    },
    {
      "client_info": {
        "mobilesdk_app_id": "1:254423318499:android:06e773e7e54b9dc1cdaad6",
        "android_client_info": {
          "package_name": "com.delivery.nextrade"
        }
      },
      "oauth_client": [],
      "api_key": [
        {
          "current_key": "AIzaSyA_z40kqY6GXnFGJz5ck4NhHpxtm6a9_9c"
        }
      ],
      "services": {
        "appinvite_service": {
          "other_platform_oauth_client": []
        }
      }
    },
    {
      "client_info": {
        "mobilesdk_app_id": "1:254423318499:android:e2e5f9c6fd39c9c3cdaad6",
        "android_client_info": {
          "package_name": "com.example.nextrade"
        }
      },
      "oauth_client": [],
      "api_key": [
        {
          "current_key": "AIzaSyA_z40kqY6GXnFGJz5ck4NhHpxtm6a9_9c"
        }
      ],
      "services": {
        "appinvite_service": {
          "other_platform_oauth_client": []
        }
      }
    }
  ],
  "configuration_version": "1"
}