<svg width="24" height="24" viewBox="0 0 24 24" fill="none" xmlns="http://www.w3.org/2000/svg">
<g clip-path="url(#clip0_102_338)">
<path d="M6.5 10H4.5V17H6.5V10ZM12.5 10H10.5V17H12.5V10ZM21 19H2V21H21V19ZM18.5 10H16.5V17H18.5V10ZM11.5 3.26L16.71 6H6.29L11.5 3.26ZM11.5 1L2 6V8H21V6L11.5 1Z" fill="#4541FF"/>
</g>
<defs>
<clipPath id="clip0_102_338">
<rect width="24" height="24" fill="white"/>
</clipPath>
</defs>
</svg>
