{
  "$schema": "https://docs.renovatebot.com/renovate-schema.json",
  "description": "Comment-based regex manager for variable updates in docker files",
  "extends":[
    "regexManagers:dockerfileVersions"
  ],
  "packageRules": [
    {
      "description": "Modify commit message for ABP CLI related docker file changes",
      "addLabels": [
        "Volo",
        "💬regex",
        "👌automerge",
      ],
      "matchDatasources": [
        "github-tags"
      ],
      "matchPackagePatterns": [
        "abpframework/abp"
      ],
      "matchUpdateTypes": [
        "minor",
        "patch"
      ],
      "commitMessageSuffix": "[skip ci]",
      "schedule": [
        "before 4am"
      ],
      "automergeSchedule": [
        "after 8am and before 6pm"
      ],
      "semanticCommitType": "chore",
      "automerge": true,
      "enabled": true
    }
  ],
  "customManagers": [
    {
      "customType": "regex",
      "fileMatch": [ 
        "(^|/|\\.)Dockerfile[^/]*$"
      ],
      "matchStrings": [
        "#\\s*renovate:\\s*datasource=(?<datasource>.*?) depName=(?<depName>.*?)( versioning=(?<versioning>.*?))?\\sENV .*?_VERSION=(?<currentValue>.*)\\s"
      ],
      "datasourceTemplate": "docker",
      "versioningTemplate": "{{#if versioning}}{{{versioning}}}{{else}}semver{{/if}}"
    },
    {
      "customType": "regex",
      "fileMatch": [
        "(^|/|\\.)Dockerfile[^/]*$"
      ],
      "matchStrings": [
        "#\\s*renovate:\\s*(?<depName>.*?):(?<currentValue>.*?)\\n"
      ],
      "datasourceTemplate": "docker"
    },
    {
      "customType": "regex",
      "fileMatch": [
        "(^|/|\\.)Dockerfile[^/]*$"
      ],
      "matchStrings": [
        "ARG IMAGE=(?<depName>.*?):(?<currentValue>.*?)@(?<currentDigest>sha256:[a-f0-9]+)\\s"
      ],
      "datasourceTemplate": "docker"
    }
  ]
}
