{
  "$schema": "https://docs.renovatebot.com/renovate-schema.json",
  "description": "common kubernetes file matching and image versioning",
  "packageRules": [
    {
      "matchDatasources": ["docker"],
      "matchPackageNames": ["line/kubectl-kustomize"],
      "versioning": "regex:^(?<major>\\d+)\\.(?<minor>\\d+)\\.(?<patch>\\d+)-.*$"
    }
  ],
  "kubernetes": {
    "fileMatch": ["^kubernetes/(?:[^/]+/)*.+\\.ya?ml$"]
  }
}
