{
  "$schema": "https://docs.renovatebot.com/renovate-schema.json",
  "description": "NPM dependencies preset for PSSX module/application development",
  "packageRules": [ 
    {
      "description": "Enable scan for 3rd party npm packages",
      "groupName": "public npm",
      "addLabels": [
        "3rd-party",
        "npm",
        "🔎review"
      ],
      "matchDatasources": [
        "npm"
      ],
      "matchPackagePatterns": [
        "*"
      ],
      "matchBaseBranches": [
        "/(^main$|^master$)/",
        "/^(development|develop|dev|(development\\/.*))/"
      ],
      "matchUpdateTypes": [
        "minor",
        "patch"
      ],
      "excludePackagePatterns": [
        "volo*",
        "abp*"
      ],
      "semanticCommitType": "ci",
      "automerge": false,
      "enabled": true
    },
    {
      "description": "Enable scan for all internal npm packages",
      "groupName": "gridlab-pssx npm",
      "addLabels": [
        "PSS®X",
        "npm",
        "🔎review"
      ],
      "matchDatasources": [
        "npm"
      ],
      "matchPackagePrefixes": [
        "^@pssx/*"
      ],
      "registryUrls": [
        "https://gitlab.com/api/v4/groups/559416/-/packages/npm/"
      ],
      "semanticCommitType": "ci",
      "enabled": true
    },
    {
      "description": "Disable scan all package.json based client side packages",
      "groupName": "public package.json",
      "addLabels": [
        "3rd-party",
        "package.json",
        "🔎review"
      ],
      "matchFileNames": [
        "package.json",
        "**/package.json",
      ],
      "matchUpdateTypes": [
        "minor",
        "patch"
      ],
      "enabled": false
    }, 
    {
      "description": "Disable scan for all external volo abp framework npm packages",
      "groupName": "gridlab-pssx volo public npm",
      "addLabels": [
        "Volo",
        "npm"
      ],
      "matchDatasources": [
        "npm"
      ],
      "matchPackagePatterns": [
        "volo*",
        "abp*"
      ],
      "automerge": false,
      "enabled": false
    },
    {
      "description": "Disable scan for all external npm packages on release candidate branch",
      "groupName": "gridlab-pssx npm rc channel",
      "addLabels": [
        "PSS®X",
        "npm",
        "rc"
      ],
      "matchDatasources": [
        "npm"
      ],
      "matchBaseBranches": [
        "/^release\\/rc(0|[1-9]\\d*)\\.(0|[1-9]\\d*)\\.(0|[1-9]\\d*/)/"
      ],
      "excludePackagePatterns": [
        "^@pssx/*"
      ],
      "automerge": false,
      "enabled": false
    }
  ]
}