,dtype,unique num,null %
SK_ID_CURR,int64,305811,0.0
SK_ID_BUREAU,int64,1716428,0.0
CREDIT_ACTIVE,object,4,0.0
CREDIT_CURRENCY,object,4,0.0
DAYS_CREDIT,int64,2923,0.0
CREDIT_DAY_OVERDUE,int64,942,0.0
DAYS_CREDIT_ENDDATE,float64,14097,6.149573416420613
DAYS_ENDDATE_FACT,float64,2918,36.916957775100386
AMT_CREDIT_MAX_OVERDUE,float64,68252,65.51326359159837
CNT_CREDIT_PROLONG,int64,10,0.0
AMT_CREDIT_SUM,float64,236709,0.0007573868522303295
AMT_CREDIT_SUM_DEBT,float64,226538,15.011931755948982
AMT_CREDIT_SUM_LIMIT,float64,51727,34.47741472406649
AMT_CREDIT_SUM_OVERDUE,float64,1616,0.0
CREDIT_TYPE,object,15,0.0
DAYS_CREDIT_UPDATE,int64,2982,0.0
AMT_ANNUITY,float64,40322,71.4734902949614
