,dtype,unique num,null %
SK_ID_PREV,int64,104307,0.0
SK_ID_CURR,int64,103558,0.0
MONTHS_BALANCE,int64,96,0.0
AMT_BALANCE,float64,1347904,0.0
AMT_CREDIT_LIMIT_ACTUAL,int64,181,0.0
AMT_DRAWINGS_ATM_CURRENT,float64,2268,19.52487193748841
AMT_DRAWINGS_CURRENT,float64,187005,0.0
AMT_DRAWINGS_OTHER_CURRENT,float64,1833,19.52487193748841
AMT_DRAWINGS_POS_CURRENT,float64,168749,19.52487193748841
AMT_INST_MIN_REGULARITY,float64,312267,7.948208374736219
AMT_PAYMENT_CURRENT,float64,163210,19.998062657409086
AMT_PAYMENT_TOTAL_CURRENT,float64,182957,0.0
AMT_RECEIVABLE_PRINCIPAL,float64,1195839,0.0
AMT_RECIVABLE,float64,1338878,0.0
AMT_TOTAL_RECEIVABLE,float64,1339008,0.0
CNT_DRAWINGS_ATM_CURRENT,float64,45,19.52487193748841
CNT_DRAWINGS_CURRENT,int64,129,0.0
CNT_DRAWINGS_OTHER_CURRENT,float64,12,19.52487193748841
CNT_DRAWINGS_POS_CURRENT,float64,134,19.52487193748841
CNT_INSTALMENT_MATURE_CUM,float64,122,7.948208374736219
NAME_CONTRACT_STATUS,object,7,0.0
SK_DPD,int64,917,0.0
SK_DPD_DEF,int64,378,0.0
