,dtype,unique num,null %
SK_ID_PREV,int64,997752,0.0
SK_ID_CURR,int64,339587,0.0
NUM_INSTALMENT_VERSION,float64,65,0.0
NUM_INSTALMENT_NUMBER,int64,277,0.0
DAYS_INSTALMENT,float64,2922,0.0
DAYS_ENTRY_PAYMENT,float64,3040,0.02135181462126695
AMT_INSTALMENT,float64,902539,0.0
AMT_PAYMENT,float64,944236,0.02135181462126695
