{
	"database": {
		"host": "ds237337.mlab.com",
		"username": "root",
		"password": "jlpn63",
		"port": 37337,
		"name": "projet_monitoring",
		"options": ""
	},

	"cookieSecret": "MonitorDing2019!",

	"https": {
		"run": false,
		"key": "",
		"cert": "",
		"port": 8443
	},

	"http": {
		"force": false,
		"port": 8080
	},

	"user": {
		"username": {
			"field": "username",
			"unique": true,
			"queryFields": ["username", "email"],
			"caseInsensitive": false,
			"lowerCase": false
		},
		"password": {
			"saltLength": 32,
			"iterations": 25000,
			"keyLength": 512,
			"encoding": "hex",
			"digestAlgorithm": "sha256",
			"formField": "password",
			"hashField": "hash",
			"saltField": "salt"
		},
		"limitAttempts": {
			"active": true,
			"attemptsField": "loginAttempts",
			"interval": 100,
			"maxInterval": 300000,
			"maxAttempts": 8
		},
		"lastLoginField": "lastLogin",
		"selectFields": null,
		"populateFields": "",
		"errors": {
			"missingPassword": "How about giving us a password?",
			"attemptTooSoon": "Slow down! Your account is locked for the moment..    . Try again later",
			"tooManyAttempts": "You've failed too many times... Your account have     been locked",
			"noSaltValueStored": "Couldn't find your password salt... Impossible     to log you in",
			"incorrectPassword": "This password isn't yours",
			"passwordTooShort": "You need at least 4 characters in your password"    ,
			"incorrectUsername": "That's probably not your username",
			"missingUsername": "Do you really think we will let you in without us    ername?",
			"missingEmail": "We need a way to contact you, fill the email address     input",
			"userExists": "Sorry, that can't be your username... We already have     it",
			"emailExists": "I think you already have an account, we already have     that email address",
			"alreadyLoggedIn": "You are already connected...",
			"notLoggedIn": "You need to log in to see this page...",
			"notAdmin": "You cannot access to that address..."
		}
	}
}


