   46  find . -maxdepth 1 -type f | while read LINE ; do line=$(func () { local line=$(echo $LINE | sed 's/\s( PDFDrive )//'));mv $LINE $line }; done
   47  find . -maxdepth 1 -type f | while read LINE ; do line=$(func () { local line=$(echo $LINE | sed 's/\s( PDFDrive )//'});mv $LINE $line ; done
;
   48  find . -maxdepth 1 -type f | while read LINE ; do line=$(func () { local line=$(echo $LINE | sed 's/\s( PDFDrive )//';mv $LINE $line}) ; done
;
;
   49  find . -maxdepth 1 -type f | while read LINE ; do line=$(func () { local line=$(echo $LINE | sed 's/\s( PDFDrive )//';mv $LINE $line}) ; done
   50  find . -maxdepth 1 -type f | while read LINE | sed 's/\s( PDFDrive )//'; done
   51  find . -maxdepth 1 -type f | while read LINE; do echo $LINE | sed 's/\s( PDFDrive )//'; done
   52  find . -maxdepth 1 -type f | while read LINE; do echo $LINE | sed 's/\s( PDFDrive )//'; done > ./newfile.txt

